{"text_format":"1","workbook":"xlsx","n_sheets":13,"sheets":["Inputs","Trucks","Output","Calc2","Calc1","Performance","TBD - Li-Ion Chargers"," Maintenance","Devlogs","TBD - ECBTrucks","Sheet4","Sheet1","Sheet2"],"not_rendered":{"charts":5,"images":5,"macros":1,"external_links":0,"defined_names":27,"comments":1,"pivot_tables":0},"unopened":[],"bounds":{"document_bytes":16777216,"sheet_cells":100000,"rows_first":2000,"rows_last":500,"rows_between":2000,"halvings":0,"cell_chars":16384,"cell_head_chars":4096},"cells_cut":0,"cells_raw":0,"read":"whole","date_system":"1900"}

{"sheet":"Inputs","index":0,"n_rows":117,"n_cols":14,"rows_kept":117,"cut":false,"hidden":false,"merged":[[128,2,139,7],[24,1,24,14],[0,2,0,11],[1,1,1,14],[35,1,35,14],[53,1,53,14],[62,1,62,14],[81,1,81,14],[93,1,93,14],[116,1,116,14],[66,7,67,14],[17,9,18,13],[83,9,86,13]]}
[null,null,"\nNot for Further Distribution\n\nDo not use if training has not been received or the tutorial available in the Help Section has not been read, as improper use could lead to miscalculation.\n\n\nTotal Cost of Ownership (TCO) Comparison Tool\n1.5-5.5t Internal Combustion Engine (ICE) and Electric Counterbalance Trucks\n\n\n\n\n"]
[null,"Application and Daily Schedule"]
[]
[null,null,null,null,"Start Time","07:00:00",null,"select"]
[]
[null,null,null,"Break 1",null,"Break 2",null,"Break 3",null,"Break 4",null,"Break 5",null,"Break 6"]
[null,null,"Break Start Time","10:00:00",null,"12:30:00",null,"15:00:00",null,"19:00:00",null,"21:00:00",null,"No Break"]
[null,null,"Break Duration (mins)",20,null,40,null,20,null,40,null,20,null,0]
[]
[null,null,null,"Break 7",null,"Break 8",null,"Break 9",null,"Break 10",null,"Break 11",null,"Break 12"]
[null,null,"Break Start Time","No Break",null,"No Break",null,"No Break",null,"No Break",null,"No Break",null,"No Break"]
[null,null,"Break Duration (mins)",0,null,0,null,0,null,0,null,0,null,0]
[]
[null,null,null,"Break 13",null,"Break 14",null,"Break 15",null,"Break 16",null,"Break 17",null,"Break 18"]
[null,null,"Break Start Time","No Break",null,"No Break",null,"No Break",null,"No Break",null,"No Break",null,"No Break"]
{"$rows_left_out":103}
{"sheet":"Trucks","index":1,"n_rows":293,"n_cols":18,"rows_kept":293,"cut":false,"hidden":true,"merged":[]}
["Table A: ICE Trucks"]
[]
[]
[null,"Truck Model                                       (write exactly as you wish the names to appear to the user) - write each truck model only once","Fuel","Engine","Transmision","VDI","Tank Size","ModelD","FuelD","EngineD","TransmisionD","VDI","Tank",null,"Selected model","Selected Fuel","Selected Engine","Selected transmision"]
[null,"Select","Select","Select","Select",0,0,{"$f":"IFERROR(INDEX(ICTrucks,MATCH(0,COUNTIF($H$4:H4,ICTrucks),0)),\"\")","v":"Select"},{"$f":"IFERROR(INDEX(ICFuels,MATCH(0,COUNTIF($I$4:I4,ICFuels)+(ICTrucks<>$O$5),0)),\"\")","v":"LPG"},{"$f":"IFERROR(INDEX(ICEngines,MATCH(0,COUNTIF($J$4:J4,ICEngines)+(ICFuels<>$P$5)+(ICTrucks<>$O$5),0)),\"\")","v":"2.6L - Yanmar"},{"$f":"IFERROR(INDEX(ICTransmisions,MATCH(0,COUNTIF($K$4:K4,ICTransmisions)+(ICEngines<>$Q$5)+(ICFuels<>$P$5)+(ICTrucks<>$O$5),0)),\"\")","v":"1-Speed Basic "},{"$f":"IFERROR(INDEX(ICVDI,MATCH(0,COUNTIF($L$4:L4,ICVDI)+(ICTransmisions<>$R$5)+(ICEngines<>$Q$5)+(ICFuels<>$P$5)+(ICTrucks<>$O$5),0)),\"\")","v":"2,6"},{"$f":"IFERROR(INDEX(ICTank,MATCH(0,COUNTIF($M$4:M4,ICTank)+(ICTransmisions<>$R$5)+(ICEngines<>$Q$5)+(ICFuels<>$P$5)+(ICTrucks<>$O$5),0)),\"\")","v":52},null,{"$f":"Inputs!F38","v":"H2.5FT"},{"$f":"Inputs!F39","v":"Diesel"},{"$f":"Inputs!F40","v":"2.4L - Kubota "},{"$f":"Inputs!F41","v":"1-Speed Basic "}]
[null,"H1.6FT","LPG","2.0L PSI","1-Speed","2,35",0,{"$f":"IFERROR(INDEX(ICTrucks,MATCH(0,COUNTIF($H$4:H5,ICTrucks),0)),\"\")","v":"H1.6FT"},{"$f":"IFERROR(INDEX(ICFuels,MATCH(0,COUNTIF($I$4:I5,ICFuels)+(ICTrucks<>$O$5),0)),\"\")","v":"Diesel"},{"$f":"IFERROR(INDEX(ICEngines,MATCH(0,COUNTIF($J$4:J5,ICEngines)+(ICFuels<>$P$5)+(ICTrucks<>$O$5),0)),\"\")","v":"3.3L - Yanmar"},{"$f":"IFERROR(INDEX(ICTransmisions,MATCH(0,COUNTIF($K$4:K5,ICTransmisions)+(ICEngines<>$Q$5)+(ICFuels<>$P$5)+(ICTrucks<>$O$5),0)),\"\")","v":"2-Speed Basic "}]
[null,"H1.8FT","LPG","2.0L PSI","1-Speed","2,42",0,{"$f":"IFERROR(INDEX(ICTrucks,MATCH(0,COUNTIF($H$4:H6,ICTrucks),0)),\"\")","v":"H1.8FT"},{"$f":"IFERROR(INDEX(ICFuels,MATCH(0,COUNTIF($I$4:I6,ICFuels)+(ICTrucks<>$O$5),0)),\"\")","v":""},{"$f":"IFERROR(INDEX(ICEngines,MATCH(0,COUNTIF($J$4:J6,ICEngines)+(ICFuels<>$P$5)+(ICTrucks<>$O$5),0)),\"\")","v":"2.4L - Kubota "},{"$f":"IFERROR(INDEX(ICTransmisions,MATCH(0,COUNTIF($K$4:K6,ICTransmisions)+(ICEngines<>$Q$5)+(ICFuels<>$P$5)+(ICTrucks<>$O$5),0)),\"\")","v":""}]
[null,"H2.0FT","LPG","2.4L PSI","1-Speed Basic","2,5",0,{"$f":"IFERROR(INDEX(ICTrucks,MATCH(0,COUNTIF($H$4:H7,ICTrucks),0)),\"\")","v":"H2.0FT"},{"$f":"IFERROR(INDEX(ICFuels,MATCH(0,COUNTIF($I$4:I7,ICFuels)+(ICTrucks<>$O$5),0)),\"\")","v":""},{"$f":"IFERROR(INDEX(ICEngines,MATCH(0,COUNTIF($J$4:J7,ICEngines)+(ICFuels<>$P$5)+(ICTrucks<>$O$5),0)),\"\")","v":""},{"$f":"IFERROR(INDEX(ICTransmisions,MATCH(0,COUNTIF($K$4:K7,ICTransmisions)+(ICEngines<>$Q$5)+(ICFuels<>$P$5)+(ICTrucks<>$O$5),0)),\"\")","v":""}]
[null,"H2.0FT","LPG","2.4L PSI","1-Speed Duramatch","2,5",0,{"$f":"IFERROR(INDEX(ICTrucks,MATCH(0,COUNTIF($H$4:H8,ICTrucks),0)),\"\")","v":"H2.5FT"},{"$f":"IFERROR(INDEX(ICFuels,MATCH(0,COUNTIF($I$4:I8,ICFuels)+(ICTrucks<>$O$5),0)),\"\")","v":""},{"$f":"IFERROR(INDEX(ICEngines,MATCH(0,COUNTIF($J$4:J8,ICEngines)+(ICFuels<>$P$5)+(ICTrucks<>$O$5),0)),\"\")","v":""},{"$f":"IFERROR(INDEX(ICTransmisions,MATCH(0,COUNTIF($K$4:K8,ICTransmisions)+(ICEngines<>$Q$5)+(ICFuels<>$P$5)+(ICTrucks<>$O$5),0)),\"\")","v":""}]
[null,"H2.0FT","LPG","2.5L Kubota","1-Speed Basic","2,6",0,{"$f":"IFERROR(INDEX(ICTrucks,MATCH(0,COUNTIF($H$4:H9,ICTrucks),0)),\"\")","v":"H3.0FT"},{"$f":"IFERROR(INDEX(ICFuels,MATCH(0,COUNTIF($I$4:I9,ICFuels)+(ICTrucks<>$O$5),0)),\"\")","v":""},{"$f":"IFERROR(INDEX(ICEngines,MATCH(0,COUNTIF($J$4:J9,ICEngines)+(ICFuels<>$P$5)+(ICTrucks<>$O$5),0)),\"\")","v":""},{"$f":"IFERROR(INDEX(ICTransmisions,MATCH(0,COUNTIF($K$4:K9,ICTransmisions)+(ICEngines<>$Q$5)+(ICFuels<>$P$5)+(ICTrucks<>$O$5),0)),\"\")","v":""}]
[null,"H2.0FT","LPG","2.5L Kubota","2-Speed Duramatch 2","2,7",0,{"$f":"IFERROR(INDEX(ICTrucks,MATCH(0,COUNTIF($H$4:H10,ICTrucks),0)),\"\")","v":"H3.5FT"},{"$f":"IFERROR(INDEX(ICFuels,MATCH(0,COUNTIF($I$4:I10,ICFuels)+(ICTrucks<>$O$5),0)),\"\")","v":""},{"$f":"IFERROR(INDEX(ICEngines,MATCH(0,COUNTIF($J$4:J10,ICEngines)+(ICFuels<>$P$5)+(ICTrucks<>$O$5),0)),\"\")","v":""},{"$f":"IFERROR(INDEX(ICTransmisions,MATCH(0,COUNTIF($K$4:K10,ICTransmisions)+(ICEngines<>$Q$5)+(ICFuels<>$P$5)+(ICTrucks<>$O$5),0)),\"\")","v":""}]
[null,"H2.5FT","LPG","2.4L - PSI","1-Speed Basic ","2,7",0,{"$f":"IFERROR(INDEX(ICTrucks,MATCH(0,COUNTIF($H$4:H11,ICTrucks),0)),\"\")","v":"H2.0XT"},{"$f":"IFERROR(INDEX(ICFuels,MATCH(0,COUNTIF($I$4:I11,ICFuels)+(ICTrucks<>$O$5),0)),\"\")","v":""},{"$f":"IFERROR(INDEX(ICEngines,MATCH(0,COUNTIF($J$4:J11,ICEngines)+(ICFuels<>$P$5)+(ICTrucks<>$O$5),0)),\"\")","v":""},{"$f":"IFERROR(INDEX(ICTransmisions,MATCH(0,COUNTIF($K$4:K11,ICTransmisions)+(ICEngines<>$Q$5)+(ICFuels<>$P$5)+(ICTrucks<>$O$5),0)),\"\")","v":""}]
[null,"H2.5FT","Diesel","2.6L - Yanmar","1-Speed Basic ",3,52,{"$f":"IFERROR(INDEX(ICTrucks,MATCH(0,COUNTIF($H$4:H12,ICTrucks),0)),\"\")","v":"H2.5XT"},{"$f":"IFERROR(INDEX(ICFuels,MATCH(0,COUNTIF($I$4:I12,ICFuels)+(ICTrucks<>$O$5),0)),\"\")","v":""},{"$f":"IFERROR(INDEX(ICEngines,MATCH(0,COUNTIF($J$4:J12,ICEngines)+(ICFuels<>$P$5)+(ICTrucks<>$O$5),0)),\"\")","v":""},{"$f":"IFERROR(INDEX(ICTransmisions,MATCH(0,COUNTIF($K$4:K12,ICTransmisions)+(ICEngines<>$Q$5)+(ICFuels<>$P$5)+(ICTrucks<>$O$5),0)),\"\")","v":""}]
[null,"H2.5FT","Diesel","3.3L - Yanmar","1-Speed Basic ","3,3",52,{"$f":"IFERROR(INDEX(ICTrucks,MATCH(0,COUNTIF($H$4:H13,ICTrucks),0)),\"\")","v":"H3.0XT"},{"$f":"IFERROR(INDEX(ICFuels,MATCH(0,COUNTIF($I$4:I13,ICFuels)+(ICTrucks<>$O$5),0)),\"\")","v":""},{"$f":"IFERROR(INDEX(ICEngines,MATCH(0,COUNTIF($J$4:J13,ICEngines)+(ICFuels<>$P$5)+(ICTrucks<>$O$5),0)),\"\")","v":""},{"$f":"IFERROR(INDEX(ICTransmisions,MATCH(0,COUNTIF($K$4:K13,ICTransmisions)+(ICEngines<>$Q$5)+(ICFuels<>$P$5)+(ICTrucks<>$O$5),0)),\"\")","v":""}]
[null,"H2.5FT","Diesel","2.4L - Kubota ","1-Speed Basic ","2,6",52,{"$f":"IFERROR(INDEX(ICTrucks,MATCH(0,COUNTIF($H$4:H14,ICTrucks),0)),\"\")","v":"H4.0FT"},{"$f":"IFERROR(INDEX(ICFuels,MATCH(0,COUNTIF($I$4:I14,ICFuels)+(ICTrucks<>$O$5),0)),\"\")","v":""},{"$f":"IFERROR(INDEX(ICEngines,MATCH(0,COUNTIF($J$4:J14,ICEngines)+(ICFuels<>$P$5)+(ICTrucks<>$O$5),0)),\"\")","v":""},{"$f":"IFERROR(INDEX(ICTransmisions,MATCH(0,COUNTIF($K$4:K14,ICTransmisions)+(ICEngines<>$Q$5)+(ICFuels<>$P$5)+(ICTrucks<>$O$5),0)),\"\")","v":""}]
{"$rows_left_out":279}
{"sheet":"Output","index":2,"n_rows":251,"n_cols":8,"rows_kept":251,"cut":false,"hidden":false,"merged":[[240,1,250,5],[150,1,151,1],[150,3,150,5],[12,2,12,3],[25,2,25,3],[37,2,37,3],[58,2,58,3],[37,1,38,1],[66,2,66,3],[12,1,13,1],[25,1,26,1],[58,1,59,1],[66,1,67,1]]}
[]
[null,{"$f":"\"TCO Comparison Tool Counterbalance Output Page \"&TEXT(TODAY(),\"dd-mmm-yy\")","v":"TCO Comparison Tool Counterbalance Output Page 31-Mar-20"}]
[]
[]
[]
[null,"ICE Truck Model",{"$f":"Inputs!F38","v":"H2.5FT"}]
[null,"Electric Truck Model",{"$f":"Inputs!F56","v":"J2.5XN"}]
[null,"Fleet Size",{"$f":"Inputs!F27","v":10}]
[null,"Truck Hours per Year ",{"$f":"Inputs!F21","v":3000}]
[]
[null,"Initial Investment (Fleet)"]
[]
[null,"Initial Investment","Electric",null,"ER CB","ICE"]
[null,null,"Lead Acid","Li-Ion","Fuel Cell",{"$f":"Inputs!F39","v":"Diesel"}]
[null,"Truck/s",{"$f":"Calc1!D75","v":337000},{"$f":"Calc1!E75","v":337000},{"$f":"Calc1!F75","v":337000},{"$f":"Calc1!G75","v":360000}]
{"$rows_left_out":237}
{"sheet":"Calc2","index":3,"n_rows":168,"n_cols":101,"rows_kept":168,"cut":false,"hidden":true,"merged":[]}
[null,"Calculation"]
[null,"Driven from input (Adjustable)"]
[null,"Adjustable  Only to selected users"]
[]
[null,"Application"]
[null,"Weeks per year",48]
[null,"Voltage of truck",{"$f":"VLOOKUP(Inputs!F56,Trucks!B78:D97,2,FALSE)","v":80}]
[null,"RecommendedVDI",{"$f":"VLOOKUP(Inputs!F56,Trucks!B78:D97,3,FALSE)","v":"7,9"}]
[null,"recommended idle time",20]
[null,"DEFAULT values ( Not used unless se;ection on input page not used)"]
[null,"Cost electricity (€/kWh)",0.12]
[null,"Dsl Default Value",1]
[null,"LPG Default value",0.7]
[null,"Cost H2 (€/kg)",{"$f":"Inputs!F33","v":3}]
[null,"Hourly Rate Driver",30]
{"$rows_left_out":154}
{"sheet":"Calc1","index":4,"n_rows":166,"n_cols":37,"rows_kept":166,"cut":false,"hidden":true,"merged":[[10,32,10,36],[14,19,14,21],[11,2,11,6],[97,9,129,9],[14,23,14,25],[14,26,14,28],[11,35,11,36]]}
[]
[null,null,"Operating hours per annum (decimal)",{"$f":"(Calc1!D5*Inputs!F20*Calc2!C6)","v":3279.9999999999982},"(hrs/day)x(days/week)x(weeks/year)"]
[null,null,"Estimated idle time %",{"$f":"(1-Inputs!F21/(Calc1!D5*Inputs!F20*Calc2!C6))","v":8.5365853658536106E-2}]
[null,null,"Charging time per day",{"$f":"O60","v":"10:20:00"}]
[null,null,"Operating hours per day (decimal)",{"$f":"O59*24","v":13.666666666666661}]
[null,null,"Break Hours per day (decimal)",{"$f":"O62*24","v":2.3333333333333339}]
[null,null,"Number of breaks ",{"$f":"COUNT(M19,M22,M24,M26,M28,M30,M32,M34,M36,M38,M40,M42,M44,M47,M49,M51,M53,M55)","v":5}]
[]
[]
[null,null,null,"Lead Acid","Lithium ion","Fuel Cell","ICE",null,null,null,null,"LI-ion Energy useage based on shift patterns"]
[null,null,null,null,null,null,null,null,null,null,null,null,null,null,null,null,null,null,null,null,null,null,null,null,null,null,null,null,null,null,null,null,"Graph"]
[null,null,"Energy Cost PA/Truck",null,null,null,null,null,null,null,null,null,"Availiable Capacity (kWh)",{"$f":"E22","v":39.167999999999999},null,null,null,null,"battery balancing time SOC threshold  (%)",{"$f":"Calc2!C132","v":80},null,null,null,null,null,null,null,null,null,null,null,null,"Period end","SOC (kWh)","SOC (%)","DOD line"]
[null,null,null,null,null,null,null,null,null,null,null,null,"consumption rate (kWh/h)",{"$f":"E28","v":7.1890000000000009},null,null,null,null,"battery balancing time SOC threshold (kWh))",{"$f":"T12/100*N12","v":31.334400000000002},null,{"$f":"Calc2!C133","v":20},"added mins for balancing",null,null,null,null,null,null,null,null,null,{"$f":"AB17","v":"07:00:00"},{"$f":"AC17","v":39.167999999999999},{"$f":"AH13/$N$12","v":1}]
[null,null,"Voltage",{"$f":"VLOOKUP(Inputs!F56,Trucks!B78:C97,2,FALSE)","v":80},{"$f":"VLOOKUP(D14,Trucks!B237:C243,2,FALSE)","v":76.8},null,null,null,null,null,null,null,"charge rate (kWh/h)",{"$f":"E19","v":38.4},null,null,null,null,"Charge rate during balancing (kWh/h)",{"$f":"(N12-T13)/(((N12-T13)/N14)+V13/60)","v":14.578660049627789},null,null,null,null,null,null,null,null,null,null,null,"discharge",{"$f":"AB18","v":"10:00:00"},{"$f":"AC18","v":17.600999999999996},0.44937193627450972,{"$f":"AG13","v":"07:00:00"},{"$f":"R61","v":0.04}]
[null,null,"Battery Capacity (Ah)",{"$f":"Inputs!F65","v":770},{"$f":"Inputs!F84","v":600},null,null,null,null,null,null,null,null,null,null,null,null,null,null,null,null,null,null,null,null,null,null,null,null,null,null,null,{"$f":"U19","v":"10:20:00"},{"$f":"V19","v":30.401000000000003},0.77616932189542498,{"$f":"AG87","v":"23:48:57.772"},{"$f":"AK14","v":0.04}]
{"$rows_left_out":152}
{"sheet":"Performance","index":5,"n_rows":12,"n_cols":13,"rows_kept":12,"cut":false,"hidden":true,"merged":[]}
[]
[]
[]
[null,null,null,null,null,null,null,null,null,null,"Select Hip","Yes","No"]
[null,null,null,null,null,null,null,null,null,null,"Energency Increase ",1.1499999999999999,1]
[null,null,null,null,null,null,null,null,null,null,"Performance increase",1.05,1]
[]
[]
[]
["Select Hip","Yes","No"]
["Energency Increase ",1,1]
["Performance increase",1,1]

{"sheet":"TBD - Li-Ion Chargers","index":6,"n_rows":36,"n_cols":20,"rows_kept":36,"cut":false,"hidden":true,"merged":[[1,1,37,1],[1,2,4,2],[1,9,3,9],[1,10,3,10],[36,2,36,19],[37,2,37,19],[1,12,2,16],[1,17,2,18],[1,19,3,19],[3,3,3,5],[4,3,4,5]]}
[]
[null,"IP 54 MODELS","Type","Output",null,null,null,null,null,"Phase Current","Max Input Power","Input Protection","Housing Dimensions",null,null,null,null,"Mandatory Space",null,"Weight"]
[null,null,null,null,null,null,null,null,null,null,null,"Breaker Curve [D]"]
[null,null,null,"U Range",null,null,null,"I max","Pout max",null,null,"Input Fuse gG Type","L","W","H","D","E","M","S"]
[null,null,null,"V",null,null,"V","A","kW","A (±10%)","kVA","Rated AMP (1)","mm","mm","mm","mm","mm","mm","mm","kg"]
[null,null,"HE Li-Ion 0-A M*",6,null,33,24,60,"1,7",8.3000000000000007,2,15,171,111,420,425,70,null,100,5]
[null,null,"HE Li-Ion 1-A M IP54* ",6,"-",33,24,100,"2,9",13.7,3.2,25,410,234,716,582,243,150,150,26]
[null,null,"HE Li-Ion 1-B M IP54* ",18,"-",70,24,70,"3,2",15.1,3.5,40,410,234,716,582,243,150,150,26]
[null,null,"HE Li-Ion 1-B2 M IP54* ",18,"-",70,24,140,"5,8",30,7,25,410,234,716,582,243,150,150,46]
[null,null,"HE Li-Ion 3-A 24 T IP54*",6,"-",33,24,150,"4,3",7.2,5,10,410,234,716,582,243,150,150,42]
[null,null,"HE Li-Ion 12/24-200 T IP54 ",6,"-",33,24,200,"5,8",9.4,6.5,15,487,555,1001,582,243,150,150,165]
[null,null,"HE Li-Ion 12/24-250 T IP54 ",6,"-",33,24,250,"7,2",11.8,8.1999999999999993,20,487,555,1001,"-","-",150,460,185]
[null,null,"HE Li-Ion 12/24-320 T IP54 ",6,"-",33,24,320,"9,2",15.1,10.4,25,811,503,1801,"-","-",150,460,365]
[null,null,"HE Li-Ion 12/24-500 T IP54 ",6,"-",33,24,500,"14,4",23.6,16.3,40,811,503,1801,"-","-",150,460,400]
[null,null,"HE Li-Ion 0-B M*",30,null,70,48,40,"1,7",8.3000000000000007,2,15,171,111,420,425,70,null,100,5]
{"$rows_left_out":22}
{"sheet":" Maintenance","index":7,"n_rows":35,"n_cols":16,"rows_kept":35,"cut":false,"hidden":true,"merged":[]}
[null,null,null,null,null,null,null,null,null,null,null,null,null,null,"Euro/GBP",1.1299999999999999]
[null,"Battery Maintence"]
[]
[]
[]
[]
[]
[]
[]
[]
[]
[null,null,null,null,null,null,null,null,null,null,null,"Topping up charge per visit Pro rata £16/battery every 4 weeks = £192 (211 Euro )"]
[null,null,null,null,null,null,null,null,null,null,null,"Battery Cleaning Annual £150 (165Euro)"]
[null,null,null,null,null,null,null,null,null,null,null,"Charger Clean and service £244 (268Euro)"]
[]
{"$rows_left_out":21}
{"sheet":"Devlogs","index":8,"n_rows":26,"n_cols":5,"rows_kept":26,"cut":false,"hidden":true,"merged":[]}
[]
[null,null,"Not included "]
[]
[null,null,null,"Incentives/benefits removed for EU version - note added to output page"]
[null,null,null,"Note we have not included productivity in this model (Hip/Eco disabled)"]
[null,null,null,"We have no EOL disposal costs"]
[null,null,null,"Fuel cell rebuild"]
[]
[]
[null,null,"We have included "]
[null,null,null,"Depreciation value added to the over all costs","Matt to confirm value"]
[null,null,null,"Battery degrogation","Nominal value added spread over 5 year"]
[null,null,null,"Payback time"]
[null,null,null,"Service rates"]
[null,null,null,"Carbon Emission"]
{"$rows_left_out":12}
{"sheet":"TBD - ECBTrucks","index":9,"n_rows":30,"n_cols":5,"rows_kept":30,"cut":false,"hidden":true,"merged":[]}
["eModel","eVDI","Voltage","Hyster","Yale"]
["J1.5XNT_SWB",3.9,48,"J1.5XNT SWB","ERP15VT SWB"]
["J1.6XN_LWB",4.5,48,"J1.6XN LWB","ERP16VF LWB"]
["J1.6XN_MWB",4.4000000000000004,48,"J1.6XN MWB","ERP16VF MWB"]
["J1.6XNT_LWB",4.2,48,"J1.6XNT LWB","ERP16VT LWB"]
["J1.6XNT_MWB",4.2,48,"J1.6XNT MWB","ERP16VT MWB"]
["J1.6XNT_SWB",4.2,48,"J1.6XNT SWB","ERP16VT SWB"]
["J1.8XN_LWB",5,48,"J1.8XN LWB","ERP18VF LWB"]
["J1.8XN_MWB",5,48,"J1.8XN MWB","ERP18VF MWB"]
["J1.8XNT_LWB",4.7,48,"J1.8XNT LWB","ERP18VT LWB"]
["J1.8XNT_MWB",4.7,48,"J1.8XNT MWB","ERP18VT MWB"]
["J2.0XN_LWB",5.5,48,"J2.0XN LWB","ERP20VF LWB"]
["J2.0XN_MWB",5.5,48,"J2.0XN MWB","ERP20VF MWB"]
["J2.0XNT_LWB",5.2,48,"J2.0XNT LWB","ERP20VT LWB"]
["J2.0XNT_MWB",5.5,48,"J2.0XNT MWB","ERP20VT MWB"]
{"$rows_left_out":16}
{"sheet":"Sheet4","index":10,"n_rows":30,"n_cols":3,"rows_kept":30,"cut":false,"hidden":true,"merged":[]}
["Select","Select","VDI"]
["J1.5XNT_SWB 3-whl",48,3.9]
["J1.6XNT_SWB 3-whl",48,4.2]
["J1.6XNT_MWB 3-whl",48,4.2]
["J1.6XNT_LWB 3-whl",48,4.2]
["J1.6XN_MWB 4-whl",48,4.4000000000000004]
["J1.6XN_LWB 4-whl",48,4.5]
["J1.8XNT_MWB 3-whl",48,4.7]
["J1.8XNT_LWB 3-whl",48,4.7]
["J1.8XN_MWB 4-whl",48,5]
["J1.8XN_LWB 4-whl",48,5]
["J2.0XNT_MWB 3-whl",48,5.5]
["J2.0XNT_LWB 3-whl",48,5.2]
["J2.0XN_LWB 4-whl",48,5.5]
[]
{"$rows_left_out":16}
{"sheet":"Sheet1","index":11,"n_rows":0,"n_cols":0,"rows_kept":0,"cut":false,"hidden":true,"merged":[]}

{"sheet":"Sheet2","index":12,"n_rows":0,"n_cols":0,"rows_kept":0,"cut":false,"hidden":true,"merged":[]}