{"text_format":"1","workbook":"xlsx","n_sheets":9,"sheets":["Calculator","Trans","Specs","Log","Variables","Light-Medium-Heavy Duty","Application Factors","Validation data","PRJ2106"],"not_rendered":{"charts":0,"images":11,"macros":1,"external_links":1,"defined_names":117,"comments":1,"pivot_tables":0},"unopened":[],"bounds":{"document_bytes":16777216,"sheet_cells":100000,"rows_first":2000,"rows_last":500,"rows_between":2000,"halvings":0,"cell_chars":16384,"cell_head_chars":4096},"cells_cut":0,"cells_raw":0,"read":"whole","date_system":"1900"}

{"sheet":"Calculator","index":0,"n_rows":67,"n_cols":22,"rows_kept":67,"cut":false,"hidden":false,"merged":[[27,12,33,12],[27,13,33,13],[27,14,33,14],[27,15,33,15],[27,16,33,16],[20,12,26,12],[20,13,26,13],[20,14,26,14],[20,15,26,15],[20,16,26,16],[10,12,19,12],[10,13,19,13],[10,14,19,14],[10,15,19,15],[10,16,19,16],[2,14,2,16],[3,14,4,14],[3,15,4,15],[3,16,4,16],[5,14,9,14],[5,15,9,15],[5,16,9,16],[55,1,55,3],[43,1,43,3],[39,1,39,3],[34,1,34,3],[6,1,6,3],[40,12,40,16],[41,12,53,16],[1,12,1,16],[65,1,65,3],[66,1,74,3],[2,12,7,13],[8,12,9,13],[1,1,1,3],[57,12,57,16],[58,12,60,13],[58,14,58,16],[60,14,61,14],[60,15,61,15],[60,16,61,16],[61,12,61,13],[2,1,2,3]]}
[]
[null,{"$f":"IF($C$5=Trans!$A$6,Trans!A7, IF($C$5=Trans!$B$6,Trans!B7, IF($C$5=Trans!$C$6,Trans!C7, IF($C$5=Trans!$D$6,Trans!D7,Trans!E7))))","v":"Bleisäurebatterie"},null,null,null,null,null,null,null,null,null,null,{"$f":"IF($C$5=Trans!$A$6,Trans!A86, IF($C$5=Trans!$B$6,Trans!B86, IF($C$5=Trans!$C$6,Trans!C86, IF($C$5=Trans!$D$6,Trans!D86,Trans!E86))))","v":"Anwendungsmatrix"}]
[null,{"$f":"IF($C$5=Trans!$A$6,Trans!A8, IF($C$5=Trans!$B$6,Trans!B8, IF($C$5=Trans!$C$6,Trans!C8, IF($C$5=Trans!$D$6,Trans!D8,Trans!E8))))","v":"Leitfaden zur Verlängerung der Batterielebensdauer"},null,null,null,null,null,null,null,null,null,null,{"$f":"IF($C$5=Trans!$A$6,Trans!A87, IF($C$5=Trans!$B$6,Trans!B87, IF($C$5=Trans!$C$6,Trans!C87, IF($C$5=Trans!$D$6,Trans!D87,Trans!E87))))","v":"In den Matrixkriterien „Arbeitszyklus“ und im Rechner „Ergebnis“ wählen."},null,{"$f":"IF($C$5=Trans!$A$6,Trans!A95, IF($C$5=Trans!$B$6,Trans!B95, IF($C$5=Trans!$C$6,Trans!C95, IF($C$5=Trans!$D$6,Trans!D95,Trans!E95))))","v":"WELCHE LASTEN WERDEN BEFÖRDERT?"}]
[null,null,null,null,null,null,null,null,null,null,null,null,null,null,{"$f":"IF($C$5=Trans!$A$6,Trans!A96, IF($C$5=Trans!$B$6,Trans!B96, IF($C$5=Trans!$C$6,Trans!C96, IF($C$5=Trans!$D$6,Trans!D96,Trans!E96))))","v":"Normalerweise leichte Lasten"},{"$f":"IF($C$5=Trans!$A$6,Trans!A97, IF($C$5=Trans!$B$6,Trans!B97, IF($C$5=Trans!$C$6,Trans!C97, IF($C$5=Trans!$D$6,Trans!D97,Trans!E97))))","v":"Leichte bis mittelschwere Lasten"},{"$f":"IF($C$5=Trans!$A$6,Trans!A98, IF($C$5=Trans!$B$6,Trans!B98, IF($C$5=Trans!$C$6,Trans!C98, IF($C$5=Trans!$D$6,Trans!D98,Trans!E98))))","v":"Maximallasten"}]
[null,null,"Deutsch"]
[null,null,null,null,null,null,null,null,null,null,null,null,null,null,{"$f":"IF($C$5=Trans!$A$6,Trans!A99, IF($C$5=Trans!$B$6,Trans!B99, IF($C$5=Trans!$C$6,Trans!C99, IF($C$5=Trans!$D$6,Trans!D99,Trans!E99))))","v":"Normalerweise weniger als 50 % der Maximallast – gelegentlich Maximallasten"},{"$f":"IF($C$5=Trans!$A$6,Trans!A100, IF($C$5=Trans!$B$6,Trans!B100, IF($C$5=Trans!$C$6,Trans!C100, IF($C$5=Trans!$D$6,Trans!D100,Trans!E100))))","v":"Normalerweise weniger als 75 % der Maximallast – gelegentlich Maximallasten"},{"$f":"IF($C$5=Trans!$A$6,Trans!A101, IF($C$5=Trans!$B$6,Trans!B101, IF($C$5=Trans!$C$6,Trans!C101, IF($C$5=Trans!$D$6,Trans!D101,Trans!E101))))","v":"Häufiges Handling von Lasten bei oder nahe der Maximallast"}]
[null,{"$f":"IF($C$5=Trans!$A$6,Trans!A10, IF($C$5=Trans!$B$6,Trans!B10, IF($C$5=Trans!$C$6,Trans!C10, IF($C$5=Trans!$D$6,Trans!D10,Trans!E10))))","v":"Auswahl Stapler, Batterie und Anwendung"}]
[]
[null,{"$f":"IF($C$5=Trans!$A$6,Trans!A11, IF($C$5=Trans!$B$6,Trans!B11, IF($C$5=Trans!$C$6,Trans!C11, IF($C$5=Trans!$D$6,Trans!D11,Trans!E11))))","v":"Stapler"},null,{"$f":"IF($C$5=Trans!$A$6,Trans!A32, IF($C$5=Trans!$B$6,Trans!B32, IF($C$5=Trans!$C$6,Trans!C32, IF($C$5=Trans!$D$6,Trans!D32,Trans!E32))))","v":"Auswahl"},null,null,null,"Truck",{"$f":"C9","v":0},"Select",null,null,{"$f":"IF($C$5=Trans!$A$6,Trans!A88, IF($C$5=Trans!$B$6,Trans!B88, IF($C$5=Trans!$C$6,Trans!C88, IF($C$5=Trans!$D$6,Trans!D88,Trans!E88))))","v":"FAHR- UND/ODER HYDRAULIKBETRIEB?"}]
[null,{"$f":"IF($C$5=Trans!$A$6,Trans!A13, IF($C$5=Trans!$B$6,Trans!B13, IF($C$5=Trans!$C$6,Trans!C13, IF($C$5=Trans!$D$6,Trans!D13,Trans!E13))))","v":"Batterie"},null,{"$f":"IF($C$5=Trans!$A$6,Trans!A33, IF($C$5=Trans!$B$6,Trans!B33, IF($C$5=Trans!$C$6,Trans!C33, IF($C$5=Trans!$D$6,Trans!D33,Trans!E33))))","v":"Auswahl (Präfix ND = nicht DIN)"},null,{"$f":"IF(C10=\"\", \"INC\", \"OK\")","v":"INC"},null,"Battery",{"$f":"C10","v":0},"Select (Prefix ND = Non DIN)"]
[null,null,null,null,null,null,null,null,null,null,null,null,{"$f":"IF($C$5=Trans!$A$6,Trans!A89, IF($C$5=Trans!$B$6,Trans!B89, IF($C$5=Trans!$C$6,Trans!C89, IF($C$5=Trans!$D$6,Trans!D89,Trans!E89))))","v":"Zumeist Stapeln und Beladen mit deutlich mehr Fahr- als Hydraulikbetrieb"},{"$f":"IF($C$5=Trans!$A$6,Trans!A92, IF($C$5=Trans!$B$6,Trans!B92, IF($C$5=Trans!$C$6,Trans!C92, IF($C$5=Trans!$D$6,Trans!D92,Trans!E92))))","v":"Handling und Stapeln in Bodennähe mit Hubhöhen unterhalb von 3 Metern"},{"$f":"IF($C$5=Trans!$A$6,Trans!A102, IF($C$5=Trans!$B$6,Trans!B102, IF($C$5=Trans!$C$6,Trans!C102, IF($C$5=Trans!$D$6,Trans!D102,Trans!E102))))","v":"LEICHTE BEANSPRUCHUNG"},{"$f":"IF($C$5=Trans!$A$6,Trans!A103, IF($C$5=Trans!$B$6,Trans!B103, IF($C$5=Trans!$C$6,Trans!C103, IF($C$5=Trans!$D$6,Trans!D103,Trans!E103))))","v":"MITTLERE BEANSPRUCHUNG"},{"$f":"IF($C$5=Trans!$A$6,Trans!A104, IF($C$5=Trans!$B$6,Trans!B104, IF($C$5=Trans!$C$6,Trans!C104, IF($C$5=Trans!$D$6,Trans!D104,Trans!E104))))","v":"STARKE BEANSPRUCHUNG"}]
[null,{"$f":"IF($C$5=Trans!$A$6,Trans!A111, IF($C$5=Trans!$B$6,Trans!B111, IF($C$5=Trans!$C$6,Trans!C111, IF($C$5=Trans!$D$6,Trans!D111,Trans!E111))))","v":"Betriebsstunden pro Tag"},null,{"$f":"IF($C$5=Trans!$A$6,Trans!A32, IF($C$5=Trans!$B$6,Trans!B32, IF($C$5=Trans!$C$6,Trans!C32, IF($C$5=Trans!$D$6,Trans!D32,Trans!E32))))","v":"Auswahl"}]
[null,{"$f":"IF($C$5=Trans!$A$6,Trans!A112, IF($C$5=Trans!$B$6,Trans!B112, IF($C$5=Trans!$C$6,Trans!C112, IF($C$5=Trans!$D$6,Trans!D112,Trans!E112))))","v":"Pausen- und Staplerstillstandzeiten (Stunden)"},null,{"$f":"IF($C$5=Trans!$A$6,Trans!A32, IF($C$5=Trans!$B$6,Trans!B32, IF($C$5=Trans!$C$6,Trans!C32, IF($C$5=Trans!$D$6,Trans!D32,Trans!E32))))","v":"Auswahl"}]
[null,{"$f":"IF($C$5=Trans!$A$6,Trans!A15, IF($C$5=Trans!$B$6,Trans!B15, IF($C$5=Trans!$C$6,Trans!C15, IF($C$5=Trans!$D$6,Trans!D15,Trans!E15))))","v":"Staplernutzung"},{"$f":"IFERROR((C12-C13)/C12,\"-\")","v":"-"},null,null,null,null,"Truck Utilisation / Shift",{"$f":"C14","v":"-"},"Select"]
[]
{"$rows_left_out":53}
{"sheet":"Trans","index":1,"n_rows":116,"n_cols":5,"rows_kept":116,"cut":false,"hidden":true,"merged":[]}
["Translations"]
[]
[]
[]
[]
["English","Deutsch","Français","Español","Italiano"]
["Lead Acid Battery","Bleisäurebatterie","Batterie au plomb","Batería de Ácido Plomo","Batteria al piombo acido"]
["Battery Duration Guide","Leitfaden zur Verlängerung der Batterielebensdauer","Guide d'évaluation de la durée d'une batterie","Guía de Duración de la Batería","Guida durata delle batterie"]
[]
["Truck, Battery and Application Selection","Auswahl Stapler, Batterie und Anwendung","Sélection du chariot, de la batterie et de l'application","Selección de Carretilla, Batería y Aplicación","Selezione carrello elevatore, batteria e applicazione"]
["Truck","Stapler","Chariot","Carretilla","Carrello elevatore"]
["Trucks","Stapler","Chariots","Carretillas","Carrelli elevatori"]
["Battery","Batterie","Batterie","Batería","Batteria"]
[]
["Truck Utilisation","Staplernutzung","Utilisation du chariot","Utilización de la Carretilla","Utilizzo del carrello elevatore"]
{"$rows_left_out":102}
{"sheet":"Specs","index":2,"n_rows":44,"n_cols":17,"rows_kept":44,"cut":false,"hidden":true,"merged":[[0,3,0,6],[0,13,0,16],[36,12,36,13]]}
[null,null,null,"E-Lo",null,null,null,null,null,null,null,null,"Cab\nHeater","HiP"]
["Model","Capacity, T","tested","Light Duty","Medium Duty","Heavy Duty","Intensive Duty","Batteries1","Batteries2","Batteries3","Batteries4","Batteries5","kW","Light Duty","Medium Duty","Heavy Duty","Intensive Duty"]
["A1.3XNT",1.3,null,{"$f":"F3+(Specs!F3*Specs!$B$41)","v":1.3649999999999998},{"$f":"F3+(F3*$B$42)","v":1.95},3.9,{"$f":"F3+(F3*$B$44)","v":4.3680000000000003},"24V875Ah","24V735Ah",null,null,null,{"$f":"1.5*0.6","v":0.89999999999999991},{"$f":"P3+(Specs!P3*Specs!$B$41)","v":1.4332499999999997},{"$f":"P3+(P3*$B$42)","v":2.0474999999999999},{"$f":"F3*1.05","v":4.0949999999999998},{"$f":"P3+(P3*$B$44)","v":4.5863999999999994}]
["A1.5XNT",1.5,null,{"$f":"F4+(Specs!F4*Specs!$B$41)","v":1.4},{"$f":"F4+(F4*$B$42)","v":2},4,{"$f":"F4+(F4*$B$44)","v":4.4800000000000004},"24V1000Ah","24V840Ah",null,null,null,{"$f":"1.5*0.6","v":0.89999999999999991},{"$f":"P4+(Specs!P4*Specs!$B$41)","v":1.4699999999999998},{"$f":"P4+(P4*$B$42)","v":2.1},{"$f":"F4*1.05","v":4.2},{"$f":"P4+(P4*$B$44)","v":4.7040000000000006}]
["J1.5XNT_SWB",1.5,null,{"$f":"F5+(Specs!F5*Specs!$B$41)","v":1.3649999999999998},1.95,3.9,4.3680000000000003,"48V500Ah","48V460Ah","48V420Ah","ND48V700Ah","ND48V595Ah",0.89999999999999991,{"$f":"P5+(Specs!P5*Specs!$B$41)","v":1.4332499999999997},2.0474999999999999,4.0949999999999998,4.5863999999999994]
["J1.6XN_LWB",1.6,null,{"$f":"F6+(Specs!F6*Specs!$B$41)","v":1.5749999999999997},2.25,4.5,5.04,"48V750Ah","48V690Ah","ND48V900Ah","ND48V750Ah","ND48V690Ah",0.89999999999999991,{"$f":"P6+(Specs!P6*Specs!$B$41)","v":1.6537500000000001},2.3625000000000003,4.7250000000000005,5.2920000000000007]
["J1.6XN_MWB",1.6,"1.71/2.66",{"$f":"F7+(Specs!F7*Specs!$B$41)","v":1.54},2.2000000000000002,4.4000000000000004,{"$f":"F7*1.02","v":4.4880000000000004},"48V625Ah","48V575Ah",null,null,null,0.89999999999999991,{"$f":"P7+(Specs!P7*Specs!$B$41)","v":1.75},2.5,5,{"$f":"F7*1.23","v":5.4119999999999999}]
["J1.6XNT_LWB",1.6,null,{"$f":"F8+(Specs!F8*Specs!$B$41)","v":1.4699999999999998},2.1,4.2,4.7040000000000006,"48V750Ah","48V690Ah",null,null,null,0.89999999999999991,{"$f":"P8+(Specs!P8*Specs!$B$41)","v":1.5434999999999999},2.2050000000000001,{"$f":"F8*1.05","v":4.41},4.9392000000000005]
["J1.6XNT_MWB",1.6,null,{"$f":"F9+(Specs!F9*Specs!$B$41)","v":1.4699999999999998},2.1,4.2,{"$f":"F9*1.07","v":4.4940000000000007},"48V625Ah","48V575Ah",null,null,null,0.89999999999999991,{"$f":"P9+(Specs!P9*Specs!$B$41)","v":1.6799999999999997},2.4,4.8,5.4]
["J1.6XNT_SWB",1.6,null,{"$f":"F10+(Specs!F10*Specs!$B$41)","v":1.4699999999999998},2.1,4.2,4.7040000000000006,"48V500Ah","48V460Ah","48V420Ah","ND48V700Ah","ND48V595Ah",0.89999999999999991,{"$f":"P10+(Specs!P10*Specs!$B$41)","v":1.5434999999999999},2.2050000000000001,{"$f":"F10*1.05","v":4.41},4.9392000000000005]
["J1.8XN_LWB",1.8,null,{"$f":"F11+(Specs!F11*Specs!$B$41)","v":1.75},2.5,5,5.6,"48V750Ah","48V690Ah","ND48V900Ah","ND48V750Ah","ND48V690Ah",0.89999999999999991,{"$f":"P11+(Specs!P11*Specs!$B$41)","v":1.8374999999999999},2.625,{"$f":"F11*1.05","v":5.25},5.88]
["J1.8XN_MWB",1.8,1.48,{"$f":"F12+(Specs!F12*Specs!$B$41)","v":1.75},2.5,5,5.6,"48V625Ah","48V575Ah",null,null,null,0.89999999999999991,{"$f":"P12+(Specs!P12*Specs!$B$41)","v":1.8374999999999999},2.625,5.25,5.88]
["J1.8XNT_LWB",1.8,null,{"$f":"F13+(Specs!F13*Specs!$B$41)","v":1.645},2.35,4.7,5.2640000000000002,"48V750Ah","48V690Ah","ND48V900Ah","ND48V750Ah","ND48V690Ah",0.89999999999999991,{"$f":"P13+(Specs!P13*Specs!$B$41)","v":1.7272500000000002},2.4675000000000002,4.9350000000000005,5.5272000000000006]
["J1.8XNT_MWB",1.8,1.1499999999999999,{"$f":"F14+(Specs!F14*Specs!$B$41)","v":1.645},2.35,4.7,5.2640000000000002,"48V625Ah","48V575Ah","ND48V750Ah","ND48V625Ah",null,0.89999999999999991,{"$f":"P14+(Specs!P14*Specs!$B$41)","v":1.7272500000000002},2.4675000000000002,{"$f":"F14*1.05","v":4.9350000000000005},5.5272000000000006]
["J2.0XN_LWB",2,"1.37/1.65/2.71/2.31",{"$f":"F15+(Specs!F15*Specs!$B$41)","v":1.9249999999999998},2.75,5.5,6.16,"48V750Ah","48V690Ah","ND48V900Ah","ND48V750Ah","ND48V690Ah",0.89999999999999991,{"$f":"P15+(Specs!P15*Specs!$B$41)","v":2.0212500000000002},2.8875000000000002,5.7750000000000004,6.468]
{"$rows_left_out":30}
{"sheet":"Log","index":3,"n_rows":27,"n_cols":4,"rows_kept":27,"cut":false,"hidden":true,"merged":[]}
["Version","Date","Who","Description"]
["Version 1.0","2016-08-03","L. Ceballos","Calculator creation in Hyster branding, with all the calculations and the main calculation algorythm"]
["Version 1.1","2016-08-04","L. Ceballos","Checked and amended variables with UK TMs"]
["Version 1.2","2016-08-06","L. Ceballos","Validated % with Charlie Whilton"]
["Version 1.3","2016-09-02","L. Ceballos","Added activate/deactivate button changed formula for discharge, added hours and minutes to estimated time"]
["Version 1.4","2016-09-08","L. Ceballos","Added Mast and performance settings to the variables"]
["Version 1.5","2016-09-09","L. Ceballos","Added extended shift, formated for printing"]
["Version 1.6","2017-01-25","C. Whilton","Charlie took over and amended the calculator creating a new DRAFT"]
["Version 1.7","2017-01-27","C. Whilton","Added functionality to all inputs."]
["Version 1.8","2017-03-07","C. Whilton","Added HIP functionality and Cab heater option."]
["Version 1.9","2017-06-26","C. Whilton","Changed duty cycles"]
["Version 1.10","2017-07-13","L.Ceballos","Revised 'calculator' cell C9 to force selection of appropriate battery."]
["Version 1.11","2017-09-27","C. Whilton","Included additional test data for J5.5XN6"]
["Version 1.12","2017-10-24","L. Ceballos","Luis took overa and re-adjusted all the functions mirroring the calculator to start including translation and modified the design in line with other calculations created in the past"]
["Version 1.13","2017-10-25","L. Ceballos","Modified functions to allow translation up to attachments."]
{"$rows_left_out":13}
{"sheet":"Variables","index":4,"n_rows":98,"n_cols":5,"rows_kept":98,"cut":false,"hidden":true,"merged":[]}
["Battery","V","Ah","watt hours","kWh"]
["24V735Ah",24,735,{"$f":"B2*C2","v":17640},{"$f":"D2/1000","v":17.64}]
["24V875Ah",24,875,{"$f":"B3*C3","v":21000},{"$f":"D3/1000","v":21}]
["24V840Ah",24,840,20160,20.16]
["24V1000Ah",24,1000,24000,24]
["48V420Ah",48,420,20160,20.16]
["48V460Ah",48,460,22080,22.08]
["48V500Ah",48,500,24000,24]
["48V575Ah",48,575,27600,27.6]
["48V625Ah",48,625,30000,30]
["48V690Ah",48,690,33120,33.119999999999997]
["48V750Ah",48,750,36000,36]
["80V560Ah",80,560,44800,44.8]
["80V620Ah",80,620,49600,49.6]
["80V700Ah",80,700,56000,56]
{"$rows_left_out":84}
{"sheet":"Light-Medium-Heavy Duty","index":5,"n_rows":16,"n_cols":11,"rows_kept":16,"cut":false,"hidden":true,"merged":[[1,3,1,5],[4,0,6,0],[9,3,9,5],[8,1,8,5],[11,3,12,3],[11,4,12,4],[11,5,12,5],[12,1,12,2],[9,1,11,2]]}
[null,"Application Matrix"]
[null,null,null,"What is weight of loads are Handled?"]
[null,null,null,{"$f":"'Application Factors'!C7","v":"Generally Light Loads"},{"$f":"'Application Factors'!C8","v":"Light to Medium Loads"},{"$f":"'Application Factors'!C9","v":"Capacity Loads"}]
[null,null,null,{"$f":"'Application Factors'!D7","v":"Generally less than 50% capacity occasional capacity loads"},{"$f":"'Application Factors'!D8","v":"Generally less than 75% capacity occasional capacity loads"},{"$f":"'Application Factors'!D9","v":"Often Handling loads at or close to capacity"}]
["How much Hydraulic Work?",{"$f":"'Application Factors'!C11","v":"Generally Stacking and Loading - signficantly more travel than lifting"},{"$f":"'Application Factors'!D11","v":"Ground Handling and stacking -  Lifts below 3m"},"Very Light Duty \n OR Light Duty ","Light Duty\nOr Medium Duty ","Medium Duty\nOr Heavy Duty"]
[null,{"$f":"'Application Factors'!C12","v":"Stacking and loading or unloading racking with similar amounts of travel and hydraulic work"},{"$f":"'Application Factors'!D12","v":"Most Lifts below 3 m but with occasional higher lifts"},"Light Duty\nOr Medium Duty","Medium Duty","Heavy Duty",null,"ORIGINAL"]
[null,{"$f":"'Application Factors'!C13","v":"Stacking and loading or unloading with significant time handling loads at height"},{"$f":"'Application Factors'!C15","v":"Or Forklift Operating with clamping attachment or rotator"},"Medium Duty","Medium Duty\nOr Heavy Duty","Heavy Duty"]
[]
[null,"APPLICATION MATRIX",null,null,null,null,null,null,null,null," "]
[null,"Choose duty cycle from the matrix criterea and select result in the calculator",null,"WHAT LOADS ARE HANDLED?"]
[null,null,null,{"$f":"'Application Factors'!C7","v":"Generally Light Loads"},{"$f":"'Application Factors'!C8","v":"Light to Medium Loads"},{"$f":"'Application Factors'!C9","v":"Capacity Loads"}]
[null,null,null,{"$f":"'Application Factors'!D7","v":"Generally less than 50% capacity occasional capacity loads"},{"$f":"'Application Factors'!D8","v":"Generally less than 75% capacity occasional capacity loads"},{"$f":"'Application Factors'!D9","v":"Often Handling loads at or close to capacity"}]
[null,"TRAVEL Vs. HYDRAULICS OPERATION?"]
[null,{"$f":"'Application Factors'!C11","v":"Generally Stacking and Loading - signficantly more travel than lifting"},{"$f":"'Application Factors'!D11","v":"Ground Handling and stacking -  Lifts below 3m"}," LIGHT DUTY","MEDIUM DUTY","HEAVY DUTY"]
[null,{"$f":"'Application Factors'!C12","v":"Stacking and loading or unloading racking with similar amounts of travel and hydraulic work"},{"$f":"'Application Factors'!D12","v":"Most Lifts below 3 m but with occasional higher lifts"},"MEDIUM DUTY","HEAVY DUTY","INTENSIVE DUTY",null,"REVISED"]
{"$rows_left_out":2}
{"sheet":"Application Factors","index":6,"n_rows":31,"n_cols":10,"rows_kept":31,"cut":false,"hidden":true,"merged":[[0,0,0,4],[11,9,11,12],[28,1,29,5],[30,1,30,5]]}
["Strawman of Factors to be applied to the Calculated Battery Autonomy based on Possible Consumption* and Available Battery Capacity **"]
[]
[null,"Factor to be Applied","Where Used","Description to assist selection","Suggested Factor to be Applied","Reasoning","Validation Needed and Completed"]
[]
[1,"% of shift time where truck is operated (%)","Direct estimate from Application Survey entered via input sheet",null,"Direct % applied to increase operating time","Neglegable consumption when truck not operating","Probably not required"]
[]
[2,"Average Loads Carried (incorporated into Light Medium Heavy Matrix)","Generally Light Loads","Generally less than 50% capacity occasional capacity loads","decrease possible consumption by 25%","Lower GVW and hydraulic loads than are seen on VDI2198 (60 cycle)","Yes"]
[null,null,"Light to Medium Loads","Generally less than 75% capacity occasional capacity loads","decrease possible consumption by 15%","Lower GVW and hydraulic loads than are seen on VDI2198 (60 cycle)","Yes"]
[null,null,"Capacity Loads","Often Handling loads at or close to capacity","No change in prediction","Similar loads to VDI2198 (60 cycle)","Yes"]
[]
[3,"Hydraulic Work (incorporated into Light Medium Heavy Matrix)","Generally Stacking and Loading - signficantly more travel than lifting","Ground Handling and stacking -  Lifts below 3m","decrease possible consumption by 10%","Lower hydraulic loads than are seen on VDI2198 (60 cycle)","Yes"]
[null,null,"Stacking and loading or unloading racking with similar amounts of travel and hydraulic work","Most Lifts below 3 m but with occasional higher lifts","No change in prediction","Similar loads to VDI2198 (60 cycle)","Yes",null,null,"REFINE FACTORS"]
[null,null,"Stacking and loading or unloading with significant time handling loads at height","Signficant High Lifting ","increase possible consumption by 20%","Higher hydraulic loads than are seen on VDI2198 (60 cycle)","Yes"]
[null,null,"Forklift Operating with non clamping attachment, Fork Positionner, ",null,"No change in prediction","Similar loads to VDI2198 (60 cycle)","Probably not required as attachment usage is low"]
[null,null,"Or Forklift Operating with clamping attachment or rotator","Operating with Appliance Clamp, Bail Clamp, Paper Roll Clamp","increase possible consumption by 20%","Higher hydraulic loads than are seen on VDI2198 (60 cycle)","Yes"]
{"$rows_left_out":17}
{"sheet":"Validation data","index":7,"n_rows":48,"n_cols":6,"rows_kept":48,"cut":false,"hidden":true,"merged":[]}
["Duty Cycle",0.5,null,null,null,"shift letter"]
["Light Duty",1,1,"A",{"$f":"Calculator!C12-0.5","v":-0.5},{"$f":"VLOOKUP(E2,'Validation data'!B2:D48,3,FALSE)","v":{"$error":"#N/A"}}]
["Medium Duty",1.5,1.5,"B"]
["Heavy Duty",2,2,"CC"]
["Intensive Duty",2.5,2.5,"D"]
[null,3,3,"E"]
[null,3.5,3.5,"F"]
[null,4,4,"G"]
[null,4.5,4.5,"H"]
[null,5,5,"I"]
[null,5.5,5.5,"J"]
[null,6,6,"K"]
[null,6.5,6.5,"L"]
[null,7,7,"M"]
[null,7.5,7.5,"N"]
{"$rows_left_out":34}
{"sheet":"PRJ2106","index":8,"n_rows":7,"n_cols":1,"rows_kept":7,"cut":false,"hidden":true,"merged":[]}
["Translations"]
[]
["English"]
["Deutsch"]
["Français"]
["Español"]
["Italiano"]