{"text_format":"1","workbook":"xlsx","n_sheets":8,"sheets":["Inputs","Output","Trucks","Variables","Calc1","Calc2","Sheet1","Sheet2"],"not_rendered":{"charts":3,"images":2,"macros":1,"external_links":2,"defined_names":1,"comments":0,"pivot_tables":0},"unopened":[],"bounds":{"document_bytes":16777216,"sheet_cells":100000,"rows_first":2000,"rows_last":500,"rows_between":2000,"halvings":0,"cell_chars":16384,"cell_head_chars":4096},"cells_cut":0,"cells_raw":0,"read":"whole","date_system":"1900"}

{"sheet":"Inputs","index":0,"n_rows":172,"n_cols":14,"rows_kept":172,"cut":false,"hidden":false,"merged":[[140,3,140,5],[179,2,190,7],[59,1,59,14],[1,1,1,14],[5,1,5,14],[37,10,40,13],[161,1,161,10],[138,1,138,10],[9,7,10,7],[128,1,128,10],[116,1,116,10],[95,1,95,10],[12,1,12,14],[91,3,93,5],[152,4,152,6],[28,9,29,13],[150,2,150,7],[0,2,0,11],[42,1,42,14],[164,10,164,12],[166,10,167,10],[166,11,167,11],[166,12,167,12],[163,10,163,12],[142,3,142,5],[142,7,142,9],[143,7,143,9],[152,2,152,3],[77,1,87,10],[35,9,35,13],[61,9,65,13],[155,2,155,7],[158,1,158,9]]}
[null,null,"\nFor Internal Use Only – Not for Distribution\n\nDo not use if training has not been received or the tutorial available in the Download Section of the Lithium-ion Sales Tool has not been seen, as improper use could lead to miscalculation.\n\nTo be used in combination with Lithium-ion Application Sheet available in the Download Section of the Lithium-ion Sales Tool.\n"]
[null,"Lithium-ion Battery Calculator Tool"]
[]
[null,null,null,null,null,null,null,null,null,null,null,null,null,"English"]
[]
[null,"Truck"]
[]
[null,null,null,null,"Truck Category","Select"]
[]
[null,null,null,null,"Truck Model","Select"]
[]
[]
[null,"Application and Daily Schedule"]
[]
[null,null,null,null,"Start Time","00:00:00",null,"select"]
[]
[null,null,null,"Break 1",null,"Break 2",null,"Break 3",null,"Break 4",null,"Break 5",null,"Break 6"]
[null,null,"Break Start Time","00:30:00",null,"No Break",null,"No Break",null,"No Break",null,"No Break",null,"No Break"]
[null,null,"Break Duration (mins)",0,null,0,null,0,null,0,null,0,null,0]
[]
[null,null,null,"Break 7",null,"Break 8",null,"Break 9",null,"Break 10",null,"Break 11",null,"Break 12"]
[null,null,"Break Start Time","No Break",null,"No Break",null,"No Break",null,"No Break",null,"No Break",null,"No Break"]
[null,null,"Break Duration (mins)",0,null,0,null,0,null,0,null,0,null,0]
[]
[null,null,null,"Break 13",null,"Break 14",null,"Break 15",null,"Break 16",null,"Break 17",null,"Break 18"]
[null,null,"Break Start Time","No Break",null,"No Break",null,"No Break",null,"No Break",null,"No Break",null,"No Break"]
[null,null,"Break Duration (mins)",0,null,0,null,0,null,0,null,0,null,0]
[]
[null,null,null,null,"End Time","01:00:00",null,"select",null,{"$f":"IF(Calc1!$O$56=1,\"Warning: please choose End Time after final break or check break patterns\",\"\")","v":""}]
[]
[null,null,null,null,"Days per week","Select",null,"select"]
[]
[null,null,null,"Truck hours p.a.",null,null,null,"input"]
[]
[null,null,null,null,"% Working time that truck is idle (excl. scheduled breaks)",null,null,{"$f":"IF((AND(F33>0, F33<=Calc1!D6)), \"input     Suggested value based on working hours p.a. = \"&TEXT((Calc1!D7*100),\"0\") &\"%\",\"input      Suggested value for selected truck is  =  \"&TEXT(Calc2!C21,\"0\")& \"%\")","v":{"$error":"#VALUE!"}}]
[]
[null,null,null,null,"Energy consumption rate during use (kWh/h)",null,null,{"$f":"\"input      Provide real value if possible (VDI value for selected truck is  =  \"&TEXT(Calc2!C19,\"0.00\") &\")\"","v":"input      Provide real value if possible (VDI value for selected truck is  =  0.00)"}]
[null,null,null,null,null,null,null,null,null,null,"Energy consumption = change in battery state of charge (%)  x nominal battery voltage (V) x battery capacity (Ah) / 1000 / duration of use (hours)"]
[null,null,null,null,"Operator hourly rate (€)",30,null,{"$f":"\"input      Default = \"&TEXT(Variables!C10,\"0.00\")","v":"input      Default = 30.00"}]
[null,null,null,null,"Electricity cost (€/kWh)",0.12,null,{"$f":"\"input      Default = \"&TEXT(Variables!C13,\"0.00\")","v":"input      Default = 0.12"}]
[]
[]
[null,"Lead Acid Battery and Charger"]
[]
[null,null,null,null,"Battery capacity (Ah)","Select",null,"select"]
[null,null,null,null,"Charger type","Select",null,"select"]
[]
[null,null,null,null,"Monthly battery & charger service fee",null,null,"input      Include maintenance, cleaning, topping. Do not include annual inspection"]
[]
[null,null,null,null,"Travel plus return time to charging station (mins)",null,null,"input"]
[null,null,null,null,"Battery changeover time (mins)",null,null,"input"]
[null,null,null,null,"Battery attendant employed?","Select",null,"select"]
[]
[null,null,null,null,"Is there an existing charging room?","Select",null,"select"]
[]
[null,null,null,null,"Lead Acid battery price (€)",null,null,"input"]
[null,null,null,null,"Charger price (€)",null,null,"input"]
[]
[]
[null,"Lithium-ion Battery and Charger"]
[]
[null,null,null,null,"Battery capacity (Ah)","Select",null,"select",null,{"$f":"IFERROR(IF(SUM(Calc1!$Q$18:$Q$55)>0,\"Maximum DOD has been exceeded. Please check energy consumption, choose a larger Lithium-ion battery or charger or change shift pattern\",\"\"),\"\")","v":""}]
[null,null,null,null,"Charger (A)","Select",null,"select"]
[null,null,null,null,"Charger Phase Current ± 10% (A)",{"$f":"Calc2!C306","v":""}]
[null,null,null,null,"Charger Max Input Power (kVA)",{"$f":"Calc2!C307","v":""}]
[]
[null,null,null,null,"Lithium-ion battery price (€)",null,null,"input"]
[null,null,null,null,"Charger price (€)",null,null,"input"]
[]
[]
[]
[]
[]
[]
[]
[]
[]
[null,"THIS HYG BATTERY CALCULATOR TOOL USES GENERIC DATA AND TECHNICAL DATA FROM HYSTER-YALE GROUP (HYG) AND ITS SUPPLIERS TO MODEL THE PERFORMANCE OF LITHIUM ION EQUIPMENT SUPPLIED BY HYG. BASED ON USER INPUTS IT CALCULATES THE PERFORMANCE OF THE EQUIPMENT IN TYPICAL MATERIALS HANDLING APPLICATIONS. WHILE HYG HAS ENDEAVOURED TO ENSURE ITS ACCURACY, HYG CANNOT GUARANTEE THAT THE RESULTS GENERATED WILL BE ACCURATE OR CORRECT FOR A SPECIFIC CUSTOMER OR APPLICATION. FURTHER, THE PERFORMANCE OF THE TOOL RELIES ON THE USER PROVIDING COMPLETE AND ACCURATE INPUTS. RESULTS GENERATED BY THE TOOL MAY BE COMPROMISED IF INCOMPLETE OR INACCURATE INPUTS ARE USED. THE TOOL PROVIDES ESTIMATES ONLY, AND SHOULD NOT BE RELIED UPON TO ACCURATELY FORECAST OR PREDICT RESULTS IN ACTUAL USE OF MATERIALS HANDLING EQUIPMENT. HYG  EXPRESSLY DISCLAIMS AND EXCLUDES ANY LIABILITY FOR LOSS OR DAMAGE HOWEVER CAUSED, WHETHER DIRECT OR INDIRECT, THAT MAY RESULT FROM USE OF THE HYG BATTERY CALCULATOR TOOL OR RELIANCE ON ITS RESULTS.  "]
[]
[]
[]
[]
[]
[]
[]
[]
[]
[]
[]
[]
[]
[]
[]
[]
[]
[null,"Lithium-ion Daily State of Charge Profile "]
[]
[]
[]
[]
[]
[]
[]
[]
[]
[]
[]
[]
[]
[]
[]
[]
[]
[]
[]
[]
[null,"Investment Costs per truck"]
[]
[null,null,null,"Lead Acid ",null,"Lithium-ion"]
[null,null,"Batteries required per truck (integer)",{"$f":"Calc1!D76","v":{"$error":"#VALUE!"}},null,1]
[null,null,null,"€",null,"€"]
[null,null,"Total battery cost",{"$f":"Output!D62","v":{"$error":"#VALUE!"}},null,{"$f":"Output!F62","v":0}]
[null,null,"Charger cost",{"$f":"Output!D63","v":0},null,{"$f":"Output!F63","v":0}]
[null,null,"Charging room and equipment cost",{"$f":"Output!D64","v":0},null,{"$f":"Output!F64","v":0}]
[null,null,"Longer Lifetime Adjustment",{"$f":"Calc1!D93","v":0},null,{"$f":"Calc1!E93","v":0}]
[null,null,"Total",{"$f":"Output!D66","v":{"$error":"#VALUE!"}},null,{"$f":"Output!F66","v":0}]
[]
[]
[null,"Annual Costs per truck"]
[]
[null,null,null,"Lead Acid ",null,"Lithium-ion"]
[null,null,null,"€",null,"€"]
[null,null,"Energy cost (incl. battery degradation)",{"$f":"Output!D73","v":{"$error":"#VALUE!"}},null,{"$f":"Output!F73","v":{"$error":"#VALUE!"}}]
[null,null,"Battery handling cost",{"$f":"Output!D74","v":{"$error":"#VALUE!"}},null,{"$f":"Output!F74","v":{"$error":"#VALUE!"}}]
[null,null,"Battery maintenance cost",{"$f":"Output!D75","v":{"$error":"#VALUE!"}},null,{"$f":"Output!F75","v":50}]
[null,null,"Total",{"$f":"Output!D76","v":{"$error":"#VALUE!"}},null,{"$f":"Output!F76","v":{"$error":"#VALUE!"}}]
[]
[]
[null,"Savings per truck"]
[]
[null,null,null,"Excluding depreciation",null,null,null,"select"]
[]
[null,null,null,"Costs",null,null,null,"Cumulative Savings"]
[null,null,null,"Lead Acid",null,"Lithium-ion",null,"(Lithium-ion vs Lead Acid)"]
[null,null,null,"€",null,"€",null,"€",null,"Select Currency (EUR)"]
[null,null,"y1",{"$f":"Output!D84","v":{"$error":"#VALUE!"}},null,{"$f":"Output!F84","v":{"$error":"#VALUE!"}},null,{"$f":"IF(Inputs!D141=\"Including depreciation\", Calc1!G113, Calc1!L113)","v":{"$error":"#VALUE!"}},null,{"$f":"H146*(VLOOKUP(J145, Calc1!D123:E125, 2, FALSE))","v":{"$error":"#VALUE!"}}]
[null,null,"y2",{"$f":"Output!D85","v":{"$error":"#VALUE!"}},null,{"$f":"Output!F85","v":{"$error":"#VALUE!"}},null,{"$f":"IF(Inputs!D141=\"Including depreciation\",Calc1!G114,Calc1!L114)","v":{"$error":"#VALUE!"}},null,{"$f":"H147*(VLOOKUP(J145, Calc1!D123:E125, 2, FALSE))","v":{"$error":"#VALUE!"}}]
[null,null,"y3",{"$f":"Output!D86","v":{"$error":"#VALUE!"}},null,{"$f":"Output!F86","v":{"$error":"#VALUE!"}},null,{"$f":"IF(Inputs!D141=\"Including depreciation\", Calc1!G115, Calc1!L115)","v":{"$error":"#VALUE!"}},null,{"$f":"H148*(VLOOKUP(J145, Calc1!D123:E125, 2, FALSE))","v":{"$error":"#VALUE!"}}]
[null,null,"y4",{"$f":"Output!D87","v":{"$error":"#VALUE!"}},null,{"$f":"Output!F87","v":{"$error":"#VALUE!"}},null,{"$f":"IF(Inputs!D141=\"Including depreciation\", Calc1!G116, Calc1!L116)","v":{"$error":"#VALUE!"}},null,{"$f":"H149*(VLOOKUP(J145, Calc1!D123:E125, 2, FALSE))","v":{"$error":"#VALUE!"}}]
[null,null,"y5",{"$f":"Output!D88","v":{"$error":"#VALUE!"}},null,{"$f":"Output!F88","v":{"$error":"#VALUE!"}},null,{"$f":"IF(Inputs!D141=\"Including depreciation\", Calc1!G117, Calc1!L117)","v":{"$error":"#VALUE!"}},null,{"$f":"H150*(VLOOKUP(J145, Calc1!D123:E125, 2, FALSE))","v":{"$error":"#VALUE!"}}]
[]
[]
[null,null,"Payback Time",null,{"$f":"Output!F91","v":{"$error":"#VALUE!"}}]
[]
[]
[]
[null,null,null,"Estimated CO2 emissions savings p.a.",null,null,null,{"$f":"Calc1!I43","v":{"$error":"#VALUE!"}}]
[]
[]
[]
[]
[]
[]
[]
[null,null,null,null,null," ",null,null,null,null,"WHAT LOADS ARE HANDLED?"]
[null,null,null,null,null,null,null,null,null,null,"Generally Light Loads","Light to Medium Loads","Capacity Loads"]
[null,null,null,null,null,null,null,null,null,null,"Generally less than 50% capacity occasional capacity loads","Generally less than 75% capacity occasional capacity loads","Often Handling loads at or close to capacity"]
[]
[null,null,null,null,null,null,null,null,null,null," VERY LIGHT DUTY","LIGHT  DUTY","MEDIUM DUTY"]
[null,null,null,null,null,null,null,null,null,null,"LIGHT DUTY","MEDIUM DUTY","HEAVY DUTY"]
[null,null,null,null,null,null,null,null,null,null,"MEDIUM DUTY","HEAVY DUTY","HEAVY DUTY"]
[null,null,null,null,null,null,null,null,null,"Version 4.0"]

{"sheet":"Output","index":1,"n_rows":101,"n_cols":7,"rows_kept":101,"cut":false,"hidden":false,"merged":[[93,1,93,5],[100,1,114,6],[0,5,10,5],[0,6,10,6],[57,1,57,6],[68,1,68,6],[78,1,78,6],[44,1,44,6],[80,3,80,5],[27,1,27,2]]}
[{"$f":"\"Lithium-ion Battery Calculator Tool Output Page \"&TEXT(TODAY(),\"dd-mmm-yy\")","v":"Lithium-ion Battery Calculator Tool Output Page 17-Sep-19"},null,null,null,null,{"$f":"IF(Calc1!Q57=\"EXCEEDED\",\"Warning: the combination of shift pattern and Li-ion battery chosen does not allow for opportunity charging of Li-ion battery. Please reselect break pattern options\",\"\")","v":{"$error":"#VALUE!"}},{"$f":"IF(Calc1!$O$56=1,\"Warning: Chosen end Time is before end of final break period. Please check the shift pattern\",\"\")","v":""}]
[null,"Truck type",null,{"$f":"Inputs!F10","v":"Select"}]
[null,{"$f":"Inputs!E15","v":"Start Time"},null,{"$f":"Inputs!F15","v":"00:00:00"}]
[null,"End Time",null,{"$f":"Inputs!F29","v":"01:00:00"}]
[null,"Operating time per day (hh:mm)",null,{"$f":"Calc1!N57","v":"01:00:00"}]
[null,"Idle time (hh:mm)",null,{"$f":"Inputs!F35/100*Output!D5","v":"00:00:00"}]
[null,"Number of breaks per day",null,{"$f":"(Calc1!D11)","v":1}]
[null,"Break time during shift per day (hh:mm)",null,{"$f":"(Calc1!D10)/24","v":"00:00:00"}]
[null,{"$f":"Inputs!E39","v":"Operator hourly rate (€)"},null,{"$f":"Calc2!C33","v":30}]
[null,{"$f":"Inputs!E40","v":"Electricity cost (€/kWh)"},null,{"$f":"Calc2!C35","v":0.12}]
[]
[null,"Energy",null,"Lead Acid",null,"Lithium-ion"]
[null,"Voltage (V)",null,{"$f":"Calc1!D14","v":"Select"},null,{"$f":"Calc1!G14","v":"Select"}]
[null,"Capacity (Ah)",null,{"$f":"Inputs!F45","v":"Select"},null,{"$f":"Inputs!F62","v":"Select"}]
[null,"Charger Phase Current ± 10% (A)",null,null,null,{"$f":"Calc2!C306","v":""}]
[null,"Charger Max Input Power (kVA)",null,null,null,{"$f":"Calc2!C307","v":""}]
[null,{"$f":"Calc1!C19","v":"Charge rate (kWh/hour)"},null,"n/a",null,{"$f":"Calc1!G19","v":{"$error":"#VALUE!"}}]
[null,"Useable energy per battery (kWh)",null,{"$f":"Calc1!D23","v":{"$error":"#VALUE!"}},null,{"$f":"Calc1!G23","v":{"$error":"#VALUE!"}}]
[]
[null,"Used energy per day (kWh)",null,{"$f":"Calc1!D27","v":0},null,{"$f":"Calc1!G27","v":0}]
[null,"Energy consumption rate (kWh/h)",null,{"$f":"Calc1!D25","v":0},null,{"$f":"Calc1!G25","v":0}]
[]
[null,"Mains Energy per day (kWh)",null,{"$f":"Calc1!D33","v":{"$error":"#VALUE!"}},null,{"$f":"Calc1!G33","v":{"$error":"#VALUE!"}}]
[null,"Energy cost p.a. (€)",null,{"$f":"Calc1!D42","v":{"$error":"#VALUE!"}},null,{"$f":"Calc1!G42","v":{"$error":"#VALUE!"}}]
[null,"Estimated CO2 emmisions savings p.a. (tonnes)",null,null,null,{"$f":"Calc1!I43","v":{"$error":"#VALUE!"}}]
[]
[null,"Battery Handling ",null,"Lead Acid",null,"Lithium-ion"]
[null,"Number of batteries per truck (integer)",null,{"$f":"Calc1!D76","v":{"$error":"#VALUE!"}},null,1]
[null,"Number of battery cycles per day",null,{"$f":"Calc1!D75","v":{"$error":"#VALUE!"}},null,{"$f":"Calc1!G48","v":2}]
[null,"Driver recharging time per annum (hours)",null,{"$f":"Calc1!D50","v":{"$error":"#VALUE!"}},null,{"$f":"Calc1!G50","v":{"$error":"#VALUE!"}}]
[null,"Battery attendant time per annum (hours)",null,{"$f":"Calc1!D52","v":0},null,0]
[]
[null,"Battery handling cost p.a. (€)",null,{"$f":"Calc1!D54","v":{"$error":"#VALUE!"}},null,{"$f":"Calc1!G54","v":{"$error":"#VALUE!"}}]
[]
[null,"Battery Maintenance ",null,"Lead Acid",null,"Lithium-ion"]
[null,"Water cost p.a. (€)",null,{"$f":"Calc1!D72","v":50},null,{"$f":"Calc1!H72","v":0}]
[null,"Battery & charger service cost p.a. (€)",null,{"$f":"Calc1!D80","v":0},null,{"$f":"Calc1!G80","v":0}]
[null,"Annual inspection cost (€)",null,{"$f":"Calc1!D81","v":{"$error":"#VALUE!"}},null,{"$f":"Calc1!G81","v":50}]
[]
[null,"Battery maintainance cost p.a. (€) ",null,{"$f":"Calc1!D82","v":{"$error":"#VALUE!"}},null,{"$f":"Calc1!G82","v":50}]
[]
[null,"Infrastructure",null,"Lead Acid",null,"Lithium-ion"]
[null,"Charging room and charging equipment (€)",null,{"$f":"Calc1!D63","v":0},null,{"$f":"Calc1!G63","v":0}]
[]
[null,"Lithium-ion Daily State of Charge Profile "]
[]
[]
[]
[]
[]
[]
[]
[]
[]
[]
[]
[]
[null,"Investment Costs per truck"]
[]
[null,null,null,"Lead Acid ",null,"Lithium-ion"]
[null,null,null,"€",null,"€"]
[null,"Total battery cost ",null,{"$f":"Calc1!D88","v":{"$error":"#VALUE!"}},null,{"$f":"Calc1!E88","v":0}]
[null,"Charger cost",null,{"$f":"Calc1!D91","v":0},null,{"$f":"Calc1!E91","v":0}]
[null,"Charging room and equipment cost",null,{"$f":"Calc1!D92","v":0},null,{"$f":"Calc1!E92","v":0},"Difference"]
[null,"Longer lifetime adjustment",null,{"$f":"Calc1!D93","v":0},null,{"$f":"Calc1!E93","v":0},"Difference"]
[null,"Total",null,{"$f":"Calc1!D94","v":{"$error":"#VALUE!"}},null,{"$f":"Calc1!E94","v":0},{"$f":"Calc1!G94","v":{"$error":"#VALUE!"}}]
[]
[]
[null,"Annual Costs per truck"]
[]
[null,null,null,"Lead Acid",null,"Lithium-ion"]
[null,null,null,"€",null,"€"]
[null,"Energy cost (incl. battery degradation)",null,{"$f":"Calc1!D42","v":{"$error":"#VALUE!"}},null,{"$f":"Calc1!G42","v":{"$error":"#VALUE!"}}]
[null,"Battery handling cost",null,{"$f":"Calc1!D99","v":{"$error":"#VALUE!"}},null,{"$f":"Calc1!E99","v":{"$error":"#VALUE!"}}]
[null,"Battery maintenance cost",null,{"$f":"Calc1!D100","v":{"$error":"#VALUE!"}},null,{"$f":"Calc1!E100","v":50},"Difference"]
[null,"Total",null,{"$f":"SUM(D73:D75)","v":{"$error":"#VALUE!"}},null,{"$f":"SUM(F73:F75)","v":{"$error":"#VALUE!"}},{"$f":"Calc1!G101","v":{"$error":"#VALUE!"}}]
[]
[]
[null,{"$f":"\"Savings per truck (\" &TEXT(Inputs!D141, 0)&\")\"","v":"Savings per truck (Excluding depreciation)"}]
[]
[null,null,null,"Costs",null,null,"Cumulative Savings"]
[null,null,null,"Lead Acid",null,"Lithium-ion","Lithium-ion vs Lead Acid"]
[null,null,null,"€",null,"€",{"$f":"Inputs!J145","v":"Select Currency (EUR)"}]
[null,"y1",null,{"$f":"IF(Inputs!D141=\"Including depreciation\", Calc1!D113, Calc1!I113)","v":{"$error":"#VALUE!"}},null,{"$f":"IF(Inputs!D141=\"Including depreciation\", Calc1!E113, Calc1!J113)","v":{"$error":"#VALUE!"}},{"$f":"Inputs!J146","v":{"$error":"#VALUE!"}}]
[null,"y2",null,{"$f":"IF(Inputs!D141=\"Including depreciation\",Calc1!D114,Calc1!I114)","v":{"$error":"#VALUE!"}},null,{"$f":"IF(Inputs!D141=\"Including depreciation\", Calc1!E114,Calc1!J114)","v":{"$error":"#VALUE!"}},{"$f":"Inputs!J147","v":{"$error":"#VALUE!"}}]
[null,"y3",null,{"$f":"IF(Inputs!D141=\"Including depreciation\",Calc1!D115,Calc1!I115)","v":{"$error":"#VALUE!"}},null,{"$f":"IF(Inputs!D141=\"Including depreciation\", Calc1!E115,Calc1!J115)","v":{"$error":"#VALUE!"}},{"$f":"Inputs!J148","v":{"$error":"#VALUE!"}}]
[null,"y4",null,{"$f":"IF(Inputs!D141=\"Including depreciation\", Calc1!D116,Calc1!I116)","v":{"$error":"#VALUE!"}},null,{"$f":"IF(Inputs!D141=\"Including depreciation\", Calc1!E116,Calc1!J116)","v":{"$error":"#VALUE!"}},{"$f":"Inputs!J149","v":{"$error":"#VALUE!"}}]
[null,"y5",null,{"$f":"IF(Inputs!D141=\"Including depreciation\",Calc1!D117,Calc1!I117)","v":{"$error":"#VALUE!"}},null,{"$f":"IF(Inputs!D141=\"Including depreciation\", Calc1!E117, Calc1!J117)","v":{"$error":"#VALUE!"}},{"$f":"Inputs!J150","v":{"$error":"#VALUE!"}}]
[]
[]
[null,null,null,"Payback Time",null,{"$f":"IF(Inputs!D141=\"Including depreciation\", IF(Calc1!E121<1,\"less than 1 year\",IF(Calc1!E121>5,\"more than 5 years\",Calc1!E121)),IF(Calc1!J121<1,\"less than 1 year\",IF(Calc1!J121>5,\"more than 5 years\",Calc1!J121)))","v":{"$error":"#VALUE!"}}]
[]
[]
[null,"Estimated CO2 emissions savings p.a.",null,null,null,null,{"$f":"Inputs!H157","v":{"$error":"#VALUE!"}}]
[]
[]
[]
[]
[]
[]
[null,"THIS HYG BATTERY CALCULATOR TOOL USES GENERIC DATA AND TECHNICAL DATA FROM HYSTER-YALE GROUP (HYG) AND ITS SUPPLIERS TO MODEL THE PERFORMANCE OF LITHIUM ION EQUIPMENT SUPPLIED BY HYG. BASED ON USER INPUTS IT CALCULATES THE PERFORMANCE OF THE EQUIPMENT IN TYPICAL MATERIALS HANDLING APPLICATIONS. WHILE HYG HAS ENDEAVOURED TO ENSURE ITS ACCURACY, HYG CANNOT GUARANTEE THAT THE RESULTS GENERATED WILL BE ACCURATE OR CORRECT FOR A SPECIFIC CUSTOMER OR APPLICATION. FURTHER, THE PERFORMANCE OF THE TOOL RELIES ON THE USER PROVIDING COMPLETE AND ACCURATE INPUTS. RESULTS GENERATED BY THE TOOL MAY BE COMPROMISED IF INCOMPLETE OR INACCURATE INPUTS ARE USED. THE TOOL PROVIDES ESTIMATES ONLY, AND SHOULD NOT BE RELIED UPON TO ACCURATELY FORECAST OR PREDICT RESULTS IN ACTUAL USE OF MATERIALS HANDLING EQUIPMENT. HYG  EXPRESSLY DISCLAIMS AND EXCLUDES ANY LIABILITY FOR LOSS OR DAMAGE HOWEVER CAUSED, WHETHER DIRECT OR INDIRECT, THAT MAY RESULT FROM USE OF THE HYG BATTERY CALCULATOR TOOL OR RELIANCE ON ITS RESULTS.  "]

{"sheet":"Trucks","index":2,"n_rows":187,"n_cols":16,"rows_kept":187,"cut":false,"hidden":true,"merged":[[7,1,7,2],[51,3,51,6],[139,4,139,6]]}
[]
[]
[null,null,null,"only amend with improved figures"]
[null,null,null,"can add rows/columns as described"]
[]
[]
[null,null,"Truck, Battery and Application combinations"]
[]
[null,null,null,"Add each truck names and Lead batteries that are available for each truck. "]
[null,"Table 1: Truck and Lead batteries",null,"Keep the blank grey rows to a minimum or the truck names on the user interface will include blank spaces. "]
[null,null,null,"Order the truck names logically - the truck names will appear in the user interface in the same order as they appear in this table . "]
[null,null,"Truck Model                                       (write exactly as you wish the names to appear to the user) - write each truck model only once","Voltage (V)                      (keep similar voltages in the same section","VDI","Recommended idle time (%)","Available Pb batteries (Ah)",null,null,null,null,null,null,null,"to insert new Pb battery columns to the tool, insert to the left of this column"]
[null,"Select","Select","Select",null,null,"Select",null,null,null,null,null,null,null,null,"do not delete row"]
[null,"WH Pedestrian","P1.6-1.8",24,"0,384",30,150,210,250]
[null,"WH Pedestrian","P2.0",24,"0,384",30,150,210,250,315,375]
[null,"WH Pedestrian","LO2.0-2.0S",24,"1,13",35,465]
[null,"WH Pedestrian","LO2.5",24,"1,13",35,620]
[null,"WH Pedestrian","LO5.0T",24,"1,82",35,465,620]
[null,"WH Pedestrian","LO7.0T",24,"1,82",35,465,620]
[null,"WH Pedestrian","P2.0S",24,"0,47",30,210,250,300,400,500]
[null,"WH Pedestrian","S1.0E",24,"0,74",30,150,200]
[null,"WH Pedestrian","S1.2E",24,"0,84",30,200]
[null,"WH Pedestrian","S1.0",24,"0,68",30,150,200]
[null,"WH Pedestrian","S1.2-1.4 (IL)",24,"0,78",30,200,210,250,315,375]
[null,"WH Pedestrian","S1.4-2.0 (IL)",24,"0,89",30,210,250,315,375]
[null,null,"to add new truck options to the tool, insert rows above this entire row"]
[null,"WH Rider","RP2.0-2.5N",24,"0,4",30,465,null,null,null,null,null,null,null,null,"do not delete row"]
[null,"WH Rider","RS1.6",24,"1,26",30,465]
[null,"WH Rider","R1.4-1.6",48,"3,8",30,420,465,560,620,700,775]
[null,"WH Rider","R1.6HD-2.5",48,"4,6",30,560,620,700,775,840,930]
[null,"WH Rider","R1.0-1.2E",48,"2,8",30,280,310,420,465,560,620]
[null,"WH Rider","R1.4E",48,"4,4",30,420,465,560,620]
[null,null,"to add new truck options to the tool, insert rows above this entire row"]
[null,"Counterbalance","J1.5-1.6XNT_SWB",48,"3,9",20,420,500]
[null,"Counterbalance","J1.6-2.0XNT_MWB",48,"4,2",20,575,625]
[null,"Counterbalance","J1.6-2.0XNT_LWB",48,"4,7",20,690,750]
[null,"Counterbalance","J1.6-1.8XN_MWB",48,"5,1",20,575,625]
[null,"Counterbalance","J1.6-2.0XN_LWB",48,"5,3",20,690,750]
[null,"Counterbalance","J2.2-2.5XN_MWB",80,"6,7",20,560,620,null,null,null,null,null,null,null,"do not delete row"]
[null,"Counterbalance","J2.5-3.5XN_LWB",80,"7,9",20,700,775]
[null,"Counterbalance","J4.0-5.5XN",80,"10,6",20,840,930]
[null,null,"to add new truck options to the tool, insert rows above this entire row"]
[null,null,null,null,null,null,null,null,null,null,null,null,null,null,null,"do not delete row"]
[]
[null,null,"to add new truck options to the tool, insert rows above this entire row"]
[]
[null,null,"to add new truck options to the tool, insert rows above this entire row"]
[]
[null,null,"to add new truck options to the tool, insert rows above this entire row"]
[]
[]
[null,"Table 2: Lead battery chemistry",null,"Add the battery chemistry for each lead acid battery- ordered by truck voltage. Every lead acid battery in table1 must also appear in table 2."]
[null,"Voltage (V) (keep similar voltages in the same section","Pb battery (Ah)","Cell type number","Cell Type (PzS/PzB)"]
[null,"Select","Select",0,"PzB"]
[null,24,150,2,"PzB"]
[null,24,200,2,"PzB"]
[null,24,210,2,"PzS"]
[null,24,250,2,"PzS"]
[null,24,300,3,"PzB"]
[null,24,315,2,"PzS"]
[null,24,375,2,"PzS"]
[null,24,400,4,"PzB"]
[null,24,465,3,"PzS"]
[null,24,500,5,"PzB"]
[null,24,620,4,"PzS"]
[null,"to add new truck options to the tool, insert rows above this entire row"]
[null,48,280,3,"PzS"]
[null,48,310,3,"PzS"]
[null,48,420,4,"PzS"]
[null,48,465,3,"PzS"]
[null,48,500,4,"PzS"]
[null,48,560,4,"PzS"]
[null,48,575,5,"PzS"]
[null,48,620,4,"PzS"]
[null,48,625,5,"PzS"]
[null,48,690,6,"PzS"]
[null,48,700,5,"PzS"]
[null,48,750,6,"PzS"]
[null,48,775,5,"PzS"]
[null,48,840,6,"PzS"]
[null,48,930,6,"PzS"]
[null,"to add new truck options to the tool, insert rows above this entire row"]
[null,80,560,4,"PzS"]
[null,80,620,4,"PzS"]
[null,80,700,5,"PzS"]
[null,80,775,5,"PzS"]
[null,80,840,6,"PzS"]
[null,80,930,6,"PzS"]
[null,"to add new truck options to the tool, insert rows above this entire row"]
[null,{"$f":"D43","v":0}]
[]
[null,"to add new truck options to the tool, insert rows above this entire row"]
[null,{"$f":"D46","v":0}]
[null,"to add new truck options to the tool, insert rows above this entire row"]
[null,{"$f":"D48","v":0}]
[null,"to add new truck options to the tool, insert rows above this entire row"]
[]
[]
[null,"Table 3: Truck and Lithium batteries",null,"Add the Lithium batteries that are available for each truck model - ordered by truck voltage."]
[null,"Truck Model                                         (must be identical names to table 1 INCLUDING WHITESPACE AFTER THE NAME, one line per truck)","Truck Voltage (V)                   (keep as same as in table 1)","Truck Useable energy as % of Nominal Energy of battery","Truck maximum DOD allowed AS PERCENTAGE OF USEABLE ENERGY ","Available Li batteries (Ah)",null,null,null,null,null,"to insert new Li battery columns to the tool, insert to the left of this column"]
[null,"Select","Select",null,null,"Select"]
[null,"P1.6-1.8",24,85,2,56,112,50,100]
[null,"P2.0",24,85,2,56,112,50,100]
[null,"LO2.0-2.0S",24,85,2,300]
[null,"LO2.5",24,85,2,400]
[null,"LO5.0T",24,85,2,300,400]
[null,"LO7.0T",24,85,2,400]
[null,"P2.0S",24,85,2,200,300]
[null,"S1.0E",24,85,2,100,200]
[null,"S1.2E",24,85,2,200]
[null,"S1.0",24,85,2,100,200]
[null,"S1.2-1.4 (IL)",24,85,2,200]
[null,"S1.4-2.0 (IL)",24,85,2,300]
[null,null,"to add new truck options to the tool, insert rows above this entire row"]
[null,"RP2.0-2.5N",24,85,2,300]
[null,"RS1.6",24,85,2,300]
[null,"R1.4-1.6",48,85,2,450,600]
[null,"R1.6HD-2.5",48,85,2,450,600]
[null,"R1.0-1.2E",48,85,2,300]
[null,"R1.4E",48,85,2,450]
[null,null,"to add new truck options to the tool, insert rows above this entire row"]
[null,"J1.5-1.6XNT_SWB",48,85,4,300,400]
[null,"J1.6-2.0XNT_MWB",48,85,4,300,450,600]
[null,"J1.6-2.0XNT_LWB",48,85,4,300,450,600]
[null,"J1.6-1.8XN_MWB",48,85,4,300,450,600]
[null,"J1.6-2.0XN_LWB",48,85,4,300,450,600]
[null,"J2.2-2.5XN_MWB",80,85,4,450,600]
[null,"J2.5-3.5XN_LWB",80,85,4,450,600]
[null,"J4.0-5.5XN",80,85,4,600]
[null,null,"to add new truck options to the tool, insert rows above this entire row"]
[]
[]
[null,null,"to add new truck options to the tool, insert rows above this entire row"]
[]
[null,null,"to add new truck options to the tool, insert rows above this entire row"]
[]
[null,null,"to add new truck options to the tool, insert rows above this entire row"]
[]
[]
[null,"Table 4: Lithium batteries and chargers",null,null,"Add the Chargers that are available for each Lithium battery. Each Lithium battery in table 3 must also appear in table 4. "]
[null,null,"Truck Voltage (V)                                     (ignore the higher lithium ion battery voltages in table 5, use the values as in table 1) (keep similar voltages in the same section","Li battery capacity (Ah)","Availiable Chargers (A)",null,null,null,null,"to insert new Li battery columns to the tool, insert to the left of this column"]
[null,"Select","Select","Select","Select"]
[null,"WH Pedestrian",24,56,20]
[null,"WH Pedestrian",24,112,20]
[null,"WH Pedestrian",24,50,60]
[null,"WH Pedestrian",24,100,60,100]
[null,"WH Pedestrian/WH Rider",24,300,150,250,320]
[null,"WH Pedestrian",24,400,150,250,320]
[null,"WH Pedestrian",24,200,150,250]
[null,null,null,"to add new truck options to the tool, insert rows above this entire row"]
[null,"WH Rider",48,300,150,250,320]
[null,"WH Rider",48,450,150,250,320,500]
[null,"WH Rider",48,600,150,250,320,500]
[]
[null,"Counterbalance",48,300,70,150,250]
[null,"Counterbalance",48,400,70,150,250,320]
[null,"Counterbalance",48,450,70,150,250,320]
[null,"Counterbalance",48,600,70,150,250,320,500]
[null,null,null,"to add new truck options to the tool, insert rows above this entire row"]
[null,"Counterbalance",80,450,160,250,320]
[null,"Counterbalance",80,600,160,250,320,500]
[null,null,null,"to add new truck options to the tool, insert rows above this entire row"]
[null,0,0]
[]
[null,null,null,"to add new truck options to the tool, insert rows above this entire row"]
[null,{"$f":"D46","v":0},{"$f":"E46","v":0}]
[null,null,null,"to add new truck options to the tool, insert rows above this entire row"]
[null,{"$f":"D48","v":0},{"$f":"E48","v":0}]
[null,null,null,"to add new truck options to the tool, insert rows above this entire row"]
[]
[]
[null,"Table 5: voltages of batteries"]
[null,"Pb voltage equivalent (V)","Li voltage equivalent (V)","Only update table 5 if you are adding a new truck class"]
[null,"Select","Select"]
[null,24,25.6]
[null,48,51.2]
[null,80,76.8]
[null,350,350]
[null,{"$f":"D46","v":0}]
[null,{"$f":"D48","v":0}]
[]
[null,"charging Equipment cost per truck"]
[null,"type of truck","equipment cost"]
[null,"Select",0,"do not delete this row"]
[null,"WH Pedestrian",400]
[null,"WH Rider",600]
[null,"Counterbalance",1200]

{"sheet":"Variables","index":3,"n_rows":88,"n_cols":9,"rows_kept":88,"cut":false,"hidden":true,"merged":[]}
[]
[]
[null,null,null,"only amend with improved figures"]
[null,null,null,"DO NOT AMEND"]
[]
[]
[null,null,null,"Application"]
[]
[null,"Hourly rate driver (EUR)","default","lowest allowed","greatest allowed"]
[null,null,30,2,100]
[]
[null,"Cost electricity ","Default"]
[null,"(€/kWh)",0.12]
[]
[null,"Weeks per year",48]
[]
[null,"CO2 production per energy from grid (kg/kWh)",0.54030800000000001,"As per standard EN 16796.  - is German reference and based on the mix of the German different electricity generation systems."]
[null,null,null,"note - Department for Business, Energy & Industrial Strategy (UK) uses 0.34885kg/kWh at 2017. Midac use 0.33kg/kWh"]
[null,null,null,"Lead acid "]
[]
[null,"Water cost per litre ","default","lowest allowed","greatest allowed"]
[null,"(eur)",0.4,0,6]
[]
[null,"Charger type",{"$f":"Calc2!C24","v":"Select"},{"$f":"Calc2!D24","v":"50 Hz"},{"$f":"Calc2!E24","v":"High Frequency"}]
[null,"Charger Efficiency",0,0.8,0.9]
[null,null,null,"0.75-0.8"]
[null,"Charger Voltage (V) per cell",2.2999999999999998]
[]
[null,"battery in-truck connection time (mins)",4]
[]
[null,"Battery Efficiency",0.74,"0.69 As per midac battery per testing standard BS EN 16796-1:2016 or  DIN EN 16796-1:2017-01  “Energy efficiency of Industrial trucks – Test methods – Part 1: General”"]
[null,null,null,"Midac suggested using 0.80 for the moment"]
[]
[]
[]
[null,"Annual inspection cost per battery EUR",50]
[]
[null,"charging space per truck (m2)",3.5]
[null,"price per m2 over 5 years (EUR/m2)",{"$f":"60*5","v":300}]
[null,"price per truck charging area (EUR)",{"$f":"C38*C39","v":1050}]
[null,"Ventilation cost per truck (EUR)",200]
[null,"Protection cost per truck (EUR)",50]
[null,"water topup system per truck (EUR)",100]
[null,"Equipment cost per truck (EUR)",{"$f":"VLOOKUP(Inputs!F8,Trucks!B184:C204,2,FALSE)","v":0}]
[null,"TOTAL",{"$f":"SUM(C40:C44)","v":1400}]
[]
[]
[]
[]
[]
[]
[]
[]
[]
[]
[]
[]
[]
[]
[null,null,null,"Lithium ion"]
[]
[]
[null,"resale battery price / longer life adjustment as % of original battery price",0,{"$f":"\" =  EUR  \"&TEXT(Calc2!$C$102,\"0\")","v":" =  EUR  0"}]
[]
[null,"Li ion Battery efficiency",0.95,"supplied by midac via email 31/7/17 'efficiency generally recognised for LFP batteries\"",null,null,null,null,"0.95-0.97"]
[]
[null,"Charger Efficiencies",0.9,"supplied by midac via email 31/7/17 ",null,"0.91-0.9"]
[]
[null,"Charging connection time (mins)",1]
[]
[null,"Charger Factor",1]
[]
[null,"Travel plus return time to charging point",0]
[]
[null,"Annual inspection cost per battery EUR",50]
[]
[null,"Battery balancing time SOC cutoff (%) -default 80",80]
[null,"added minutes for balancing time -default 20",20]
[]
[null,"Chager Voltage (V) per battery"]
[null,"Pb voltage equivalent (V)                  if you want to change figures in this row, do so on the 'Trucks' tab","Li voltage equivalent (V)                          if you want to change figures in this row, do so on the 'Trucks' tab","Li Charger Voltage"]
[null,{"$f":"Trucks!B174","v":"Select"},{"$f":"Trucks!C174","v":"Select"},"Select"]
[null,{"$f":"Trucks!B175","v":24},{"$f":"Trucks!C175","v":25.6},25.6]
[null,{"$f":"Trucks!B176","v":48},{"$f":"Trucks!C176","v":51.2},51.2]
[null,{"$f":"Trucks!B177","v":80},{"$f":"Trucks!C177","v":76.8},76.8]
[null,{"$f":"Trucks!B178","v":350},{"$f":"Trucks!C178","v":350},350]
[null,{"$f":"Trucks!B179","v":0},{"$f":"Trucks!C179","v":0},0]
[null,{"$f":"Trucks!B180","v":0},{"$f":"Trucks!C180","v":0},{"$f":"C88","v":0}]

{"sheet":"Calc1","index":4,"n_rows":126,"n_cols":39,"rows_kept":126,"cut":false,"hidden":true,"merged":[[85,7,101,7],[10,31,10,35],[11,1,11,7],[45,1,45,7],[14,18,14,20],[14,22,14,24],[14,25,14,27],[11,34,11,35]]}
[]
[]
[]
[]
[]
[null,null,"Operating hours per annum (decimal)",{"$f":"(Calc1!D9*Inputs!F31*Variables!C15)","v":{"$error":"#VALUE!"}}]
[null,null,"Estimated idle time %",{"$f":"(1-Inputs!F33/(Calc1!D9*Inputs!F31*Variables!C15))","v":{"$error":"#VALUE!"}}]
[null,null,"Charging time per day",{"$f":"N58","v":"23:00:00"}]
[null,null,"Operating hours per day (decimal)",{"$f":"N57*24","v":1}]
[null,null,"Break Hours per day (decimal)",{"$f":"N59*24","v":0},null,null,null,null,null,null,"LI-ion Energy useage based on shift patterns"]
[null,null,"Number of breaks ",{"$f":"COUNT(L19,L21,L23,L25,L27,L29,L31,L33,L35,L37,L39,L41,L43,L45,L47,L49,L51,L53)","v":1},null,null,null,null,null,null,null,null,null,null,null,null,null,null,null,null,null,null,null,null,null,null,null,null,null,null,null,"Graph"]
[null,"Battery and charger",null,null,null,null,null,null,null,null,null,"Availiable Capacity (kWh)",{"$f":"G22","v":{"$error":"#VALUE!"}},null,null,null,null,"battery balancing time SOC threshold  (%)",{"$f":"Variables!C77","v":80},null,null,null,null,null,null,null,null,null,null,null,null,"Period end","SOC (kWh)","SOC (%)","DOD line"]
[null,null,null,"Lead Acid",null,null,"lithium ion",null,null,null,null,"consumption rate (kWh/h)",{"$f":"D26","v":0},null,null,null,null,"battery balancing time SOC threshold (kWh))",{"$f":"S12/100*M12","v":{"$error":"#VALUE!"}},null,{"$f":"Variables!C78","v":20},"added mins for balancing",null,null,null,null,null,null,null,null,null,{"$f":"AA17","v":"00:00:00"},{"$f":"AB17","v":{"$error":"#VALUE!"}},{"$f":"AG13/$M$12","v":{"$error":"#VALUE!"}},null,null,null,null,1]
[null,null,"Voltage",{"$f":"VLOOKUP(Inputs!F10,Trucks!C13:D49,2,FALSE)","v":"Select"},null,null,{"$f":"VLOOKUP(D14,Trucks!B173:C180,2,FALSE)","v":"Select"},null,null,null,null,"charge rate (kWh/h)",{"$f":"G19","v":{"$error":"#VALUE!"}},null,null,null,null,"Charge rate during balancing (kWh/h)",{"$f":"(M12-S13)/(((M12-S13)/M14)+U13/60)","v":{"$error":"#VALUE!"}},null,null,null,null,null,null,null,null,null,null,null,"discharge",{"$f":"AA18","v":"00:30:00"},{"$f":"AB18","v":{"$error":"#VALUE!"}},{"$f":"AG14/$M$12","v":{"$error":"#VALUE!"}},{"$f":"AF13","v":"00:00:00"},{"$f":"Q59","v":0},null,null,0.89276960784313431]
[null,null,"Battery Capacity (Ah)",{"$f":"Inputs!F45","v":"Select"},null,null,{"$f":"Inputs!F62","v":"Select"},null,null,null,null,null,null,null,null,null,null,null,null,null,null,null,null,null,null,null,null,null,null,null,null,{"$f":"T19","v":{"$error":"#VALUE!"}},{"$f":"U19","v":{"$error":"#VALUE!"}},{"$f":"AG15/$M$12","v":{"$error":"#VALUE!"}},{"$f":"AF89","v":"01:00:00"},{"$f":"AJ14","v":0},null,null,0.89276960784313431]
[null,null,"Charger (A)",null,null,null,{"$f":"Inputs!F63","v":"Select"},null,null,null,"charge/discharge","start time","end time","duration ","[for Warning] check end time after finish time (1=warning)","Consumption (kWh) for total per day","[For warning] Max DOD been exceeded? (Yes=1)","[logic for table] is end SOC < threshold?","start","end","SOC","[logic for table] will it go over 100%?","start","end","SOC","start","end","SOC",null,null,null,{"$f":"X19","v":{"$error":"#VALUE!"}},{"$f":"Y19","v":{"$error":"#VALUE!"}},{"$f":"AG16/$M$12","v":{"$error":"#VALUE!"}},null,null,null,null,0.99999999999999944]
[null,null,"Cells",{"$f":"D14/2","v":{"$error":"#VALUE!"}},null,null,null,null,null,null,null,null,null,null,null,null,null,null,null,null,null,null,null,null,null,null,{"$f":"Inputs!F15","v":"00:00:00"},{"$f":"M12","v":{"$error":"#VALUE!"}},null,null,null,{"$f":"AA19","v":"00:30:00"},{"$f":"AB19","v":{"$error":"#VALUE!"}},{"$f":"AG17/$M$12","v":{"$error":"#VALUE!"}},null,null,null,null,0.99999999999999944]
[null,null,"Hours to Charge",null,null,null,{"$f":"Inputs!F62/Inputs!F63","v":{"$error":"#VALUE!"}},null,null,null,"discharge",{"$f":"Inputs!F15","v":"00:00:00"},{"$f":"IF(L19=\"No Break\",L20,L19)","v":"00:30:00"},{"$f":"M18-L18","v":"00:30:00"},null,{"$f":"N18*24*$M$13","v":0},{"$f":"IF(AB18<$Q$59*$M$12,1,0)","v":{"$error":"#VALUE!"}},null,{"$f":"Inputs!F15","v":"00:00:00"},null,null,null,null,null,null,null,{"$f":"M18","v":"00:30:00"},{"$f":"AB17-(AA18-S18)*24*$M$13","v":{"$error":"#VALUE!"}},null,null,"discharge",{"$f":"AA20","v":"01:00:00"},{"$f":"AB20","v":{"$error":"#VALUE!"}},{"$f":"AG18/$M$12","v":{"$error":"#VALUE!"}},null,null,null,null,0.69618055555555503]
[null,null,"Charge rate (kWh/hour)",null,"n/a for this tool",null,{"$f":"G21/G18","v":{"$error":"#VALUE!"}},null,null,null,"charge 1",{"$f":"IF(Inputs!D18=0,\"No Break\",Inputs!D18)","v":"00:30:00"},{"$f":"IF(L19=\"No Break\",\"No Break\",L19+N19)","v":"00:30:00"},{"$f":"Inputs!D19/60/24","v":"00:00:00"},{"$f":"IF(M19=\"No Break\",IF(O17=1,1,0),IF(Calc1!M19>Calc1!M20,1,\"\"))","v":""},null,null,{"$f":"IF(S19=\"No break\",\"\",IF((AA19-S19)*24*$M$14+AB18<$S$13,1,\"\"))","v":{"$error":"#VALUE!"}},{"$f":"L19","v":"00:30:00"},{"$f":"IF(AND(AB18<$S$13,R19=1),AA19,IF(AB18<$S$13,S19+($S$13-AB18)/$M$14/24,S19))","v":{"$error":"#VALUE!"}},{"$f":"IF(AND(AB18<$S$13,R19=1),AB18+(T19-S19)*24*$M$14,IF(AB18<=$S$13,$S$13,AB18))","v":{"$error":"#VALUE!"}},{"$f":"IF(L19=\"No Break\",\"\",IF((AA19-W19)*24*$S$14+U19>$M$12,1,\"\"))","v":{"$error":"#VALUE!"}},{"$f":"T19","v":{"$error":"#VALUE!"}},{"$f":"IF(R19=1,W19,IF(V19=1,W19+($M$12-U19)/$S$14/24,AA19))","v":{"$error":"#VALUE!"}},{"$f":"IF(R19=1,U19,U19+(X19-W19)*24*$S$14)","v":{"$error":"#VALUE!"}},{"$f":"X19","v":{"$error":"#VALUE!"}},{"$f":"IF(L19=\"No Break\",Z19,L19+N19)","v":"00:30:00"},{"$f":"Y19","v":{"$error":"#VALUE!"}},null,null,null,{"$f":"T21","v":"01:00:00"},{"$f":"U21","v":{"$error":"#VALUE!"}},{"$error":"#VALUE!"},null,null,null,null,0.8]
[null,null,null,null,null,null,null,null,null,null,"discharge",{"$f":"IF(OR(L19=\"No Break\",L19=0),M20,M19)","v":"00:30:00"},{"$f":"IF(L21=\"No Break\",L22,L21)","v":"01:00:00"},{"$f":"IF(M20-L20<0,0,M20-L20)","v":"00:30:00"},null,{"$f":"N20*24*$M$13","v":0},{"$f":"IF(AB20<$Q$59*$M$12,1,0)","v":{"$error":"#VALUE!"}},null,{"$f":"L20","v":"00:30:00"},null,null,null,null,null,null,null,{"$f":"IF(OR(L21=\"No Break\",L21=0), S22,S21)","v":"01:00:00"},{"$f":"AB19-(AA20-S20)*24*$M$13","v":{"$error":"#VALUE!"}},null,null,null,{"$f":"X21","v":"01:00:00"},{"$f":"Y21","v":{"$error":"#VALUE!"}},{"$error":"#VALUE!"},null,null,null,null,0.93134383530482179]
[null,null,"Nominal Energy per battery  (kWh)",{"$f":"Inputs!F45*D14/1000","v":{"$error":"#VALUE!"}},null,null,{"$f":"Inputs!F62*G14/1000","v":{"$error":"#VALUE!"}},null,null,null,"charge 2",{"$f":"IF(Inputs!F18=0,\"No Break\",Inputs!F18)","v":"No Break"},{"$f":"IF(L21=\"No Break\",\"No Break\",L21+N21)","v":"No Break"},{"$f":"IF(L21=\"No Break\",0,Inputs!F19/24/60)","v":"00:00:00"},{"$f":"IF(M21=\"No Break\",IF(O19=1,1,0),IF(Calc1!M21>Calc1!M22,1,\"\"))","v":0},null,null,{"$f":"IF(L21=\"No break\",\"\",IF((AA21-S21)*24*$M$14+AB20<$S$13,1,\"\"))","v":""},{"$f":"IF(L21=\"No Break\",AA20,L21)","v":"01:00:00"},{"$f":"IF(L21=\"No Break\",S21,IF(AND(AB20<$S$13,R21=1),AA21,IF(AB20<$S$13,S21+($S$13-AB20)/$M$14/24,S21)))","v":"01:00:00"},{"$f":"IF(L21=\"No Break\",AB20,IF(AND(AB20<$S$13,R21=1),AB20+(T21-S21)*24*$M$14,IF(AB20<=$S$13,$S$13,AB20)))","v":{"$error":"#VALUE!"}},{"$f":"IF(L21=\"No Break\",\"\",IF((AA21-W21)*24*$S$14+U21>$M$12,1,\"\"))","v":""},{"$f":"T21","v":"01:00:00"},{"$f":"IF(L21=\"No Break\",W21,IF(R21=1,W21,IF(V21=1,W21+($M$12-U21)/$S$14/24,AA21)))","v":"01:00:00"},{"$f":"IF(R21=1,U21,U21+(X21-W21)*24*$S$14)","v":{"$error":"#VALUE!"}},{"$f":"X21","v":"01:00:00"},{"$f":"IF(L21=\"No Break\",Z21,L21+N21)","v":"01:00:00"},{"$f":"Y21","v":{"$error":"#VALUE!"}},null,null,null,{"$f":"AA21","v":"01:00:00"},{"$f":"AB21","v":{"$error":"#VALUE!"}},{"$error":"#VALUE!"},null,null,null,null,0.93134383530482179]
[null,null,"Availiable Energy Per battery (kWh)",null,null,null,{"$f":"G21*Calc2!C98/100","v":{"$error":"#VALUE!"}},null,null,null,"discharge",{"$f":"IF(OR(L21=\"No Break\",L21=0),M22,M21)","v":"01:00:00"},{"$f":"IF(L23=\"No Break\",L24,L23)","v":"01:00:00"},{"$f":"IF(M22-L22<0,0,M22-L22)","v":"00:00:00"},null,{"$f":"N22*24*$M$13","v":0},{"$f":"IF(AB22<$Q$59*$M$12,1,0)","v":{"$error":"#VALUE!"}},null,{"$f":"L22","v":"01:00:00"},null,null,null,null,null,null,null,{"$f":"IF(OR(L23=\"No Break\",L23=0), S24,S23)","v":"01:00:00"},{"$f":"AB21-(AA22-S22)*24*$M$13","v":{"$error":"#VALUE!"}},null,null,"discharge",{"$f":"AA22","v":"01:00:00"},{"$f":"AB22","v":{"$error":"#VALUE!"}},{"$error":"#VALUE!"},null,null,null,null,0.68113958693880861]
[null,null,"Useable energy per battery (kWh)",{"$f":"D21*Calc2!C82/100","v":{"$error":"#VALUE!"}},null,null,{"$f":"G22*Calc2!C99/100","v":{"$error":"#VALUE!"}},null,null,null,"charge 3",{"$f":"IF(Inputs!H18=0,\"No Break\",Inputs!H18)","v":"No Break"},{"$f":"IF(L23=\"No Break\",\"No Break\",L23+N23)","v":"No Break"},{"$f":"IF(L23=\"No Break\",0,Inputs!H19/60/24)","v":"00:00:00"},{"$f":"IF(M23=\"No Break\",IF(O21=1,1,0),IF(Calc1!M23>Calc1!M24,1,\"\"))","v":0},null,null,{"$f":"IF(L23=\"No break\",\"\",IF((AA23-S23)*24*$M$14+AB22<$S$13,1,\"\"))","v":""},{"$f":"IF(L23=\"No Break\",AA22,L23)","v":"01:00:00"},{"$f":"IF(L23=\"No Break\",S23,IF(AND(AB22<$S$13,R23=1),AA23,IF(AB22<$S$13,S23+($S$13-AB22)/$M$14/24,S23)))","v":"01:00:00"},{"$f":"IF(L23=\"No Break\",AB22,IF(AND(AB22<$S$13,R23=1),AB22+(T23-S23)*24*$M$14,IF(AB22<=$S$13,$S$13,AB22)))","v":{"$error":"#VALUE!"}},{"$f":"IF(L23=\"No Break\",\"\",IF((AA23-W23)*24*$S$14+U23>$M$12,1,\"\"))","v":""},{"$f":"T23","v":"01:00:00"},{"$f":"IF(L23=\"No Break\",W23,IF(R23=1,W23,IF(V23=1,W23+($M$12-U23)/$S$14/24,AA23)))","v":"01:00:00"},{"$f":"IF(R23=1,U23,U23+(X23-W23)*24*$S$14)","v":{"$error":"#VALUE!"}},{"$f":"X23","v":"01:00:00"},{"$f":"IF(L23=\"No Break\",Z23,L23+N23)","v":"01:00:00"},{"$f":"Y23","v":{"$error":"#VALUE!"}},null,null,null,{"$f":"T23","v":"01:00:00"},{"$f":"U23","v":{"$error":"#VALUE!"}},{"$error":"#VALUE!"},null,null,null,null,0.8]
[null,null,null,null,null,null,null,null,null,null,"discharge",{"$f":"IF(OR(L23=\"No Break\",L23=0),M24,M23)","v":"01:00:00"},{"$f":"IF(L25=\"No Break\",L26,L25)","v":"01:00:00"},{"$f":"IF(M24-L24<0,0,M24-L24)","v":"00:00:00"},null,{"$f":"N24*24*$M$13","v":0},{"$f":"IF(AB24<$Q$59*$M$12,1,0)","v":{"$error":"#VALUE!"}},null,{"$f":"L24","v":"01:00:00"},null,null,null,null,null,null,null,{"$f":"IF(OR(L25=\"No Break\",L25=0), S26,S25)","v":"01:00:00"},{"$f":"AB23-(AA24-S24)*24*$M$13","v":{"$error":"#VALUE!"}},null,null,null,{"$f":"X23","v":"01:00:00"},{"$f":"Y23","v":{"$error":"#VALUE!"}},{"$error":"#VALUE!"},null,null,null,null,0.92506193849400553]
[null,null,"Energy consumption rate during use (kWh/h)",{"$f":"Inputs!F37","v":0},null,null,{"$f":"Inputs!F37","v":0},null,null,null,"charge 4",{"$f":"IF(Inputs!J18=0,\"No Break\",Inputs!J18)","v":"No Break"},{"$f":"IF(L25=\"No Break\",\"No Break\",L25+N25)","v":"No Break"},{"$f":"IF(L25=\"No Break\",0,Inputs!J19/60/24)","v":"00:00:00"},{"$f":"IF(M25=\"No Break\",IF(O23=1,1,0),IF(Calc1!M25>Calc1!M26,1,\"\"))","v":0},null,null,{"$f":"IF(L25=\"No break\",\"\",IF((AA25-S25)*24*$M$14+AB24<$S$13,1,\"\"))","v":""},{"$f":"IF(L25=\"No Break\",AA24,L25)","v":"01:00:00"},{"$f":"IF(L25=\"No Break\",S25,IF(AND(AB24<$S$13,R25=1),AA25,IF(AB24<$S$13,S25+($S$13-AB24)/$M$14/24,S25)))","v":"01:00:00"},{"$f":"IF(L25=\"No Break\",AB24,IF(AND(AB24<$S$13,R25=1),AB24+(T25-S25)*24*$M$14,IF(AB24<=$S$13,$S$13,AB24)))","v":{"$error":"#VALUE!"}},{"$f":"IF(L25=\"No Break\",\"\",IF((AA25-W25)*24*$S$14+U25>$M$12,1,\"\"))","v":""},{"$f":"T25","v":"01:00:00"},{"$f":"IF(L25=\"No Break\",W25,IF(R25=1,W25,IF(V25=1,W25+($M$12-U25)/$S$14/24,AA25)))","v":"01:00:00"},{"$f":"IF(R25=1,U25,U25+(X25-W25)*24*$S$14)","v":{"$error":"#VALUE!"}},{"$f":"X25","v":"01:00:00"},{"$f":"IF(L25=\"No Break\",Z25,L25+N25)","v":"01:00:00"},{"$f":"Y25","v":{"$error":"#VALUE!"}},null,null,null,{"$f":"AA23","v":"01:00:00"},{"$f":"AB23","v":{"$error":"#VALUE!"}},{"$error":"#VALUE!"},null,null,null,null,0.92506193849400553]
[null,null,"Energy consumption rate during use including idle time (kWh/h)",{"$f":"D25*(1-Inputs!F35/100)","v":0},null,null,{"$f":"G25*(1-Inputs!F35/100)","v":0},null,null,null,"Discharge",{"$f":"IF(OR(L25=\"No Break\",L25=0),M26,M25)","v":"01:00:00"},{"$f":"IF(L27=\"No Break\",L28,L27)","v":"01:00:00"},{"$f":"IF(M26-L26<0,0,M26-L26)","v":"00:00:00"},null,{"$f":"N26*24*$M$13","v":0},{"$f":"IF(AB26<$Q$59*$M$12,1,0)","v":{"$error":"#VALUE!"}},null,{"$f":"L26","v":"01:00:00"},null,null,null,null,null,null,null,{"$f":"IF(OR(L27=\"No Break\",L27=0), S28,S27)","v":"01:00:00"},{"$f":"AB25-(AA26-S26)*24*$M$13","v":{"$error":"#VALUE!"}},null,null,"discharge",{"$f":"AA24","v":"01:00:00"},{"$f":"AB24","v":{"$error":"#VALUE!"}},{"$error":"#VALUE!"},null,null,null,null,0.78208808228485693]
[null,null,"Used energy per day (kWh)",{"$f":"($D$9*D26)","v":0},null,null,{"$f":"D27","v":0},null,null,null,"charge 5",{"$f":"IF(Inputs!L18=0,\"No Break\",Inputs!L18)","v":"No Break"},{"$f":"IF(L27=\"No Break\",\"No Break\",L27+N27)","v":"No Break"},{"$f":"IF(L27=\"No Break\",0,Inputs!L19/60/24)","v":"00:00:00"},{"$f":"IF(M27=\"No Break\",IF(O25=1,1,0),IF(Calc1!M27>Calc1!M28,1,\"\"))","v":0},null,null,{"$f":"IF(L27=\"No break\",\"\",IF((AA27-S27)*24*$M$14+AB26<$S$13,1,\"\"))","v":""},{"$f":"IF(L27=\"No Break\",AA26,L27)","v":"01:00:00"},{"$f":"IF(L27=\"No Break\",S27,IF(AND(AB26<$S$13,R27=1),AA27,IF(AB26<$S$13,S27+($S$13-AB26)/$M$14/24,S27)))","v":"01:00:00"},{"$f":"IF(L27=\"No Break\",AB26,IF(AND(AB26<$S$13,R27=1),AB26+(T27-S27)*24*$M$14,IF(AB26<=$S$13,$S$13,AB26)))","v":{"$error":"#VALUE!"}},{"$f":"IF(L27=\"No Break\",\"\",IF((AA27-W27)*24*$S$14+U27>$M$12,1,\"\"))","v":""},{"$f":"T27","v":"01:00:00"},{"$f":"IF(L27=\"No Break\",W27,IF(R27=1,W27,IF(V27=1,W27+($M$12-U27)/$S$14/24,AA27)))","v":"01:00:00"},{"$f":"IF(R27=1,U27,U27+(X27-W27)*24*$S$14)","v":{"$error":"#VALUE!"}},{"$f":"X27","v":"01:00:00"},{"$f":"IF(L27=\"No Break\",Z27,L27+N27)","v":"01:00:00"},{"$f":"Y27","v":{"$error":"#VALUE!"}},null,null,null,{"$f":"T25","v":"01:00:00"},{"$f":"U25","v":{"$error":"#VALUE!"}},{"$error":"#VALUE!"},null,null,null,null,0.78208808228485693]
[null,null,null,null,null,null,null,null,null,null,"discharge",{"$f":"IF(OR(L27=\"No Break\",L27=0),M28,M27)","v":"01:00:00"},{"$f":"IF(L29=\"No Break\",L30,L29)","v":"01:00:00"},{"$f":"IF(M28-L28<0,0,M28-L28)","v":"00:00:00"},null,{"$f":"N28*24*$M$13","v":0},{"$f":"IF(AB28<$Q$59*$M$12,1,0)","v":{"$error":"#VALUE!"}},null,{"$f":"L28","v":"01:00:00"},null,null,null,null,null,null,null,{"$f":"IF(OR(L29=\"No Break\",L29=0), S30,S29)","v":"01:00:00"},{"$f":"AB27-(AA28-S28)*24*$M$13","v":{"$error":"#VALUE!"}},null,null,null,{"$f":"X25","v":"01:00:00"},{"$f":"Y25","v":{"$error":"#VALUE!"}},{"$error":"#VALUE!"},null,null,null,null,0.78208808228485693]
[null,null,null,null,null,null,null,null,null,null,"charge 6",{"$f":"IF(Inputs!N18=0,\"No Break\",Inputs!N18)","v":"No Break"},{"$f":"IF(L29=\"No Break\",\"No Break\",L29+N29)","v":"No Break"},{"$f":"IF(L29=\"No Break\",0,Inputs!N19/60/24)","v":"00:00:00"},{"$f":"IF(M29=\"No Break\",IF(O27=1,1,0),IF(Calc1!M29>Calc1!M30,1,\"\"))","v":0},null,null,{"$f":"IF(L29=\"No break\",\"\",IF((AA29-S29)*24*$M$14+AB28<$S$13,1,\"\"))","v":""},{"$f":"IF(L29=\"No Break\",AA28,L29)","v":"01:00:00"},{"$f":"IF(L29=\"No Break\",S29,IF(AND(AB28<$S$13,R29=1),AA29,IF(AB28<$S$13,S29+($S$13-AB28)/$M$14/24,S29)))","v":"01:00:00"},{"$f":"IF(L29=\"No Break\",AB28,IF(AND(AB28<$S$13,R29=1),AB28+(T29-S29)*24*$M$14,IF(AB28<=$S$13,$S$13,AB28)))","v":{"$error":"#VALUE!"}},{"$f":"IF(L29=\"No Break\",\"\",IF((AA29-W29)*24*$S$14+U29>$M$12,1,\"\"))","v":""},{"$f":"T29","v":"01:00:00"},{"$f":"IF(L29=\"No Break\",W29,IF(R29=1,W29,IF(V29=1,W29+($M$12-U29)/$S$14/24,AA29)))","v":"01:00:00"},{"$f":"IF(R29=1,U29,U29+(X29-W29)*24*$S$14)","v":{"$error":"#VALUE!"}},{"$f":"X29","v":"01:00:00"},{"$f":"IF(L29=\"No Break\",Z29,L29+N29)","v":"01:00:00"},{"$f":"Y29","v":{"$error":"#VALUE!"}},null,null,null,{"$f":"AA25","v":"01:00:00"},{"$f":"AB25","v":{"$error":"#VALUE!"}},{"$error":"#VALUE!"},null,null,null,null,0.78208808228485693]
[null,null,"mains energy per charge (of useable range) (kWh)",{"$f":"Inputs!F45*D14*Calc2!C82/100*Calc2!C84/Calc2!C85/Variables!C31/1000","v":{"$error":"#VALUE!"}},null,null,{"$f":"Inputs!F62*Calc2!C100/100*Calc2!C104*Variables!C71/Variables!C65/Variables!C67/1000","v":{"$error":"#VALUE!"}},"capacity * DOD * battery voltage * charge factor/ battery efficiency / charger efficiency ",null,null,"discharge",{"$f":"IF(OR(L29=\"No Break\",L29=0),M30,M29)","v":"01:00:00"},{"$f":"IF(L31=\"No Break\",L32,L31)","v":"01:00:00"},{"$f":"IF(M30-L30<0,0,M30-L30)","v":"00:00:00"},null,{"$f":"N30*24*$M$13","v":0},{"$f":"IF(AB30<$Q$59*$M$12,1,0)","v":{"$error":"#VALUE!"}},null,{"$f":"L30","v":"01:00:00"},null,null,null,null,null,null,null,{"$f":"IF(OR(L31=\"No Break\",L31=0), S32,S31)","v":"01:00:00"},{"$f":"AB29-(AA30-S30)*24*$M$13","v":{"$error":"#VALUE!"}},null,null,"discharge",{"$f":"AA26","v":"01:00:00"},{"$f":"AB26","v":{"$error":"#VALUE!"}},{"$error":"#VALUE!"},null,null,null,null,0.78208808228485693]
[null,null,null,null,null,null,null,null,null,null,"charge 7",{"$f":"IF(Inputs!D22=0,\"No Break\",Inputs!D22)","v":"No Break"},{"$f":"IF(L31=\"No Break\",\"No Break\",L31+N31)","v":"No Break"},{"$f":"IF(L31=\"No Break\",0,Inputs!D23/60/24)","v":"00:00:00"},{"$f":"IF(M31=\"No Break\",IF(O29=1,1,0),IF(Calc1!M31>Calc1!M32,1,\"\"))","v":0},null,null,{"$f":"IF(L31=\"No break\",\"\",IF((AA31-S31)*24*$M$14+AB30<$S$13,1,\"\"))","v":""},{"$f":"IF(L31=\"No Break\",AA30,L31)","v":"01:00:00"},{"$f":"IF(L31=\"No Break\",S31,IF(AND(AB30<$S$13,R31=1),AA31,IF(AB30<$S$13,S31+($S$13-AB30)/$M$14/24,S31)))","v":"01:00:00"},{"$f":"IF(L31=\"No Break\",AB30,IF(AND(AB30<$S$13,R31=1),AB30+(T31-S31)*24*$M$14,IF(AB30<=$S$13,$S$13,AB30)))","v":{"$error":"#VALUE!"}},{"$f":"IF(L31=\"No Break\",\"\",IF((AA31-W31)*24*$S$14+U31>$M$12,1,\"\"))","v":""},{"$f":"T31","v":"01:00:00"},{"$f":"IF(L31=\"No Break\",W31,IF(R31=1,W31,IF(V31=1,W31+($M$12-U31)/$S$14/24,AA31)))","v":"01:00:00"},{"$f":"IF(R31=1,U31,U31+(X31-W31)*24*$S$14)","v":{"$error":"#VALUE!"}},{"$f":"X31","v":"01:00:00"},{"$f":"IF(L31=\"No Break\",Z31,L31+N31)","v":"01:00:00"},{"$f":"Y31","v":{"$error":"#VALUE!"}},null,null,null,{"$f":"T27","v":"01:00:00"},{"$f":"U27","v":{"$error":"#VALUE!"}},{"$error":"#VALUE!"},null,null,null,null,0.78208808228485693]
[null,null,"Mains energy per kWh of battery use",{"$f":"D30/D23","v":{"$error":"#VALUE!"}},null,null,{"$f":"G30/G23","v":{"$error":"#VALUE!"}},null,null,null,"discharge",{"$f":"IF(OR(L31=\"No Break\",L31=0),M32,M31)","v":"01:00:00"},{"$f":"IF(L33=\"No Break\",L34,L33)","v":"01:00:00"},{"$f":"IF(M32-L32<0,0,M32-L32)","v":"00:00:00"},null,{"$f":"N32*24*$M$13","v":0},{"$f":"IF(AB32<$Q$59*$M$12,1,0)","v":{"$error":"#VALUE!"}},null,{"$f":"L32","v":"01:00:00"},null,null,null,null,null,null,null,{"$f":"IF(OR(L33=\"No Break\",L33=0), S34,S33)","v":"01:00:00"},{"$f":"AB31-(AA32-S32)*24*$M$13","v":{"$error":"#VALUE!"}},null,null,null,{"$f":"X27","v":"01:00:00"},{"$f":"Y27","v":{"$error":"#VALUE!"}},{"$error":"#VALUE!"},null,null,null,null,0.78208808228485693]
[null,null,"Mains Energy per day (kWh)",{"$f":"D27*D32","v":{"$error":"#VALUE!"}},null,null,{"$f":"G27*G32","v":{"$error":"#VALUE!"}},null,null,null,"charge 8",{"$f":"IF(Inputs!F22=0,\"No Break\",Inputs!F22)","v":"No Break"},{"$f":"IF(L33=\"No Break\",\"No Break\",L33+N33)","v":"No Break"},{"$f":"IF(L33=\"No Break\",0,Inputs!F23/60/24)","v":"00:00:00"},{"$f":"IF(M33=\"No Break\",IF(O31=1,1,0),IF(Calc1!M33>Calc1!M34,1,\"\"))","v":0},null,null,{"$f":"IF(L33=\"No break\",\"\",IF((AA33-S33)*24*$M$14+AB32<$S$13,1,\"\"))","v":""},{"$f":"IF(L33=\"No Break\",AA32,L33)","v":"01:00:00"},{"$f":"IF(L33=\"No Break\",S33,IF(AND(AB32<$S$13,R33=1),AA33,IF(AB32<$S$13,S33+($S$13-AB32)/$M$14/24,S33)))","v":"01:00:00"},{"$f":"IF(L33=\"No Break\",AB32,IF(AND(AB32<$S$13,R33=1),AB32+(T33-S33)*24*$M$14,IF(AB32<=$S$13,$S$13,AB32)))","v":{"$error":"#VALUE!"}},{"$f":"IF(L33=\"No Break\",\"\",IF((AA33-W33)*24*$S$14+U33>$M$12,1,\"\"))","v":""},{"$f":"T33","v":"01:00:00"},{"$f":"IF(L33=\"No Break\",W33,IF(R33=1,W33,IF(V33=1,W33+($M$12-U33)/$S$14/24,AA33)))","v":"01:00:00"},{"$f":"IF(R33=1,U33,U33+(X33-W33)*24*$S$14)","v":{"$error":"#VALUE!"}},{"$f":"X33","v":"01:00:00"},{"$f":"IF(L33=\"No Break\",Z33,L33+N33)","v":"01:00:00"},{"$f":"Y33","v":{"$error":"#VALUE!"}},null,null,null,{"$f":"AA27","v":"01:00:00"},{"$f":"AB27","v":{"$error":"#VALUE!"}},{"$error":"#VALUE!"},null,null,null,null,0.78208808228485693]
[null,null,"Energy Cost Per day  (€)",{"$f":"D33*Calc2!C35","v":{"$error":"#VALUE!"}},null,null,{"$f":"G33*Calc2!C35","v":{"$error":"#VALUE!"}},null,null,null,"discharge",{"$f":"IF(OR(L33=\"No Break\",L33=0),M34,M33)","v":"01:00:00"},{"$f":"IF(L35=\"No Break\",L36,L35)","v":"01:00:00"},{"$f":"IF(M34-L34<0,0,M34-L34)","v":"00:00:00"},null,{"$f":"N34*24*$M$13","v":0},{"$f":"IF(AB34<$Q$59*$M$12,1,0)","v":{"$error":"#VALUE!"}},null,{"$f":"L34","v":"01:00:00"},null,null,null,null,null,null,null,{"$f":"IF(OR(L35=\"No Break\",L35=0), S36,S35)","v":"01:00:00"},{"$f":"AB33-(AA34-S34)*24*$M$13","v":{"$error":"#VALUE!"}},null,null,"discharge",{"$f":"AA28","v":"01:00:00"},{"$f":"AB28","v":{"$error":"#VALUE!"}},{"$error":"#VALUE!"},null,null,null,null,0.78208808228485693]
[null,null,"Energy cost p.a.",{"$f":"D34*Inputs!F31*Variables!$C$15","v":{"$error":"#VALUE!"}},null,null,{"$f":"G34*Inputs!F31*Variables!$C$15","v":{"$error":"#VALUE!"}},null,null,null,"charge 9",{"$f":"IF(Inputs!H22=0,\"No Break\",Inputs!H22)","v":"No Break"},{"$f":"IF(L35=\"No Break\",\"No Break\",L35+N35)","v":"No Break"},{"$f":"IF(L35=\"No Break\",0,Inputs!H23/60/24)","v":"00:00:00"},{"$f":"IF(M35=\"No Break\",IF(O33=1,1,0),IF(Calc1!M35>Calc1!M36,1,\"\"))","v":0},null,null,{"$f":"IF(L35=\"No break\",\"\",IF((AA35-S35)*24*$M$14+AB34<$S$13,1,\"\"))","v":""},{"$f":"IF(L35=\"No Break\",AA34,L35)","v":"01:00:00"},{"$f":"IF(L35=\"No Break\",S35,IF(AND(AB34<$S$13,R35=1),AA35,IF(AB34<$S$13,S35+($S$13-AB34)/$M$14/24,S35)))","v":"01:00:00"},{"$f":"IF(L35=\"No Break\",AB34,IF(AND(AB34<$S$13,R35=1),AB34+(T35-S35)*24*$M$14,IF(AB34<=$S$13,$S$13,AB34)))","v":{"$error":"#VALUE!"}},{"$f":"IF(L35=\"No Break\",\"\",IF((AA35-W35)*24*$S$14+U35>$M$12,1,\"\"))","v":""},{"$f":"T35","v":"01:00:00"},{"$f":"IF(L35=\"No Break\",W35,IF(R35=1,W35,IF(V35=1,W35+($M$12-U35)/$S$14/24,AA35)))","v":"01:00:00"},{"$f":"IF(R35=1,U35,U35+(X35-W35)*24*$S$14)","v":{"$error":"#VALUE!"}},{"$f":"X35","v":"01:00:00"},{"$f":"IF(L35=\"No Break\",Z35,L35+N35)","v":"01:00:00"},{"$f":"Y35","v":{"$error":"#VALUE!"}},null,null,null,{"$f":"T29","v":"01:00:00"},{"$f":"U29","v":{"$error":"#VALUE!"}},{"$error":"#VALUE!"},null,null,null,null,0.78208808228485693]
[null,null,null,null,null,null,null,null,null,null,"discharge",{"$f":"IF(OR(L35=\"No Break\",L35=0),M36,M35)","v":"01:00:00"},{"$f":"IF(L37=\"No Break\",L38,L37)","v":"01:00:00"},{"$f":"IF(M36-L36<0,0,M36-L36)","v":"00:00:00"},null,{"$f":"N36*24*$M$13","v":0},{"$f":"IF(AB36<$Q$59*$M$12,1,0)","v":{"$error":"#VALUE!"}},null,{"$f":"L36","v":"01:00:00"},null,null,null,null,null,null,null,{"$f":"IF(OR(L37=\"No Break\",L37=0), S38,S37)","v":"01:00:00"},{"$f":"AB35-(AA36-S36)*24*$M$13","v":{"$error":"#VALUE!"}},null,null,null,{"$f":"X29","v":"01:00:00"},{"$f":"Y29","v":{"$error":"#VALUE!"}},{"$error":"#VALUE!"},null,null,null,null,0.78208808228485693]
[null,null,"Total refueling Costs (€) year 1 (no battery degradation)",{"$f":"D35","v":{"$error":"#VALUE!"}},null,null,{"$f":"G35","v":{"$error":"#VALUE!"}},null,null,null,"charge 10",{"$f":"IF(Inputs!J22=0,\"No Break\",Inputs!J22)","v":"No Break"},{"$f":"IF(L37=\"No Break\",\"No Break\",L37+N37)","v":"No Break"},{"$f":"IF(L37=\"No Break\",0,Inputs!J23/60/24)","v":"00:00:00"},{"$f":"IF(M37=\"No Break\",IF(O35=1,1,0),IF(Calc1!M37>Calc1!M38,1,\"\"))","v":0},null,null,{"$f":"IF(L37=\"No break\",\"\",IF((AA37-S37)*24*$M$14+AB36<$S$13,1,\"\"))","v":""},{"$f":"IF(L37=\"No Break\",AA36,L37)","v":"01:00:00"},{"$f":"IF(L37=\"No Break\",S37,IF(AND(AB36<$S$13,R37=1),AA37,IF(AB36<$S$13,S37+($S$13-AB36)/$M$14/24,S37)))","v":"01:00:00"},{"$f":"IF(L37=\"No Break\",AB36,IF(AND(AB36<$S$13,R37=1),AB36+(T37-S37)*24*$M$14,IF(AB36<=$S$13,$S$13,AB36)))","v":{"$error":"#VALUE!"}},{"$f":"IF(L37=\"No Break\",\"\",IF((AA37-W37)*24*$S$14+U37>$M$12,1,\"\"))","v":""},{"$f":"T37","v":"01:00:00"},{"$f":"IF(OR(L37=\"No Break\",L37=0),W37,IF(R37=1,W37,IF(V37=1,W37+($M$12-U37)/$S$14/24,AA37)))","v":"01:00:00"},{"$f":"IF(R37=1,U37,U37+(X37-W37)*24*$S$14)","v":{"$error":"#VALUE!"}},{"$f":"X37","v":"01:00:00"},{"$f":"IF(L37=\"No Break\",Z37,L37+N37)","v":"01:00:00"},{"$f":"Y37","v":{"$error":"#VALUE!"}},null,null,null,{"$f":"AA29","v":"01:00:00"},{"$f":"AB29","v":{"$error":"#VALUE!"}},{"$error":"#VALUE!"},null,null,null,null,0.78208808228485693]
[null,null,"Total refueling Costs (€) year2 (inc battery degradation costs)",{"$f":"D37+D37*Calc2!D311","v":{"$error":"#VALUE!"}},null,null,{"$f":"G37+G37*Calc2!D312","v":{"$error":"#VALUE!"}},null,null,null,"discharge",{"$f":"IF(OR(L37=\"No Break\",L37=0),M38,M37)","v":"01:00:00"},{"$f":"IF(L39=\"No Break\",L40,L39)","v":"01:00:00"},{"$f":"IF(M38-L38<0,0,M38-L38)","v":"00:00:00"},null,{"$f":"N38*24*$M$13","v":0},{"$f":"IF(AB38<$Q$59*$M$12,1,0)","v":{"$error":"#VALUE!"}},null,{"$f":"L38","v":"01:00:00"},null,null,null,null,null,null,null,{"$f":"IF(OR(L39=\"No Break\",L39=0), S40,S39)","v":"01:00:00"},{"$f":"AB37-(AA38-S38)*24*$M$13","v":{"$error":"#VALUE!"}},null,null,"discharge",{"$f":"AA30","v":"01:00:00"},{"$f":"AB30","v":{"$error":"#VALUE!"}},{"$error":"#VALUE!"},null,null,null,null,0.78208808228485693]
[null,null,"Total refueling Costs (€) year3 (inc battery degradation costs)",{"$f":"D38+D38*Calc2!D311","v":{"$error":"#VALUE!"}},null,null,{"$f":"G38+G38*Calc2!D312","v":{"$error":"#VALUE!"}},null,null,null,"charge 11",{"$f":"IF(Inputs!L22=0,\"No Break\",Inputs!L22)","v":"No Break"},{"$f":"IF(L39=\"No Break\",\"No Break\",L39+N39)","v":"No Break"},{"$f":"IF(L39=\"No Break\",0,Inputs!L23/60/24)","v":"00:00:00"},{"$f":"IF(M39=\"No Break\",IF(O37=1,1,0),IF(Calc1!M39>Calc1!M40,1,\"\"))","v":0},null,null,{"$f":"IF(L39=\"No break\",\"\",IF((AA39-S39)*24*$M$14+AB38<$S$13,1,\"\"))","v":""},{"$f":"IF(L39=\"No Break\",AA38,L39)","v":"01:00:00"},{"$f":"IF(L39=\"No Break\",S39,IF(AND(AB38<$S$13,R39=1),AA39,IF(AB38<$S$13,S39+($S$13-AB38)/$M$14/24,S39)))","v":"01:00:00"},{"$f":"IF(L39=\"No Break\",AB38,IF(AND(AB38<$S$13,R39=1),AB38+(T39-S39)*24*$M$14,IF(AB38<=$S$13,$S$13,AB38)))","v":{"$error":"#VALUE!"}},{"$f":"IF(L39=\"No Break\",\"\",IF((AA39-W39)*24*$S$14+U39>$M$12,1,\"\"))","v":""},{"$f":"T39","v":"01:00:00"},{"$f":"IF(L39=\"No Break\",W39,IF(R39=1,W39,IF(V39=1,W39+($M$12-U39)/$S$14/24,AA39)))","v":"01:00:00"},{"$f":"IF(R39=1,U39,U39+(X39-W39)*24*$S$14)","v":{"$error":"#VALUE!"}},{"$f":"X39","v":"01:00:00"},{"$f":"IF(L39=\"No Break\",Z39,L39+N39)","v":"01:00:00"},{"$f":"Y39","v":{"$error":"#VALUE!"}},null,null,null,{"$f":"T31","v":"01:00:00"},{"$f":"U31","v":{"$error":"#VALUE!"}},{"$error":"#VALUE!"},null,null,null,null,0.78208808228485693]
[null,null,"Total refueling Costs (€) year4 (inc battery degradation costs)",{"$f":"D39+D39*Calc2!D311","v":{"$error":"#VALUE!"}},null,null,{"$f":"Calc1!G39+Calc1!G39*Calc2!D312","v":{"$error":"#VALUE!"}},null,null,null,"discharge",{"$f":"IF(OR(L39=\"No Break\",L39=0),M40,M39)","v":"01:00:00"},{"$f":"IF(L41=\"No Break\",L42,L41)","v":"01:00:00"},{"$f":"IF(M40-L40<0,0,M40-L40)","v":"00:00:00"},null,{"$f":"N40*24*$M$13","v":0},{"$f":"IF(AB40<$Q$59*$M$12,1,0)","v":{"$error":"#VALUE!"}},null,{"$f":"L40","v":"01:00:00"},null,null,null,null,null,null,null,{"$f":"IF(OR(L41=\"No Break\",L41=0), S42,S41)","v":"01:00:00"},{"$f":"AB39-(AA40-S40)*24*$M$13","v":{"$error":"#VALUE!"}},null,null,null,{"$f":"X31","v":"01:00:00"},{"$f":"Y31","v":{"$error":"#VALUE!"}},{"$error":"#VALUE!"},null,null,null,null,0.78208808228485693]
[null,null,"Total refueling Costs (€) year5 (inc battery degradation costs)",{"$f":"D40+D40*Calc2!D311","v":{"$error":"#VALUE!"}},null,null,{"$f":"G40+G40*Calc2!D312","v":{"$error":"#VALUE!"}},null,null,null,"charge 12",{"$f":"IF(Inputs!N22=0,\"No Break\",Inputs!N22)","v":"No Break"},{"$f":"IF(L41=\"No Break\",\"No Break\",L41+N41)","v":"No Break"},{"$f":"IF(L41=\"No Break\",0,Inputs!N23/60/24)","v":"00:00:00"},{"$f":"IF(M41=\"No Break\",IF(O39=1,1,0),IF(Calc1!M41>Calc1!M42,1,\"\"))","v":0},null,null,{"$f":"IF(L41=\"No break\",\"\",IF((AA41-S41)*24*$M$14+AB40<$S$13,1,\"\"))","v":""},{"$f":"IF(L41=\"No Break\",AA40,L41)","v":"01:00:00"},{"$f":"IF(L41=\"No Break\",S41,IF(AND(AB40<$S$13,R41=1),AA41,IF(AB40<$S$13,S41+($S$13-AB40)/$M$14/24,S41)))","v":"01:00:00"},{"$f":"IF(L41=\"No Break\",AB40,IF(AND(AB40<$S$13,R41=1),AB40+(T41-S41)*24*$M$14,IF(AB40<=$S$13,$S$13,AB40)))","v":{"$error":"#VALUE!"}},{"$f":"IF(L41=\"No Break\",\"\",IF((AA41-W41)*24*$S$14+U41>$M$12,1,\"\"))","v":""},{"$f":"T41","v":"01:00:00"},{"$f":"IF(L41=\"No Break\",W41,IF(R41=1,W41,IF(V41=1,W41+($M$12-U41)/$S$14/24,AA41)))","v":"01:00:00"},{"$f":"IF(R41=1,U41,U41+(X41-W41)*24*$S$14)","v":{"$error":"#VALUE!"}},{"$f":"X41","v":"01:00:00"},{"$f":"IF(L41=\"No Break\",Z41,L41+N41)","v":"01:00:00"},{"$f":"Y41","v":{"$error":"#VALUE!"}},null,null,null,{"$f":"AA31","v":"01:00:00"},{"$f":"AB31","v":{"$error":"#VALUE!"}},{"$error":"#VALUE!"},null,null,null,null,0.78208808228485693]
[null,null,"average",{"$f":"SUM(D37:D41)/5","v":{"$error":"#VALUE!"}},null,null,{"$f":"SUM(G37:G41)/5","v":{"$error":"#VALUE!"}},null,"Difference",null,"discharge",{"$f":"IF(OR(L41=\"No Break\",L41=0),M42,M41)","v":"01:00:00"},{"$f":"IF(L43=\"No Break\",L44,L43)","v":"01:00:00"},{"$f":"IF(M42-L42<0,0,M42-L42)","v":"00:00:00"},null,{"$f":"N42*24*$M$13","v":0},{"$f":"IF(AB42<$Q$59*$M$12,1,0)","v":{"$error":"#VALUE!"}},null,{"$f":"L42","v":"01:00:00"},null,null,null,null,null,null,null,{"$f":"IF(OR(L43=\"No Break\",L43=0), S44,S43)","v":"01:00:00"},{"$f":"AB41-(AA42-S42)*24*$M$13","v":{"$error":"#VALUE!"}},null,null,"discharge",{"$f":"AA32","v":"01:00:00"},{"$f":"AB32","v":{"$error":"#VALUE!"}},{"$error":"#VALUE!"},null,null,null,null,0.78208808228485693]
[null,null,"Carbon emmisions p.a. (Tonnes CO2)",{"$f":"D33*Variables!$C$15*Inputs!$F$31*Variables!$C$17/1000","v":{"$error":"#VALUE!"}},null,null,{"$f":"G33*Variables!$C$15*Inputs!$F$31*Variables!$C$17/1000","v":{"$error":"#VALUE!"}},null,{"$f":"D43-G43","v":{"$error":"#VALUE!"}},null,"charge 13",{"$f":"IF(Inputs!D26=0,\"No Break\",Inputs!D26)","v":"No Break"},{"$f":"IF(L43=\"No Break\",\"No Break\",L43+N43)","v":"No Break"},{"$f":"IF(L43=\"No Break\",0,Inputs!D27/60/24)","v":"00:00:00"},{"$f":"IF(M43=\"No Break\",IF(O41=1,1,0),IF(Calc1!M43>Calc1!M44,1,\"\"))","v":0},null,null,{"$f":"IF(L43=\"No break\",\"\",IF((AA43-S43)*24*$M$14+AB42<$S$13,1,\"\"))","v":""},{"$f":"IF(L43=\"No Break\",AA42,L43)","v":"01:00:00"},{"$f":"IF(L43=\"No Break\",S43,IF(AND(AB42<$S$13,R43=1),AA43,IF(AB42<$S$13,S43+($S$13-AB42)/$M$14/24,S43)))","v":"01:00:00"},{"$f":"IF(L43=\"No Break\",AB42,IF(AND(AB42<$S$13,R43=1),AB42+(T43-S43)*24*$M$14,IF(AB42<=$S$13,$S$13,AB42)))","v":{"$error":"#VALUE!"}},{"$f":"IF(L43=\"No Break\",\"\",IF((AA43-W43)*24*$S$14+U43>$M$12,1,\"\"))","v":""},{"$f":"T43","v":"01:00:00"},{"$f":"IF(L43=\"No Break\",W43,IF(R43=1,W43,IF(V43=1,W43+($M$12-U43)/$S$14/24,AA43)))","v":"01:00:00"},{"$f":"IF(R43=1,U43,U43+(X43-W43)*24*$S$14)","v":{"$error":"#VALUE!"}},{"$f":"X43","v":"01:00:00"},{"$f":"IF(L43=\"No Break\",Z43,L43+N43)","v":"01:00:00"},{"$f":"Y43","v":{"$error":"#VALUE!"}},null,null,null,{"$f":"T33","v":"01:00:00"},{"$f":"U33","v":{"$error":"#VALUE!"}},{"$error":"#VALUE!"},null,null,null,null,0.78208808228485693]
[null,null,null,null,null,null,null,null,null,null,"discharge",{"$f":"IF(OR(L43=\"No Break\",L43=0),M44,M43)","v":"01:00:00"},{"$f":"IF(L45=\"No Break\",L46,L45)","v":"01:00:00"},{"$f":"IF(M44-L44<0,0,M44-L44)","v":"00:00:00"},null,{"$f":"N44*24*$M$13","v":0},{"$f":"IF(AB44<$Q$59*$M$12,1,0)","v":{"$error":"#VALUE!"}},null,{"$f":"L44","v":"01:00:00"},null,null,null,null,null,null,null,{"$f":"IF(OR(L45=\"No Break\",L45=0), S46,S45)","v":"01:00:00"},{"$f":"AB43-(AA44-S44)*24*$M$13","v":{"$error":"#VALUE!"}},null,null,null,{"$f":"X33","v":"01:00:00"},{"$f":"Y33","v":{"$error":"#VALUE!"}},{"$error":"#VALUE!"},null,null,null,null,0.78208808228485693]
[null,null,null,null,null,null,null,null,null,null,"charge 14",{"$f":"IF(Inputs!F26=0,\"No Break\",Inputs!F26)","v":"No Break"},{"$f":"IF(L45=\"No Break\",\"No Break\",L45+N45)","v":"No Break"},{"$f":"IF(L45=\"No Break\",0,Inputs!F27/60/24)","v":"00:00:00"},{"$f":"IF(M45=\"No Break\",IF(O43=1,1,0),IF(Calc1!M45>Calc1!M46,1,\"\"))","v":0},null,null,{"$f":"IF(L45=\"No break\",\"\",IF((AA45-S45)*24*$M$14+AB44<$S$13,1,\"\"))","v":""},{"$f":"IF(L45=\"No Break\",AA44,L45)","v":"01:00:00"},{"$f":"IF(L45=\"No Break\",S45,IF(AND(AB44<$S$13,R45=1),AA45,IF(AB44<$S$13,S45+($S$13-AB44)/$M$14/24,S45)))","v":"01:00:00"},{"$f":"IF(L45=\"No Break\",AB44,IF(AND(AB44<$S$13,R45=1),AB44+(T45-S45)*24*$M$14,IF(AB44<=$S$13,$S$13,AB44)))","v":{"$error":"#VALUE!"}},{"$f":"IF(L45=\"No Break\",\"\",IF((AA45-W45)*24*$S$14+U45>$M$12,1,\"\"))","v":""},{"$f":"T45","v":"01:00:00"},{"$f":"IF(L45=\"No Break\",W45,IF(R45=1,W45,IF(V45=1,W45+($M$12-U45)/$S$14/24,AA45)))","v":"01:00:00"},{"$f":"IF(R45=1,U45,U45+(X45-W45)*24*$S$14)","v":{"$error":"#VALUE!"}},{"$f":"X45","v":"01:00:00"},{"$f":"IF(L45=\"No Break\",Z45,L45+N45)","v":"01:00:00"},{"$f":"Y45","v":{"$error":"#VALUE!"}},null,null,null,{"$f":"AA33","v":"01:00:00"},{"$f":"AB33","v":{"$error":"#VALUE!"}},{"$f":"AG45/$M$12","v":{"$error":"#VALUE!"}},null,null,null,null,0.78208808228485693]
[null,"Battery handling (per truck)",null,null,null,null,null,null,null,null,"discharge",{"$f":"IF(OR(L45=\"No Break\",L45=0),M46,M45)","v":"01:00:00"},{"$f":"IF(L47=\"No Break\",L48,L47)","v":"01:00:00"},{"$f":"IF(M46-L46<0,0,M46-L46)","v":"00:00:00"},null,{"$f":"N46*24*$M$13","v":0},{"$f":"IF(AB46<$Q$59*$M$12,1,0)","v":{"$error":"#VALUE!"}},null,{"$f":"L46","v":"01:00:00"},null,null,null,null,null,null,null,{"$f":"IF(OR(L47=\"No Break\",L47=0), S48,S47)","v":"01:00:00"},{"$f":"AB45-(AA46-S46)*24*$M$13","v":{"$error":"#VALUE!"}},null,null,"discharge",{"$f":"AA34","v":"01:00:00"},{"$f":"AB34","v":{"$error":"#VALUE!"}},{"$error":"#VALUE!"},null,null,null,null,0.78208808228485693]
[null,null,null,"Lead Acid",null,null,"lithium ion",null,null,null,"charge 15",{"$f":"IF(Inputs!H26=0,\"No Break\",Inputs!H26)","v":"No Break"},{"$f":"IF(L47=\"No Break\",\"No Break\",L47+N47)","v":"No Break"},{"$f":"IF(L47=\"No Break\",0,Inputs!H27/60/24)","v":"00:00:00"},{"$f":"IF(M47=\"No Break\",IF(O45=1,1,0),IF(Calc1!M47>Calc1!M48,1,\"\"))","v":0},null,null,{"$f":"IF(L47=\"No break\",\"\",IF((AA47-S47)*24*$M$14+AB46<$S$13,1,\"\"))","v":""},{"$f":"IF(L47=\"No Break\",AA46,L47)","v":"01:00:00"},{"$f":"IF(L47=\"No Break\",S47,IF(AND(AB46<$S$13,R47=1),AA47,IF(AB46<$S$13,S47+($S$13-AB46)/$M$14/24,S47)))","v":"01:00:00"},{"$f":"IF(L47=\"No Break\",AB46,IF(AND(AB46<$S$13,R47=1),AB46+(T47-S47)*24*$M$14,IF(AB46<=$S$13,$S$13,AB46)))","v":{"$error":"#VALUE!"}},{"$f":"IF(L47=\"No Break\",\"\",IF((AA47-W47)*24*$S$14+U47>$M$12,1,\"\"))","v":""},{"$f":"T47","v":"01:00:00"},{"$f":"IF(L47=\"No Break\",W47,IF(R47=1,W47,IF(V47=1,W47+($M$12-U47)/$S$14/24,AA47)))","v":"01:00:00"},{"$f":"IF(R47=1,U47,U47+(X47-W47)*24*$S$14)","v":{"$error":"#VALUE!"}},{"$f":"X47","v":"01:00:00"},{"$f":"IF(L47=\"No Break\",Z47,L47+N47)","v":"01:00:00"},{"$f":"Y47","v":{"$error":"#VALUE!"}},null,null,null,{"$f":"T35","v":"01:00:00"},{"$f":"U35","v":{"$error":"#VALUE!"}},{"$error":"#VALUE!"},null,null,null,null,0.78208808228485693]
[null,null,"Number battery cycles per day",{"$f":"D75","v":{"$error":"#VALUE!"}},null,null,{"$f":"COUNT(L19,L21,L23,L25,L27,L29,L31,L33,L35,L37,L39,L41)+1","v":2},null,null,null,"discharge",{"$f":"IF(OR(L47=\"No Break\",L47=0),M48,M47)","v":"01:00:00"},{"$f":"IF(L49=\"No Break\",L50,L49)","v":"01:00:00"},{"$f":"IF(M48-L48<0,0,M48-L48)","v":"00:00:00"},null,{"$f":"N48*24*$M$13","v":0},{"$f":"IF(AB48<$Q$59*$M$12,1,0)","v":{"$error":"#VALUE!"}},null,{"$f":"L48","v":"01:00:00"},null,null,null,null,null,null,null,{"$f":"IF(OR(L49=\"No Break\",L49=0), S50,S49)","v":"01:00:00"},{"$f":"AB47-(AA48-S48)*24*$M$13","v":{"$error":"#VALUE!"}},null,null,null,{"$f":"X35","v":"01:00:00"},{"$f":"Y35","v":{"$error":"#VALUE!"}},{"$error":"#VALUE!"},null,null,null,null,0.78208808228485693]
[null,null,"Driver recharging time per day(mins)",{"$f":"IF(D48<=1,(Inputs!F50+Variables!C29),(Inputs!F50+Inputs!F51)*D48)","v":{"$error":"#VALUE!"}},null,null,{"$f":"G48*(Variables!C69+Variables!C73)","v":2},null,null,null,"charge 16",{"$f":"IF(Inputs!J26=0,\"No Break\",Inputs!J26)","v":"No Break"},{"$f":"IF(L49=\"No Break\",\"No Break\",L49+N49)","v":"No Break"},{"$f":"IF(L49=\"No Break\",0,Inputs!J27/60/24)","v":"00:00:00"},{"$f":"IF(M49=\"No Break\",IF(O47=1,1,0),IF(Calc1!M49>Calc1!M50,1,\"\"))","v":0},null,null,{"$f":"IF(L49=\"No break\",\"\",IF((AA49-S49)*24*$M$14+AB48<$S$13,1,\"\"))","v":""},{"$f":"IF(L49=\"No Break\",AA48,L49)","v":"01:00:00"},{"$f":"IF(L49=\"No Break\",S49,IF(AND(AB48<$S$13,R49=1),AA49,IF(AB48<$S$13,S49+($S$13-AB48)/$M$14/24,S49)))","v":"01:00:00"},{"$f":"IF(L49=\"No Break\",AB48,IF(AND(AB48<$S$13,R49=1),AB48+(T49-S49)*24*$M$14,IF(AB48<=$S$13,$S$13,AB48)))","v":{"$error":"#VALUE!"}},{"$f":"IF(L49=\"No Break\",\"\",IF((AA49-W49)*24*$S$14+U49>$M$12,1,\"\"))","v":""},{"$f":"T49","v":"01:00:00"},{"$f":"IF(L49=\"No Break\",W49,IF(R49=1,W49,IF(V49=1,W49+($M$12-U49)/$S$14/24,AA49)))","v":"01:00:00"},{"$f":"IF(R49=1,U49,U49+(X49-W49)*24*$S$14)","v":{"$error":"#VALUE!"}},{"$f":"X49","v":"01:00:00"},{"$f":"IF(L49=\"No Break\",Z49,L49+N49)","v":"01:00:00"},{"$f":"Y49","v":{"$error":"#VALUE!"}},null,null,null,{"$f":"AA35","v":"01:00:00"},{"$f":"AB35","v":{"$error":"#VALUE!"}},{"$error":"#VALUE!"},null,null,null,null,0.78208808228485693]
[null,null,"Driver recharging time p.a. (hours)",{"$f":"D49/60*Inputs!F31*Variables!$C$15","v":{"$error":"#VALUE!"}},null,null,{"$f":"G49/60*Inputs!F31*Variables!$C$15","v":{"$error":"#VALUE!"}},null,null,null,"discharge",{"$f":"IF(OR(L49=\"No Break\",L49=0),M50,M49)","v":"01:00:00"},{"$f":"IF(L51=\"No Break\",L52,L51)","v":"01:00:00"},{"$f":"IF(M50-L50<0,0,M50-L50)","v":"00:00:00"},null,{"$f":"N50*24*$M$13","v":0},{"$f":"IF(AB50<$Q$59*$M$12,1,0)","v":{"$error":"#VALUE!"}},null,{"$f":"L50","v":"01:00:00"},null,null,null,null,null,null,null,{"$f":"IF(OR(L51=\"No Break\",L51=0), S52,S51)","v":"01:00:00"},{"$f":"AB49-(AA50-S50)*24*$M$13","v":{"$error":"#VALUE!"}},null,null,"discharge",{"$f":"AA36","v":"01:00:00"},{"$f":"AB36","v":{"$error":"#VALUE!"}},{"$error":"#VALUE!"},null,null,null,null,0.78208808228485693]
[null,null,null,null,null,null,null,null,null,null,"charge 17",{"$f":"IF(Inputs!L26=0,\"No Break\",Inputs!L26)","v":"No Break"},{"$f":"IF(L51=\"No Break\",\"No Break\",L51+N51)","v":"No Break"},{"$f":"IF(L51=\"No Break\",0,Inputs!L27/60/24)","v":"00:00:00"},{"$f":"IF(M51=\"No Break\",IF(O49=1,1,0),IF(Calc1!M51>Calc1!M52,1,\"\"))","v":0},null,null,{"$f":"IF(L51=\"No break\",\"\",IF((AA51-S51)*24*$M$14+AB50<$S$13,1,\"\"))","v":""},{"$f":"IF(L51=\"No Break\",AA50,L51)","v":"01:00:00"},{"$f":"IF(L51=\"No Break\",S51,IF(AND(AB50<$S$13,R51=1),AA51,IF(AB50<$S$13,S51+($S$13-AB50)/$M$14/24,S51)))","v":"01:00:00"},{"$f":"IF(L51=\"No Break\",AB50,IF(AND(AB50<$S$13,R51=1),AB50+(T51-S51)*24*$M$14,IF(AB50<=$S$13,$S$13,AB50)))","v":{"$error":"#VALUE!"}},{"$f":"IF(L51=\"No Break\",\"\",IF((AA51-W51)*24*$S$14+U51>$M$12,1,\"\"))","v":""},{"$f":"T51","v":"01:00:00"},{"$f":"IF(L51=\"No Break\",W51,IF(R51=1,W51,IF(V51=1,W51+($M$12-U51)/$S$14/24,AA51)))","v":"01:00:00"},{"$f":"IF(R51=1,U51,U51+(X51-W51)*24*$S$14)","v":{"$error":"#VALUE!"}},{"$f":"X51","v":"01:00:00"},{"$f":"IF(L51=\"No Break\",Z51,L51+N51)","v":"01:00:00"},{"$f":"Y51","v":{"$error":"#VALUE!"}},null,null,null,{"$f":"T37","v":"01:00:00"},{"$f":"U37","v":{"$error":"#VALUE!"}},{"$error":"#VALUE!"},null,null,null,null,0.78208808228485693]
[null,null,"Battery attendant time p.a. (hours)",{"$f":"IF(Inputs!F52=Calc2!$D$87,Inputs!F51*D48/60*Inputs!F31*Variables!$C$15,0)","v":0},null,null,0,null,null,null,"discharge",{"$f":"IF(OR(L51=\"No Break\",L51=0),M52,M51)","v":"01:00:00"},{"$f":"IF(L53=\"No Break\",L54,L53)","v":"01:00:00"},{"$f":"IF(M52-L52<0,0,M52-L52)","v":"00:00:00"},null,{"$f":"N52*24*$M$13","v":0},{"$f":"IF(AB52<$Q$59*$M$12,1,0)","v":{"$error":"#VALUE!"}},null,{"$f":"L52","v":"01:00:00"},null,null,null,null,null,null,null,{"$f":"IF(OR(L53=\"No Break\",L53=0), S54,S53)","v":"01:00:00"},{"$f":"AB51-(AA52-S52)*24*$M$13","v":{"$error":"#VALUE!"}},null,null,null,{"$f":"X37","v":"01:00:00"},{"$f":"Y37","v":{"$error":"#VALUE!"}},{"$error":"#VALUE!"},null,null,null,null,0.78208808228485693]
[null,null,null,null,null,null,null,null,null,null,"charge 18",{"$f":"IF(Inputs!N26=0,\"No Break\",Inputs!N26)","v":"No Break"},{"$f":"IF(L53=\"No Break\",\"No Break\",L53+N53)","v":"No Break"},{"$f":"IF(L53=\"No Break\",0,Inputs!N27/60/24)","v":"00:00:00"},{"$f":"IF(M53=\"No Break\",IF(O51=1,1,0),IF(Calc1!M53>Calc1!M54,1,\"\"))","v":0},null,null,{"$f":"IF(L53=\"No break\",\"\",IF((AA53-S53)*24*$M$14+AB52<$S$13,1,\"\"))","v":""},{"$f":"IF(L53=\"No Break\",AA52,L53)","v":"01:00:00"},{"$f":"IF(L53=\"No Break\",S53,IF(AND(AB52<$S$13,R53=1),AA53,IF(AB52<$S$13,S53+($S$13-AB52)/$M$14/24,S53)))","v":"01:00:00"},{"$f":"IF(L53=\"No Break\",AB52,IF(AND(AB52<$S$13,R53=1),AB52+(T53-S53)*24*$M$14,IF(AB52<=$S$13,$S$13,AB52)))","v":{"$error":"#VALUE!"}},{"$f":"IF(L53=\"No Break\",\"\",IF((AA53-W53)*24*$S$14+U53>$M$12,1,\"\"))","v":""},{"$f":"T53","v":"01:00:00"},{"$f":"IF(L53=\"No Break\",W53,IF(R53=1,W53,IF(V53=1,W53+($M$12-U53)/$S$14/24,AA53)))","v":"01:00:00"},{"$f":"IF(R53=1,U53,U53+(X53-W53)*24*$S$14)","v":{"$error":"#VALUE!"}},{"$f":"X53","v":"01:00:00"},{"$f":"IF(L53=\"No Break\",Z53,L53+N53)","v":"01:00:00"},{"$f":"Y53","v":{"$error":"#VALUE!"}},null,null,null,{"$f":"AA37","v":"01:00:00"},{"$f":"AB37","v":{"$error":"#VALUE!"}},{"$error":"#VALUE!"},null,null,null,null,0.78208808228485693]
[null,null,"Personelle recharging cost p.a. (EUR)",{"$f":"(D52+D50)*Calc2!C33","v":{"$error":"#VALUE!"}},null,null,{"$f":"G50*Calc2!C33","v":{"$error":"#VALUE!"}},null,null,null,"discharge",{"$f":"IF(OR(L53=\"No Break\",L53=0),M54,M53)","v":"01:00:00"},{"$f":"Inputs!F29","v":"01:00:00"},{"$f":"IF(M54-L54<0,0,M54-L54)","v":"00:00:00"},null,{"$f":"N54*24*$M$13","v":0},{"$f":"IF(AB54<$Q$59*$M$12,1,0)","v":{"$error":"#VALUE!"}},null,{"$f":"L54","v":"01:00:00"},null,null,null,null,null,null,null,{"$f":"Inputs!F29","v":"01:00:00"},{"$f":"AB53-(AA54-S54)*24*$M$13","v":{"$error":"#VALUE!"}},null,null,"discharge",{"$f":"AA38","v":"01:00:00"},{"$f":"AB38","v":{"$error":"#VALUE!"}},{"$error":"#VALUE!"},null,null,null,null,0.78208808228485693]
[null,null,null,null,null,null,null,null,null,null,"charge",{"$f":"M54","v":"01:00:00"},{"$f":"L18+1","v":1},{"$f":"M55-L55","v":"23:00:00"},null,null,null,{"$f":"IF(L55=\"No break\",\"\",IF((AA55-S55)*24*$M$14+AB54<$S$13,1,\"\"))","v":{"$error":"#VALUE!"}},{"$f":"AA54","v":"01:00:00"},{"$f":"IF(L55=\"No Break\",S55,IF(AND(AB42<$S$13,R55=1),AA55,IF(AB42<$S$13,S55+($S$13-AB42)/$M$14/24,S55)))","v":{"$error":"#VALUE!"}},{"$f":"IF(L55=\"No Break\",AB42,IF(AND(AB42<$S$13,R55=1),AB42+(T55-S55)*24*$M$14,IF(AB42<=$S$13,$S$13,AB42)))","v":{"$error":"#VALUE!"}},{"$f":"IF(L55=\"No Break\",\"\",IF((AA55-W55)*24*$S$14+U55>$M$12,1,\"\"))","v":{"$error":"#VALUE!"}},{"$f":"T55","v":{"$error":"#VALUE!"}},{"$f":"IF(L55=\"No Break\",W55,IF(R55=1,W55,IF(V55=1,W55+($M$12-U55)/$S$14/24,AA55)))","v":{"$error":"#VALUE!"}},{"$f":"IF(R55=1,U55,U55+(X55-W55)*24*$S$14)","v":{"$error":"#VALUE!"}},{"$f":"X55","v":{"$error":"#VALUE!"}},{"$f":"L18+1","v":1},{"$f":"Y55","v":{"$error":"#VALUE!"}},null,null,null,{"$f":"T39","v":"01:00:00"},{"$f":"U39","v":{"$error":"#VALUE!"}},{"$error":"#VALUE!"},null,null,null,null,0.78208808228485693]
[null,"Resale value",null,null,null,null,null,null,null,null,null,null,null,"End time before end?",{"$f":"IF(SUM(O18:O55)>0,1,\"\")","v":""},null,null,null,null,null,null,null,null,null,null,null,null,null,null,null,null,{"$f":"X39","v":"01:00:00"},{"$f":"Y39","v":{"$error":"#VALUE!"}},{"$error":"#VALUE!"},null,null,null,null,0.78208808228485693]
[null,null,null,"Lead Acid",null,null,"lithium ion",null,null,null,null,null,"Operating hours per day",{"$f":"SUM(N18+N20+N22+N24+N26+N28+N30+N32+N34+N36+N38+N40+N42+N44+N46+N48+N50+N52+N54)","v":"01:00:00"},null,"minSOC exceeded?",{"$f":"IF(SUM(Q18:Q55)>0,\"EXCEEDED\",\"no\")","v":{"$error":"#VALUE!"}},null,null,null,null,null,null,null,null,null,null,null,null,null,null,{"$f":"AA39","v":"01:00:00"},{"$f":"AB39","v":{"$error":"#VALUE!"}},{"$error":"#VALUE!"},null,null,null,null,0.78208808228485693]
[null,null,"resale value",{"$f":"0","v":0},null,null,{"$f":"Calc2!C102","v":0},null,null,null,null,null,"Break hours per day",{"$f":"N19+N21+N23+N25+N27+N29+N31+N33+N35+N37+N39+N41+N55+N43+N45+N47+N49+N51+N53","v":"23:00:00"},null,"Min SOC achieved",{"$f":"MIN(AB17:AB55)/M$12","v":{"$error":"#VALUE!"}},null,null,null,null,null,null,null,null,null,null,null,null,null,"discharge",{"$f":"AA40","v":"01:00:00"},{"$f":"AB40","v":{"$error":"#VALUE!"}},{"$error":"#VALUE!"},null,null,null,null,0.78208808228485693]
[null,null,null,null,null,null,null,null,null,null,null,null,"True break hours /day",{"$f":"N19+IF(L21=\"No Break\",0,N21)+IF(L23=\"No Break\",0,N23)+IF(L25=\"No Break\",0,N25)+IF(L27=\"No Break\",0,N27)+IF(L29=\"No Break\",0,N29)+IF(L31=\"No Break\",0,N31)+IF(L33=\"No Break\",0,N33)+IF(L35=\"No Break\",0,N35)+IF(L37=\"No Break\",0,N37)+IF(L39=\"No Break\",0,N39)+IF(L41=\"No Break\",0,N41)+IF(L43=\"No Break\",0,N43)+IF(L45=\"No Break\",0,N45)+IF(L47=\"No Break\",0,N47)+IF(L49=\"No Break\",0,N49)+IF(L51=\"No Break\",0,N51)+IF(L53=\"No Break\",0,N53)","v":"00:00:00"},null,"Min SOD allowed",{"$f":"1-(Calc2!C99/100)","v":0},null,null,null,null,null,null,null,null,null,null,null,null,null,null,{"$f":"T41","v":"01:00:00"},{"$f":"U41","v":{"$error":"#VALUE!"}},{"$error":"#VALUE!"},null,null,null,null,0.78208808228485693]
[null,"Battery Care",null,null,null,null,null,null,null,null,null,null,null,null,null,null,null,null,null,null,null,null,null,null,null,null,null,null,null,null,null,{"$f":"X41","v":"01:00:00"},{"$f":"Y41","v":{"$error":"#VALUE!"}},{"$error":"#VALUE!"},null,null,null,null,0.78208808228485693]
[null,null,null,null,null,null,null,null,null,null,null,null,null,null,null,null,null,null,null,null,null,null,null,null,null,null,null,null,null,null,null,{"$f":"AA41","v":"01:00:00"},{"$f":"AB41","v":{"$error":"#VALUE!"}},{"$error":"#VALUE!"},null,null,null,null,0.78208808228485693]
[null,null,null,null,null,null,null,null,null,null,null,null,null,null,null,null,null,null,null,null,null,null,null,null,null,null,null,null,null,null,"discharge",{"$f":"AA42","v":"01:00:00"},{"$f":"AB42","v":{"$error":"#VALUE!"}},{"$f":"AG62/$M$12","v":{"$error":"#VALUE!"}},null,null,null,null,0.78208808228485693]
[null,null,"Charging room cost per truck",{"$f":"IF(Inputs!F54=Calc2!E91,Variables!$C$45,0)","v":0},null,null,0,null,null,null,null,null,null,null,null,null,null,null,null,null,null,null,null,null,null,null,null,null,null,null,null,{"$f":"T43","v":"01:00:00"},{"$f":"U43","v":{"$error":"#VALUE!"}},{"$error":"#VALUE!"},null,null,null,null,0.78208808228485693]
[null,null,null,null,null,null,null,null,null,null,null,null,null,null,null,null,null,null,null,null,null,null,null,null,null,null,null,null,null,null,null,{"$f":"X43","v":"01:00:00"},{"$f":"Y43","v":{"$error":"#VALUE!"}},{"$error":"#VALUE!"},null,null,null,null,0.78208808228485693]
[null,"Battery Care",null,null,null,null,null,null,null,null,null,null,null,null,null,null,null,null,null,null,null,null,null,null,null,null,null,null,null,null,null,{"$f":"AA43","v":"01:00:00"},{"$f":"AB43","v":{"$error":"#VALUE!"}},{"$error":"#VALUE!"},null,null,null,null,0.78208808228485693]
[null,null,null,null,null,null,null,null,null,null,null,null,null,null,null,null,null,null,null,null,null,null,null,null,null,null,null,null,null,null,"discharge",{"$f":"AA44","v":"01:00:00"},{"$f":"AB44","v":{"$error":"#VALUE!"}},{"$error":"#VALUE!"},null,null,null,null,0.78208808228485693]
[null,null,"H2Oconsumption(L per cycle)",{"$f":"((Inputs!F45*Calc2!C82/100)*(Calc2!C84-1))*0.33*D14/2/1000","v":{"$error":"#VALUE!"}},null,null,null,null,null,null,null,null,null,null,null,null,null,null,null,null,null,null,null,null,null,null,null,null,null,null,null,{"$f":"T45","v":"01:00:00"},{"$f":"U45","v":{"$error":"#VALUE!"}},{"$error":"#VALUE!"},null,null,null,null,0.78208808228485693]
[null,null,"filling inverval (cycles)",{"$f":"ROUNDDOWN(Calc2!C28*D14/D67/2,0)","v":{"$error":"#VALUE!"}},null,null,null,null,null,null,null,null,null,null,null,null,null,null,null,null,null,null,null,null,null,null,null,null,null,null,null,{"$f":"X45","v":"01:00:00"},{"$f":"Y45","v":{"$error":"#VALUE!"}},{"$error":"#VALUE!"},null,null,null,null,0.78208808228485693]
[null,null,"top ups p.a. ",{"$f":"D75*(Inputs!F31*Variables!$C$15)/D68","v":{"$error":"#VALUE!"}},null,null,null,null,null,null,null,null,null,null,null,null,null,null,null,null,null,null,null,null,null,null,null,null,null,null,null,{"$f":"AA45","v":"01:00:00"},{"$f":"AB45","v":{"$error":"#VALUE!"}},{"$error":"#VALUE!"},null,null,null,null,0.78208808228485693]
[null,null,"Litres per annum (l)",{"$f":"D67*D75*(Variables!$C$15*Inputs!F31)","v":{"$error":"#VALUE!"}},null,null,0,null,null,null,null,null,null,null,null,null,null,null,null,null,null,null,null,null,null,null,null,null,null,null,"discharge",{"$f":"AA46","v":"01:00:00"},{"$f":"AB46","v":{"$error":"#VALUE!"}},{"$error":"#VALUE!"},null,null,null,null,0.78208808228485693]
[null,null,null,null,null,null,0,null,null,null,null,null,null,null,null,null,null,null,null,null,null,null,null,null,null,null,null,null,null,null,null,{"$f":"T47","v":"01:00:00"},{"$f":"U47","v":{"$error":"#VALUE!"}},{"$error":"#VALUE!"},null,null,null,null,0.78208808228485693]
[null,null,"water cost p.a. (€)",50,null,null,0,null,null,null,null,null,null,null,null,null,null,null,null,null,null,null,null,null,null,null,null,null,null,null,null,{"$f":"X47","v":"01:00:00"},{"$f":"Y47","v":{"$error":"#VALUE!"}},{"$error":"#VALUE!"},null,null,null,null,0.78208808228485693]
[null,null,null,null,null,null,null,null,null,null,null,null,null,null,null,null,null,null,null,null,null,null,null,null,null,null,null,null,null,null,null,{"$f":"AA47","v":"01:00:00"},{"$f":"AB47","v":{"$error":"#VALUE!"}},{"$error":"#VALUE!"},null,null,null,null,0.78208808228485693]
[null,null,null,null,null,null,null,null,null,null,null,null,null,null,null,null,null,null,null,null,null,null,null,null,null,null,null,null,null,null,"discharge",{"$f":"AA48","v":"01:00:00"},{"$f":"AB48","v":{"$error":"#VALUE!"}},{"$error":"#VALUE!"},null,null,null,null,0.78208808228485693]
[null,null,"batteries per day per truck (fraction)",{"$f":"D9*D26/D23","v":{"$error":"#VALUE!"}},null,null,null,null,null,null,null,null,null,null,null,null,null,null,null,null,null,null,null,null,null,null,null,null,null,null,null,{"$f":"T49","v":"01:00:00"},{"$f":"U49","v":{"$error":"#VALUE!"}},{"$error":"#VALUE!"},null,null,null,null,0.78208808228485693]
[null,null,"Batteries per truck (integer)",{"$f":"IF((AND(ROUNDUP(D75,0)=1,(D9+D10)>16)), ROUNDUP(D75,0)+1, ROUNDUP(D75,0))","v":{"$error":"#VALUE!"}},null,null,1,null,null,null,null,null,null,null,null,null,null,null,null,null,null,null,null,null,null,null,null,null,null,null,null,{"$f":"X49","v":"01:00:00"},{"$f":"Y49","v":{"$error":"#VALUE!"}},{"$error":"#VALUE!"},null,null,null,null,0.78208808228485693]
[null,null,"Top up time p.a. (mins)",{"$f":"D69*Inputs!#REF!","v":{"$error":"#VALUE!"}},null,null,0,null,null,null,null,null,null,null,null,null,null,null,null,null,null,null,null,null,null,null,null,null,null,null,null,{"$f":"AA49","v":"01:00:00"},{"$f":"AB49","v":{"$error":"#VALUE!"}},{"$error":"#VALUE!"},null,null,null,null,0.78208808228485693]
[null,null,null,null,null,null,null,null,null,null,null,null,null,null,null,null,null,null,null,null,null,null,null,null,null,null,null,null,null,null,"discharge",{"$f":"AA50","v":"01:00:00"},{"$f":"AB50","v":{"$error":"#VALUE!"}},{"$error":"#VALUE!"},null,null,null,null,0.78208808228485693]
[null,null,"Top up Labour cost p.a. (€)",{"$f":"D77/60*Calc2!C33","v":{"$error":"#VALUE!"}},null,null,0,null,null,null,null,null,null,null,null,null,null,null,null,null,null,null,null,null,null,null,null,null,null,null,null,{"$f":"T51","v":"01:00:00"},{"$f":"U51","v":{"$error":"#VALUE!"}},{"$error":"#VALUE!"},null,null,null,null,0.78208808228485693]
[null,null,"Battery and charger service fee (p.a.)",{"$f":"12*Inputs!F48","v":0},null,null,null,null,null,null,null,null,null,null,null,null,null,null,null,null,null,null,null,null,null,null,null,null,null,null,null,{"$f":"X51","v":"01:00:00"},{"$f":"Y51","v":{"$error":"#VALUE!"}},{"$error":"#VALUE!"},null,null,null,null,0.78208808228485693]
[null,null,"annual inspection (€)",{"$f":"Variables!C36*D76","v":{"$error":"#VALUE!"}},null,null,{"$f":"Variables!C75","v":50},null,null,null,null,null,null,null,null,null,null,null,null,null,null,null,null,null,null,null,null,null,null,null,null,{"$f":"AA51","v":"01:00:00"},{"$f":"AB51","v":{"$error":"#VALUE!"}},{"$error":"#VALUE!"},null,null,null,null,0.78208808228485693]
[null,null,"total battery maintainance p.a. (€)",{"$f":"D72+D80+D81","v":{"$error":"#VALUE!"}},null,null,{"$f":"G79+G81+G72","v":50},null,null,null,null,null,null,null,null,null,null,null,null,null,null,null,null,null,null,null,null,null,null,null,"discharge",{"$f":"AA52","v":"01:00:00"},{"$f":"AB52","v":{"$error":"#VALUE!"}},{"$error":"#VALUE!"},null,null,null,null,0.78208808228485693]
[null,null,null,null,null,null,null,null,null,null,null,null,null,null,null,null,null,null,null,null,null,null,null,null,null,null,null,null,null,null,null,{"$f":"T53","v":"01:00:00"},{"$f":"U53","v":{"$error":"#VALUE!"}},{"$error":"#VALUE!"},null,null,null,null,0.78208808228485693]
[null,null,"Excluding depreciation",null,null,null,null,null,null,null,null,null,null,null,null,null,null,null,null,null,null,null,null,null,null,null,null,null,null,null,null,{"$f":"X53","v":"01:00:00"},{"$f":"Y53","v":{"$error":"#VALUE!"}},{"$error":"#VALUE!"},null,null,null,null,0.78208808228485693]
[null,null,"Including depreciation",null,null,null,null,null,null,null,null,null,null,null,null,null,null,null,null,null,null,null,null,null,null,null,null,null,null,null,null,{"$f":"AA53","v":"01:00:00"},{"$f":"AB53","v":{"$error":"#VALUE!"}},{"$error":"#VALUE!"},null,null,null,null,0.78208808228485693]
[null,null,null,"Lead","Lithium",null,"difference","If this cell is Red - minimum SOC of the Li battery has been breached during the shift cycle",null,null,null,null,null,null,null,null,null,null,null,null,null,null,null,null,null,null,null,null,null,null,"discharge",{"$f":"AA54","v":"01:00:00"},{"$f":"AB54","v":{"$error":"#VALUE!"}},{"$error":"#VALUE!"},null,null,null,null,0.78208808228485693]
[null,null,"Total battery costs per truck",null,null,null,null,null,null,null,null,null,null,null,null,null,null,null,null,null,null,null,null,null,null,null,null,null,null,null,null,{"$f":"T55","v":{"$error":"#VALUE!"}},{"$f":"U55","v":{"$error":"#VALUE!"}},{"$f":"AG87/$M$12","v":{"$error":"#VALUE!"}},null,null,null,null,0.78208808228482574]
[null,null,"Battery",{"$f":"Inputs!F56*D76","v":{"$error":"#VALUE!"}},{"$f":"Inputs!F67","v":0},null,null,null,null,null,null,null,null,null,null,null,null,null,null,null,null,null,null,null,null,null,null,null,null,null,null,{"$f":"X55","v":{"$error":"#VALUE!"}},{"$f":"Y55","v":{"$error":"#VALUE!"}},{"$f":"AG88/$M$12","v":{"$error":"#VALUE!"}},null,null,null,null,0.78208808228482574]
[null,null,null,null,null,null,null,null,null,null,null,null,null,null,null,null,null,null,null,null,null,null,null,null,null,null,null,null,null,null,null,{"$f":"AA54","v":"01:00:00"},{"$f":"AB55","v":{"$error":"#VALUE!"}},{"$error":"#VALUE!"},null,null,null,null,0.78208808228482574]
[null,null,"Batterys per truck (€)",{"$f":"SUM(D88:D89)","v":{"$error":"#VALUE!"}},{"$f":"SUM(E88:E89)","v":0}]
[null,null,"Charger",{"$f":"Inputs!F57","v":0},{"$f":"Inputs!F68","v":0}]
[null,null,"Charging room",{"$f":"D63","v":0}]
[null,null,"Resale value",null,{"$f":"-G58","v":0}]
[null,null,"total",{"$f":"SUM(D90:D92)","v":{"$error":"#VALUE!"}},{"$f":"SUM(E90:E93)","v":0},null,{"$f":"D94-E94","v":{"$error":"#VALUE!"}}]
[]
[null,null,null,"Lead","Lithium",null,"difference",null,null,null,null,null,null,null,null,null,null,null,null,null,null,null,null,null,null,null,null,null,null,null," "]
[null,null,"Total costs per annum"]
[null,null,"Energy cost p.a.",{"$f":"D42","v":{"$error":"#VALUE!"}},{"$f":"G42","v":{"$error":"#VALUE!"}},null,{"$error":"#VALUE!"}]
[null,null,"Handling p.a.",{"$f":"D54","v":{"$error":"#VALUE!"}},{"$f":"G54","v":{"$error":"#VALUE!"}},null,{"$error":"#VALUE!"}]
[null,null,"Maintainance and care",{"$f":"D82","v":{"$error":"#VALUE!"}},{"$f":"G82","v":50},null,{"$error":"#VALUE!"}]
[null,null,"total cost p.a.",{"$f":"SUM(D98:D100)","v":{"$error":"#VALUE!"}},{"$f":"SUM(E98:E100)","v":{"$error":"#VALUE!"}},null,{"$error":"#VALUE!"}]
[null,null,"Depreciation"]
[null,null,"Power source Value / fleet /year",{"$f":"D90+D91","v":{"$error":"#VALUE!"}},{"$f":"E90+E91","v":0}]
[null,null,"year 1",{"$f":"D103*(1-Calc2!D315)","v":{"$error":"#VALUE!"}},{"$f":"E103*(1-Calc2!D316)","v":0}]
[null,null,"year 2",{"$f":"D104*(1-Calc2!D315)","v":{"$error":"#VALUE!"}},{"$f":"E104*(1-Calc2!D316)","v":0}]
[null,null,"year 3",{"$f":"D105*(1-Calc2!D315)","v":{"$error":"#VALUE!"}},{"$f":"E105*(1-Calc2!D316)","v":0}]
[null,null,"year 4",{"$f":"D106*(1-Calc2!D315)","v":{"$error":"#VALUE!"}},{"$f":"E106*(1-Calc2!D316)","v":0}]
[null,null,"year 5",{"$f":"D107*(1-Calc2!D315)","v":{"$error":"#VALUE!"}},{"$f":"E107*(1-Calc2!D316)","v":0}]
[null,null,"Average depraciation per year",{"$f":"(D103-D108)/5","v":{"$error":"#VALUE!"}},{"$f":"(E103-E108)/5","v":0},null,{"$f":"(D109-E109)","v":{"$error":"#VALUE!"}}]
[]
[null,null,"Switching to Lithium ion  - payback costs (incl. depreciation)",null,null,null,null,"Switching to Lithium ion  - payback costs (excl. depreciation)"]
[null,null,"Initial investment",{"$f":"D94","v":{"$error":"#VALUE!"}},{"$f":"E94","v":0},null,{"$f":"G94","v":{"$error":"#VALUE!"}},"Initial investment",{"$f":"D94","v":{"$error":"#VALUE!"}},{"$f":"E94","v":0},null,{"$f":"G94","v":{"$error":"#VALUE!"}}]
[null,null,"Savings y1",{"$f":"D101+(D103-D104)+D112","v":{"$error":"#VALUE!"}},{"$f":"E101+(E103-E104)+E112","v":{"$error":"#VALUE!"}},null,{"$f":"D113-E113","v":{"$error":"#VALUE!"}},"Savings y1",{"$f":"D101+D112","v":{"$error":"#VALUE!"}},{"$f":"E112+E101","v":{"$error":"#VALUE!"}},null,{"$f":"I113-J113","v":{"$error":"#VALUE!"}}]
[null,null,"y2",{"$f":"D101+(D104-D105)","v":{"$error":"#VALUE!"}},{"$f":"E$101+(E104-E105)","v":{"$error":"#VALUE!"}},null,{"$f":"(D113+D114)-(E113+E114)","v":{"$error":"#VALUE!"}},"y2",{"$f":"D101","v":{"$error":"#VALUE!"}},{"$f":"E101","v":{"$error":"#VALUE!"}},null,{"$f":"(I113+I114)-(J113+J114)","v":{"$error":"#VALUE!"}}]
[null,null,"y3",{"$f":"D101+(D105-D106)","v":{"$error":"#VALUE!"}},{"$f":"E$101+(E105-E106)","v":{"$error":"#VALUE!"}},null,{"$f":"(D113+D114+D115)-(E113+E114+E115)","v":{"$error":"#VALUE!"}},"y3",{"$f":"D101","v":{"$error":"#VALUE!"}},{"$f":"E101","v":{"$error":"#VALUE!"}},null,{"$f":"(I113+I114+I115)-(J113+J114+J115)","v":{"$error":"#VALUE!"}}]
[null,null,"y4",{"$f":"D$101+(D106-D107)","v":{"$error":"#VALUE!"}},{"$f":"E$101+(E106-E107)","v":{"$error":"#VALUE!"}},null,{"$f":"(D113+D114+D115+D116)-(E113+E114+E115+E116)","v":{"$error":"#VALUE!"}},"y4",{"$f":"D101","v":{"$error":"#VALUE!"}},{"$f":"E101","v":{"$error":"#VALUE!"}},null,{"$f":"(I113+I114+I115+I116)-(J113+J114+J115+J116)","v":{"$error":"#VALUE!"}}]
[null,null,"y5",{"$f":"D$101+(D107-D108)","v":{"$error":"#VALUE!"}},{"$f":"E$101+(E107-E108)","v":{"$error":"#VALUE!"}},null,{"$f":"SUM(D113:D117) -SUM(E113:E117)","v":{"$error":"#VALUE!"}},"y5",{"$f":"D101","v":{"$error":"#VALUE!"}},{"$f":"E101","v":{"$error":"#VALUE!"}},null,{"$f":"SUM(I113:I117) -SUM(J113:J117)","v":{"$error":"#VALUE!"}}]
[null,null,"y6",null,null,null,null,"y6"]
[null,null,"y7",null,null,null,null,"y7"]
[]
[null,null,"Payback time",null,{"$f":"IF(G101>0,(G94)/(G101+G109)*(-1),\"no savings\")","v":{"$error":"#VALUE!"}},"years",null,"Payback time",null,{"$f":"IF(G101>0,(G94)/(G101)*(-1),\"no savings\")","v":{"$error":"#VALUE!"}},"years"]
[]
[null,null,null,"Select Currency (EUR)",1]
[null,null,null,"GBP",0.88,null,"21_05_2019"]
[null,null,null,"USD",1.1200000000000001,null,"21_05_2019"]
[null,null,null,"BRL",4.57,null,"21_05_2019"]

{"sheet":"Calc2","index":5,"n_rows":316,"n_cols":101,"rows_kept":316,"cut":false,"hidden":true,"merged":[]}
[]
[]
[null,null,null,"only amend with improved figures"]
[null,null,null,"DO NOT AMEND"]
[]
[]
[null,"DO NOT AMEND - used in calculations"]
[]
[]
[]
[]
[]
[1,2,3,4,5,6,7,8,9,10,11,12,13,14,15,16,17,18,19,20,21,22,23,24,25,26,27,28,29,30,31,32,33,34,35,36,37,38,39,40,41,42,43,44,45,46,47,48,49,50,51,52,53,54,55,56,57,58,59,60,61,62,63,64,65,66,67,68,69,70,71,72,73,74,75,76,77,78,79,80,81,82,83,84,85,86,87,88,89,90,91,92,93,94,95,96,97,98,99,100,101]
[]
[null,"Application"]
[]
[null,"Voltage of truck",{"$f":"VLOOKUP(Inputs!$F$10,Trucks!C12:D49,2,FALSE)","v":"Select"}]
[]
[null,"RecommendedVDI",{"$f":"VLOOKUP(Inputs!F10,Trucks!C12:K50,3,FALSE)","v":0}]
[]
[null,"recommended idle time",{"$f":"VLOOKUP(Inputs!F10,Trucks!C12:O49,4,FALSE)","v":0}]
[]
[null,"Available Pb batteries",{"$f":"VLOOKUP(Inputs!$F$10,Trucks!$C$12:$DF$49,E$13,FALSE)","v":"Select"},{"$f":"VLOOKUP(Inputs!$F$10,Trucks!$C$12:$DF$49,F$13,FALSE)","v":0},{"$f":"VLOOKUP(Inputs!$F$10,Trucks!$C$12:$DF$49,G$13,FALSE)","v":0},{"$f":"VLOOKUP(Inputs!$F$10,Trucks!$C$12:$DF$49,H$13,FALSE)","v":0},{"$f":"VLOOKUP(Inputs!$F$10,Trucks!$C$12:$DF$49,I$13,FALSE)","v":0},{"$f":"VLOOKUP(Inputs!$F$10,Trucks!$C$12:$DF$49,J$13,FALSE)","v":0},{"$f":"VLOOKUP(Inputs!$F$10,Trucks!$C$12:$DF$49,K$13,FALSE)","v":0},{"$f":"VLOOKUP(Inputs!$F$10,Trucks!$C$12:$DF$49,L$13,FALSE)","v":0},{"$f":"VLOOKUP(Inputs!$F$10,Trucks!$C$12:$DF$49,M$13,FALSE)","v":0},{"$f":"VLOOKUP(Inputs!$F$10,Trucks!$C$12:$DF$49,N$13,FALSE)","v":"do not delete row"},{"$f":"VLOOKUP(Inputs!$F$10,Trucks!$C$12:$DF$49,O$13,FALSE)","v":0},{"$f":"VLOOKUP(Inputs!$F$10,Trucks!$C$12:$DF$49,P$13,FALSE)","v":0},{"$f":"VLOOKUP(Inputs!$F$10,Trucks!$C$12:$DF$49,Q$13,FALSE)","v":0},{"$f":"VLOOKUP(Inputs!$F$10,Trucks!$C$12:$DF$49,R$13,FALSE)","v":0},{"$f":"VLOOKUP(Inputs!$F$10,Trucks!$C$12:$DF$49,S$13,FALSE)","v":0},{"$f":"VLOOKUP(Inputs!$F$10,Trucks!$C$12:$DF$49,T$13,FALSE)","v":0},{"$f":"VLOOKUP(Inputs!$F$10,Trucks!$C$12:$DF$49,U$13,FALSE)","v":0},{"$f":"VLOOKUP(Inputs!$F$10,Trucks!$C$12:$DF$49,V$13,FALSE)","v":0},{"$f":"VLOOKUP(Inputs!$F$10,Trucks!$C$12:$DF$49,W$13,FALSE)","v":0},{"$f":"VLOOKUP(Inputs!$F$10,Trucks!$C$12:$DF$49,X$13,FALSE)","v":0},{"$f":"VLOOKUP(Inputs!$F$10,Trucks!$C$12:$DF$49,Y$13,FALSE)","v":0},{"$f":"VLOOKUP(Inputs!$F$10,Trucks!$C$12:$DF$49,Z$13,FALSE)","v":0},{"$f":"VLOOKUP(Inputs!$F$10,Trucks!$C$12:$DF$49,AA$13,FALSE)","v":0},{"$f":"VLOOKUP(Inputs!$F$10,Trucks!$C$12:$DF$49,AB$13,FALSE)","v":0},{"$f":"VLOOKUP(Inputs!$F$10,Trucks!$C$12:$DF$49,AC$13,FALSE)","v":0},{"$f":"VLOOKUP(Inputs!$F$10,Trucks!$C$12:$DF$49,AD$13,FALSE)","v":0},{"$f":"VLOOKUP(Inputs!$F$10,Trucks!$C$12:$DF$49,AE$13,FALSE)","v":0},{"$f":"VLOOKUP(Inputs!$F$10,Trucks!$C$12:$DF$49,AF$13,FALSE)","v":0},{"$f":"VLOOKUP(Inputs!$F$10,Trucks!$C$12:$DF$49,AG$13,FALSE)","v":0},{"$f":"VLOOKUP(Inputs!$F$10,Trucks!$C$12:$DF$49,AH$13,FALSE)","v":0},{"$f":"VLOOKUP(Inputs!$F$10,Trucks!$C$12:$DF$49,AI$13,FALSE)","v":0},{"$f":"VLOOKUP(Inputs!$F$10,Trucks!$C$12:$DF$49,AJ$13,FALSE)","v":0},{"$f":"VLOOKUP(Inputs!$F$10,Trucks!$C$12:$DF$49,AK$13,FALSE)","v":0},{"$f":"VLOOKUP(Inputs!$F$10,Trucks!$C$12:$DF$49,AL$13,FALSE)","v":0},{"$f":"VLOOKUP(Inputs!$F$10,Trucks!$C$12:$DF$49,AM$13,FALSE)","v":0},{"$f":"VLOOKUP(Inputs!$F$10,Trucks!$C$12:$DF$49,AN$13,FALSE)","v":0},{"$f":"VLOOKUP(Inputs!$F$10,Trucks!$C$12:$DF$49,AO$13,FALSE)","v":0},{"$f":"VLOOKUP(Inputs!$F$10,Trucks!$C$12:$DF$49,AP$13,FALSE)","v":0},{"$f":"VLOOKUP(Inputs!$F$10,Trucks!$C$12:$DF$49,AQ$13,FALSE)","v":0},{"$f":"VLOOKUP(Inputs!$F$10,Trucks!$C$12:$DF$49,AR$13,FALSE)","v":0},{"$f":"VLOOKUP(Inputs!$F$10,Trucks!$C$12:$DF$49,AS$13,FALSE)","v":0},{"$f":"VLOOKUP(Inputs!$F$10,Trucks!$C$12:$DF$49,AT$13,FALSE)","v":0},{"$f":"VLOOKUP(Inputs!$F$10,Trucks!$C$12:$DF$49,AU$13,FALSE)","v":0},{"$f":"VLOOKUP(Inputs!$F$10,Trucks!$C$12:$DF$49,AV$13,FALSE)","v":0},{"$f":"VLOOKUP(Inputs!$F$10,Trucks!$C$12:$DF$49,AW$13,FALSE)","v":0},{"$f":"VLOOKUP(Inputs!$F$10,Trucks!$C$12:$DF$49,AX$13,FALSE)","v":0},{"$f":"VLOOKUP(Inputs!$F$10,Trucks!$C$12:$DF$49,AY$13,FALSE)","v":0},{"$f":"VLOOKUP(Inputs!$F$10,Trucks!$C$12:$DF$49,AZ$13,FALSE)","v":0},{"$f":"VLOOKUP(Inputs!$F$10,Trucks!$C$12:$DF$49,BA$13,FALSE)","v":0},{"$f":"VLOOKUP(Inputs!$F$10,Trucks!$C$12:$DF$49,BB$13,FALSE)","v":0},{"$f":"VLOOKUP(Inputs!$F$10,Trucks!$C$12:$DF$49,BC$13,FALSE)","v":0},{"$f":"VLOOKUP(Inputs!$F$10,Trucks!$C$12:$DF$49,BD$13,FALSE)","v":0},{"$f":"VLOOKUP(Inputs!$F$10,Trucks!$C$12:$DF$49,BE$13,FALSE)","v":0},{"$f":"VLOOKUP(Inputs!$F$10,Trucks!$C$12:$DF$49,BF$13,FALSE)","v":0},{"$f":"VLOOKUP(Inputs!$F$10,Trucks!$C$12:$DF$49,BG$13,FALSE)","v":0},{"$f":"VLOOKUP(Inputs!$F$10,Trucks!$C$12:$DF$49,BH$13,FALSE)","v":0},{"$f":"VLOOKUP(Inputs!$F$10,Trucks!$C$12:$DF$49,BI$13,FALSE)","v":0},{"$f":"VLOOKUP(Inputs!$F$10,Trucks!$C$12:$DF$49,BJ$13,FALSE)","v":0},{"$f":"VLOOKUP(Inputs!$F$10,Trucks!$C$12:$DF$49,BK$13,FALSE)","v":0},{"$f":"VLOOKUP(Inputs!$F$10,Trucks!$C$12:$DF$49,BL$13,FALSE)","v":0},{"$f":"VLOOKUP(Inputs!$F$10,Trucks!$C$12:$DF$49,BM$13,FALSE)","v":0},{"$f":"VLOOKUP(Inputs!$F$10,Trucks!$C$12:$DF$49,BN$13,FALSE)","v":0},{"$f":"VLOOKUP(Inputs!$F$10,Trucks!$C$12:$DF$49,BO$13,FALSE)","v":0},{"$f":"VLOOKUP(Inputs!$F$10,Trucks!$C$12:$DF$49,BP$13,FALSE)","v":0},{"$f":"VLOOKUP(Inputs!$F$10,Trucks!$C$12:$DF$49,BQ$13,FALSE)","v":0},{"$f":"VLOOKUP(Inputs!$F$10,Trucks!$C$12:$DF$49,BR$13,FALSE)","v":0},{"$f":"VLOOKUP(Inputs!$F$10,Trucks!$C$12:$DF$49,BS$13,FALSE)","v":0},{"$f":"VLOOKUP(Inputs!$F$10,Trucks!$C$12:$DF$49,BT$13,FALSE)","v":0},{"$f":"VLOOKUP(Inputs!$F$10,Trucks!$C$12:$DF$49,BU$13,FALSE)","v":0},{"$f":"VLOOKUP(Inputs!$F$10,Trucks!$C$12:$DF$49,BV$13,FALSE)","v":0},{"$f":"VLOOKUP(Inputs!$F$10,Trucks!$C$12:$DF$49,BW$13,FALSE)","v":0},{"$f":"VLOOKUP(Inputs!$F$10,Trucks!$C$12:$DF$49,BX$13,FALSE)","v":0},{"$f":"VLOOKUP(Inputs!$F$10,Trucks!$C$12:$DF$49,BY$13,FALSE)","v":0},{"$f":"VLOOKUP(Inputs!$F$10,Trucks!$C$12:$DF$49,BZ$13,FALSE)","v":0},{"$f":"VLOOKUP(Inputs!$F$10,Trucks!$C$12:$DF$49,CA$13,FALSE)","v":0},{"$f":"VLOOKUP(Inputs!$F$10,Trucks!$C$12:$DF$49,CB$13,FALSE)","v":0},{"$f":"VLOOKUP(Inputs!$F$10,Trucks!$C$12:$DF$49,CC$13,FALSE)","v":0},{"$f":"VLOOKUP(Inputs!$F$10,Trucks!$C$12:$DF$49,CD$13,FALSE)","v":0},{"$f":"VLOOKUP(Inputs!$F$10,Trucks!$C$12:$DF$49,CE$13,FALSE)","v":0},{"$f":"VLOOKUP(Inputs!$F$10,Trucks!$C$12:$DF$49,CF$13,FALSE)","v":0},{"$f":"VLOOKUP(Inputs!$F$10,Trucks!$C$12:$DF$49,CG$13,FALSE)","v":0},{"$f":"VLOOKUP(Inputs!$F$10,Trucks!$C$12:$DF$49,CH$13,FALSE)","v":0},{"$f":"VLOOKUP(Inputs!$F$10,Trucks!$C$12:$DF$49,CI$13,FALSE)","v":0},{"$f":"VLOOKUP(Inputs!$F$10,Trucks!$C$12:$DF$49,CJ$13,FALSE)","v":0},{"$f":"VLOOKUP(Inputs!$F$10,Trucks!$C$12:$DF$49,CK$13,FALSE)","v":0},{"$f":"VLOOKUP(Inputs!$F$10,Trucks!$C$12:$DF$49,CL$13,FALSE)","v":0},{"$f":"VLOOKUP(Inputs!$F$10,Trucks!$C$12:$DF$49,CM$13,FALSE)","v":0},{"$f":"VLOOKUP(Inputs!$F$10,Trucks!$C$12:$DF$49,CN$13,FALSE)","v":0},{"$f":"VLOOKUP(Inputs!$F$10,Trucks!$C$12:$DF$49,CO$13,FALSE)","v":0},{"$f":"VLOOKUP(Inputs!$F$10,Trucks!$C$12:$DF$49,CP$13,FALSE)","v":0},{"$f":"VLOOKUP(Inputs!$F$10,Trucks!$C$12:$DF$49,CQ$13,FALSE)","v":0},{"$f":"VLOOKUP(Inputs!$F$10,Trucks!$C$12:$DF$49,CR$13,FALSE)","v":0},{"$f":"VLOOKUP(Inputs!$F$10,Trucks!$C$12:$DF$49,CS$13,FALSE)","v":0},{"$f":"VLOOKUP(Inputs!$F$10,Trucks!$C$12:$DF$49,CT$13,FALSE)","v":0},{"$f":"VLOOKUP(Inputs!$F$10,Trucks!$C$12:$DF$49,CU$13,FALSE)","v":0},{"$f":"VLOOKUP(Inputs!$F$10,Trucks!$C$12:$DF$49,CV$13,FALSE)","v":0}]
[null,"Available Pb charger","Select","50 Hz","High Frequency"]
[]
[null,"Cell type number",{"$f":"IF(Calc2!$C$17=Trucks!B54,VLOOKUP(Inputs!$F$45,Trucks!$C$53:$E$96,2,FALSE),IF(Calc2!$C$17=Trucks!B55,VLOOKUP(Inputs!$F$45,Trucks!$C$53:$E$96,2,FALSE),IF(Calc2!$C$17=Trucks!B67,VLOOKUP(Inputs!$F$45,Trucks!$C$53:$E$96,2,FALSE), IF(Calc2!$C$17=Trucks!B83,VLOOKUP(Inputs!$F$45,Trucks!$C$53:$E$96,2,FALSE),IF(Calc2!$C$17=Trucks!B90,VLOOKUP(Inputs!$F$45,Trucks!$C$53:$E$96,2,FALSE),IF(Calc2!$C$17=Trucks!B93,VLOOKUP(Inputs!$F$45,Trucks!$C$53:$E$96,2,FALSE),IF(Calc2!$C$17=Trucks!B95,VLOOKUP(Inputs!$F$45,Trucks!$C$53:$E$96,2,FALSE))))))))","v":0}]
[null,"cell type PzB / PzS",{"$f":"IF(Calc2!$C$17=Trucks!B54,VLOOKUP(Inputs!$F$45,Trucks!$C$53:$E$96,3,FALSE),IF(Calc2!$C$17=Trucks!B55,VLOOKUP(Inputs!$F$45,Trucks!$C$53:$E$96,3,FALSE),IF(Calc2!$C$17=Trucks!B67,VLOOKUP(Inputs!$F$45,Trucks!$C$53:$E$96,3,FALSE),IF(Calc2!$C$17=Trucks!B83,VLOOKUP(Inputs!$F$45,Trucks!$C$53:$E$96,3,FALSE),IF(Calc2!$C$17=Trucks!B90,VLOOKUP(Inputs!$F$45,Trucks!$C$53:$E$96,3,FALSE),IF(Calc2!$C$17=Trucks!B93,VLOOKUP(Inputs!$F$45,Trucks!$C$53:$E$96,3,FALSE), IF(Calc2!$C$17=Trucks!B95,VLOOKUP(Inputs!$F$45,Trucks!$C$53:$E$96,3,FALSE))))))))","v":"PzB"}]
[null,"'water factor'",{"$f":"IF(C27=\"PzB\",C26*0.0323,IF(C27=\"PzS\",C26*0.0441))","v":0}]
[]
[null,"Available Li Batteries",{"$f":"VLOOKUP(Inputs!$F$10,Trucks!$B$100:$DA$137,E13,FALSE)","v":"Select"},{"$f":"VLOOKUP(Inputs!$F$10,Trucks!$B$100:$DA$137,F13,FALSE)","v":0},{"$f":"VLOOKUP(Inputs!$F$10,Trucks!$B$100:$DA$137,G13,FALSE)","v":0},{"$f":"VLOOKUP(Inputs!$F$10,Trucks!$B$100:$DA$137,H13,FALSE)","v":0},{"$f":"VLOOKUP(Inputs!$F$10,Trucks!$B$100:$DA$137,I13,FALSE)","v":0},{"$f":"VLOOKUP(Inputs!$F$10,Trucks!$B$100:$DA$137,J13,FALSE)","v":0},{"$f":"VLOOKUP(Inputs!$F$10,Trucks!$B$100:$DA$137,K13,FALSE)","v":0},{"$f":"VLOOKUP(Inputs!$F$10,Trucks!$B$100:$DA$137,L13,FALSE)","v":0},{"$f":"VLOOKUP(Inputs!$F$10,Trucks!$B$100:$DA$137,M13,FALSE)","v":0},{"$f":"VLOOKUP(Inputs!$F$10,Trucks!$B$100:$DA$137,N13,FALSE)","v":0},{"$f":"VLOOKUP(Inputs!$F$10,Trucks!$B$100:$DA$137,O13,FALSE)","v":0},{"$f":"VLOOKUP(Inputs!$F$10,Trucks!$B$100:$DA$137,P13,FALSE)","v":0},{"$f":"VLOOKUP(Inputs!$F$10,Trucks!$B$100:$DA$137,Q13,FALSE)","v":0},{"$f":"VLOOKUP(Inputs!$F$10,Trucks!$B$100:$DA$137,R13,FALSE)","v":0},{"$f":"VLOOKUP(Inputs!$F$10,Trucks!$B$100:$DA$137,S13,FALSE)","v":0},{"$f":"VLOOKUP(Inputs!$F$10,Trucks!$B$100:$DA$137,T13,FALSE)","v":0},{"$f":"VLOOKUP(Inputs!$F$10,Trucks!$B$100:$DA$137,U13,FALSE)","v":0},{"$f":"VLOOKUP(Inputs!$F$10,Trucks!$B$100:$DA$137,V13,FALSE)","v":0},{"$f":"VLOOKUP(Inputs!$F$10,Trucks!$B$100:$DA$137,W13,FALSE)","v":0},{"$f":"VLOOKUP(Inputs!$F$10,Trucks!$B$100:$DA$137,X13,FALSE)","v":0},{"$f":"VLOOKUP(Inputs!$F$10,Trucks!$B$100:$DA$137,Y13,FALSE)","v":0},{"$f":"VLOOKUP(Inputs!$F$10,Trucks!$B$100:$DA$137,Z13,FALSE)","v":0},{"$f":"VLOOKUP(Inputs!$F$10,Trucks!$B$100:$DA$137,AA13,FALSE)","v":0},{"$f":"VLOOKUP(Inputs!$F$10,Trucks!$B$100:$DA$137,AB13,FALSE)","v":0},{"$f":"VLOOKUP(Inputs!$F$10,Trucks!$B$100:$DA$137,AC13,FALSE)","v":0},{"$f":"VLOOKUP(Inputs!$F$10,Trucks!$B$100:$DA$137,AD13,FALSE)","v":0},{"$f":"VLOOKUP(Inputs!$F$10,Trucks!$B$100:$DA$137,AE13,FALSE)","v":0},{"$f":"VLOOKUP(Inputs!$F$10,Trucks!$B$100:$DA$137,AF13,FALSE)","v":0},{"$f":"VLOOKUP(Inputs!$F$10,Trucks!$B$100:$DA$137,AG13,FALSE)","v":0},{"$f":"VLOOKUP(Inputs!$F$10,Trucks!$B$100:$DA$137,AH13,FALSE)","v":0},{"$f":"VLOOKUP(Inputs!$F$10,Trucks!$B$100:$DA$137,AI13,FALSE)","v":0},{"$f":"VLOOKUP(Inputs!$F$10,Trucks!$B$100:$DA$137,AJ13,FALSE)","v":0},{"$f":"VLOOKUP(Inputs!$F$10,Trucks!$B$100:$DA$137,AK13,FALSE)","v":0},{"$f":"VLOOKUP(Inputs!$F$10,Trucks!$B$100:$DA$137,AL13,FALSE)","v":0},{"$f":"VLOOKUP(Inputs!$F$10,Trucks!$B$100:$DA$137,AM13,FALSE)","v":0},{"$f":"VLOOKUP(Inputs!$F$10,Trucks!$B$100:$DA$137,AN13,FALSE)","v":0},{"$f":"VLOOKUP(Inputs!$F$10,Trucks!$B$100:$DA$137,AO13,FALSE)","v":0},{"$f":"VLOOKUP(Inputs!$F$10,Trucks!$B$100:$DA$137,AP13,FALSE)","v":0},{"$f":"VLOOKUP(Inputs!$F$10,Trucks!$B$100:$DA$137,AQ13,FALSE)","v":0},{"$f":"VLOOKUP(Inputs!$F$10,Trucks!$B$100:$DA$137,AR13,FALSE)","v":0},{"$f":"VLOOKUP(Inputs!$F$10,Trucks!$B$100:$DA$137,AS13,FALSE)","v":0},{"$f":"VLOOKUP(Inputs!$F$10,Trucks!$B$100:$DA$137,AT13,FALSE)","v":0},{"$f":"VLOOKUP(Inputs!$F$10,Trucks!$B$100:$DA$137,AU13,FALSE)","v":0},{"$f":"VLOOKUP(Inputs!$F$10,Trucks!$B$100:$DA$137,AV13,FALSE)","v":0},{"$f":"VLOOKUP(Inputs!$F$10,Trucks!$B$100:$DA$137,AW13,FALSE)","v":0},{"$f":"VLOOKUP(Inputs!$F$10,Trucks!$B$100:$DA$137,AX13,FALSE)","v":0},{"$f":"VLOOKUP(Inputs!$F$10,Trucks!$B$100:$DA$137,AY13,FALSE)","v":0},{"$f":"VLOOKUP(Inputs!$F$10,Trucks!$B$100:$DA$137,AZ13,FALSE)","v":0},{"$f":"VLOOKUP(Inputs!$F$10,Trucks!$B$100:$DA$137,BA13,FALSE)","v":0},{"$f":"VLOOKUP(Inputs!$F$10,Trucks!$B$100:$DA$137,BB13,FALSE)","v":0},{"$f":"VLOOKUP(Inputs!$F$10,Trucks!$B$100:$DA$137,BC13,FALSE)","v":0},{"$f":"VLOOKUP(Inputs!$F$10,Trucks!$B$100:$DA$137,BD13,FALSE)","v":0},{"$f":"VLOOKUP(Inputs!$F$10,Trucks!$B$100:$DA$137,BE13,FALSE)","v":0},{"$f":"VLOOKUP(Inputs!$F$10,Trucks!$B$100:$DA$137,BF13,FALSE)","v":0},{"$f":"VLOOKUP(Inputs!$F$10,Trucks!$B$100:$DA$137,BG13,FALSE)","v":0},{"$f":"VLOOKUP(Inputs!$F$10,Trucks!$B$100:$DA$137,BH13,FALSE)","v":0},{"$f":"VLOOKUP(Inputs!$F$10,Trucks!$B$100:$DA$137,BI13,FALSE)","v":0},{"$f":"VLOOKUP(Inputs!$F$10,Trucks!$B$100:$DA$137,BJ13,FALSE)","v":0},{"$f":"VLOOKUP(Inputs!$F$10,Trucks!$B$100:$DA$137,BK13,FALSE)","v":0},{"$f":"VLOOKUP(Inputs!$F$10,Trucks!$B$100:$DA$137,BL13,FALSE)","v":0},{"$f":"VLOOKUP(Inputs!$F$10,Trucks!$B$100:$DA$137,BM13,FALSE)","v":0},{"$f":"VLOOKUP(Inputs!$F$10,Trucks!$B$100:$DA$137,BN13,FALSE)","v":0},{"$f":"VLOOKUP(Inputs!$F$10,Trucks!$B$100:$DA$137,BO13,FALSE)","v":0},{"$f":"VLOOKUP(Inputs!$F$10,Trucks!$B$100:$DA$137,BP13,FALSE)","v":0},{"$f":"VLOOKUP(Inputs!$F$10,Trucks!$B$100:$DA$137,BQ13,FALSE)","v":0},{"$f":"VLOOKUP(Inputs!$F$10,Trucks!$B$100:$DA$137,BR13,FALSE)","v":0},{"$f":"VLOOKUP(Inputs!$F$10,Trucks!$B$100:$DA$137,BS13,FALSE)","v":0},{"$f":"VLOOKUP(Inputs!$F$10,Trucks!$B$100:$DA$137,BT13,FALSE)","v":0},{"$f":"VLOOKUP(Inputs!$F$10,Trucks!$B$100:$DA$137,BU13,FALSE)","v":0},{"$f":"VLOOKUP(Inputs!$F$10,Trucks!$B$100:$DA$137,BV13,FALSE)","v":0},{"$f":"VLOOKUP(Inputs!$F$10,Trucks!$B$100:$DA$137,BW13,FALSE)","v":0},{"$f":"VLOOKUP(Inputs!$F$10,Trucks!$B$100:$DA$137,BX13,FALSE)","v":0},{"$f":"VLOOKUP(Inputs!$F$10,Trucks!$B$100:$DA$137,BY13,FALSE)","v":0},{"$f":"VLOOKUP(Inputs!$F$10,Trucks!$B$100:$DA$137,BZ13,FALSE)","v":0},{"$f":"VLOOKUP(Inputs!$F$10,Trucks!$B$100:$DA$137,CA13,FALSE)","v":0},{"$f":"VLOOKUP(Inputs!$F$10,Trucks!$B$100:$DA$137,CB13,FALSE)","v":0},{"$f":"VLOOKUP(Inputs!$F$10,Trucks!$B$100:$DA$137,CC13,FALSE)","v":0},{"$f":"VLOOKUP(Inputs!$F$10,Trucks!$B$100:$DA$137,CD13,FALSE)","v":0},{"$f":"VLOOKUP(Inputs!$F$10,Trucks!$B$100:$DA$137,CE13,FALSE)","v":0},{"$f":"VLOOKUP(Inputs!$F$10,Trucks!$B$100:$DA$137,CF13,FALSE)","v":0},{"$f":"VLOOKUP(Inputs!$F$10,Trucks!$B$100:$DA$137,CG13,FALSE)","v":0},{"$f":"VLOOKUP(Inputs!$F$10,Trucks!$B$100:$DA$137,CH13,FALSE)","v":0},{"$f":"VLOOKUP(Inputs!$F$10,Trucks!$B$100:$DA$137,CI13,FALSE)","v":0},{"$f":"VLOOKUP(Inputs!$F$10,Trucks!$B$100:$DA$137,CJ13,FALSE)","v":0},{"$f":"VLOOKUP(Inputs!$F$10,Trucks!$B$100:$DA$137,CK13,FALSE)","v":0},{"$f":"VLOOKUP(Inputs!$F$10,Trucks!$B$100:$DA$137,CL13,FALSE)","v":0},{"$f":"VLOOKUP(Inputs!$F$10,Trucks!$B$100:$DA$137,CM13,FALSE)","v":0},{"$f":"VLOOKUP(Inputs!$F$10,Trucks!$B$100:$DA$137,CN13,FALSE)","v":0},{"$f":"VLOOKUP(Inputs!$F$10,Trucks!$B$100:$DA$137,CO13,FALSE)","v":0},{"$f":"VLOOKUP(Inputs!$F$10,Trucks!$B$100:$DA$137,CP13,FALSE)","v":0},{"$f":"VLOOKUP(Inputs!$F$10,Trucks!$B$100:$DA$137,CQ13,FALSE)","v":0},{"$f":"VLOOKUP(Inputs!$F$10,Trucks!$B$100:$DA$137,CR13,FALSE)","v":0},{"$f":"VLOOKUP(Inputs!$F$10,Trucks!$B$100:$DA$137,CS13,FALSE)","v":0},{"$f":"VLOOKUP(Inputs!$F$10,Trucks!$B$100:$DA$137,CT13,FALSE)","v":0},{"$f":"VLOOKUP(Inputs!$F$10,Trucks!$B$100:$DA$137,CU13,FALSE)","v":0},{"$f":"VLOOKUP(Inputs!$F$10,Trucks!$B$100:$DA$137,CV13,FALSE)","v":0}]
[null,"Available Li chargers",{"$f":"IF(Calc2!$C$17=Trucks!$D$13,VLOOKUP(Inputs!$F$62,Trucks!$D$141:$DB$169,B$13,FALSE), IF(Calc2!$C$17=Trucks!$D$14,VLOOKUP(Inputs!$F$62,Trucks!$D$143:$DB$150,B$13,FALSE), IF(AND(Calc2!$C$17=Trucks!$D$29,Inputs!$F$8=Trucks!$B$151),VLOOKUP(Inputs!$F$62,Trucks!$D$151:$DB$154,B$13,FALSE),IF(AND(Calc2!$C$17=Trucks!$D$34,Inputs!$F$8=Trucks!$B$155),VLOOKUP(Inputs!$F$62,Trucks!$D$155:$DB$159,B$13,FALSE),IF(Calc2!$C$17=Trucks!$D$39,VLOOKUP(Inputs!$F$62,Trucks!$D$160:$DB$162,B$13,FALSE),IF(Calc2!$C$17=Trucks!$D$43,VLOOKUP(Inputs!$F$62,Trucks!$D$163:$DB$165,B$13,FALSE),IF(Calc2!$C$17=Trucks!$D$46,VLOOKUP(Inputs!$F$62,Trucks!$D$166:$DB$167,B$13,FALSE), IF(Calc2!$C$17=Trucks!$D$48,VLOOKUP(Inputs!$F$62,Trucks!$D$168:$DB$169,B$13,FALSE)))))))))","v":"Select"},{"$f":"IF(Calc2!$C$17=Trucks!$D$13,VLOOKUP(Inputs!$F$62,Trucks!$D$141:$DB$169,C$13,FALSE), IF(Calc2!$C$17=Trucks!$D$14,VLOOKUP(Inputs!$F$62,Trucks!$D$143:$DB$150,C$13,FALSE), IF(AND(Calc2!$C$17=Trucks!$D$29,Inputs!$F$8=Trucks!$B$151),VLOOKUP(Inputs!$F$62,Trucks!$D$151:$DB$154,C$13,FALSE),IF(AND(Calc2!$C$17=Trucks!$D$34,Inputs!$F$8=Trucks!$B$155),VLOOKUP(Inputs!$F$62,Trucks!$D$155:$DB$159,C$13,FALSE),IF(Calc2!$C$17=Trucks!$D$39,VLOOKUP(Inputs!$F$62,Trucks!$D$160:$DB$162,C$13,FALSE),IF(Calc2!$C$17=Trucks!$D$43,VLOOKUP(Inputs!$F$62,Trucks!$D$163:$DB$165,C$13,FALSE),IF(Calc2!$C$17=Trucks!$D$46,VLOOKUP(Inputs!$F$62,Trucks!$D$166:$DB$167,C$13,FALSE), IF(Calc2!$C$17=Trucks!$D$48,VLOOKUP(Inputs!$F$62,Trucks!$D$168:$DB$169,C$13,FALSE)))))))))","v":0},{"$f":"IF(Calc2!$C$17=Trucks!$D$13,VLOOKUP(Inputs!$F$62,Trucks!$D$141:$DB$169,D$13,FALSE), IF(Calc2!$C$17=Trucks!$D$14,VLOOKUP(Inputs!$F$62,Trucks!$D$143:$DB$150,D$13,FALSE), IF(AND(Calc2!$C$17=Trucks!$D$29,Inputs!$F$8=Trucks!$B$151),VLOOKUP(Inputs!$F$62,Trucks!$D$151:$DB$154,D$13,FALSE),IF(AND(Calc2!$C$17=Trucks!$D$34,Inputs!$F$8=Trucks!$B$155),VLOOKUP(Inputs!$F$62,Trucks!$D$155:$DB$159,D$13,FALSE),IF(Calc2!$C$17=Trucks!$D$39,VLOOKUP(Inputs!$F$62,Trucks!$D$160:$DB$162,D$13,FALSE),IF(Calc2!$C$17=Trucks!$D$43,VLOOKUP(Inputs!$F$62,Trucks!$D$163:$DB$165,D$13,FALSE),IF(Calc2!$C$17=Trucks!$D$46,VLOOKUP(Inputs!$F$62,Trucks!$D$166:$DB$167,D$13,FALSE), IF(Calc2!$C$17=Trucks!$D$48,VLOOKUP(Inputs!$F$62,Trucks!$D$168:$DB$169,D$13,FALSE)))))))))","v":0},{"$f":"IF(Calc2!$C$17=Trucks!$D$13,VLOOKUP(Inputs!$F$62,Trucks!$D$141:$DB$169,E$13,FALSE), IF(Calc2!$C$17=Trucks!$D$14,VLOOKUP(Inputs!$F$62,Trucks!$D$143:$DB$150,E$13,FALSE), IF(AND(Calc2!$C$17=Trucks!$D$29,Inputs!$F$8=Trucks!$B$151),VLOOKUP(Inputs!$F$62,Trucks!$D$151:$DB$154,E$13,FALSE),IF(AND(Calc2!$C$17=Trucks!$D$34,Inputs!$F$8=Trucks!$B$155),VLOOKUP(Inputs!$F$62,Trucks!$D$155:$DB$159,E$13,FALSE),IF(Calc2!$C$17=Trucks!$D$39,VLOOKUP(Inputs!$F$62,Trucks!$D$160:$DB$162,E$13,FALSE),IF(Calc2!$C$17=Trucks!$D$43,VLOOKUP(Inputs!$F$62,Trucks!$D$163:$DB$165,E$13,FALSE),IF(Calc2!$C$17=Trucks!$D$46,VLOOKUP(Inputs!$F$62,Trucks!$D$166:$DB$167,E$13,FALSE), IF(Calc2!$C$17=Trucks!$D$48,VLOOKUP(Inputs!$F$62,Trucks!$D$168:$DB$169,E$13,FALSE)))))))))","v":0},{"$f":"IF(Calc2!$C$17=Trucks!$D$13,VLOOKUP(Inputs!$F$62,Trucks!$D$141:$DB$169,F$13,FALSE), IF(Calc2!$C$17=Trucks!$D$14,VLOOKUP(Inputs!$F$62,Trucks!$D$143:$DB$150,F$13,FALSE), IF(AND(Calc2!$C$17=Trucks!$D$29,Inputs!$F$8=Trucks!$B$151),VLOOKUP(Inputs!$F$62,Trucks!$D$151:$DB$154,F$13,FALSE),IF(AND(Calc2!$C$17=Trucks!$D$34,Inputs!$F$8=Trucks!$B$155),VLOOKUP(Inputs!$F$62,Trucks!$D$155:$DB$159,F$13,FALSE),IF(Calc2!$C$17=Trucks!$D$39,VLOOKUP(Inputs!$F$62,Trucks!$D$160:$DB$162,F$13,FALSE),IF(Calc2!$C$17=Trucks!$D$43,VLOOKUP(Inputs!$F$62,Trucks!$D$163:$DB$165,F$13,FALSE),IF(Calc2!$C$17=Trucks!$D$46,VLOOKUP(Inputs!$F$62,Trucks!$D$166:$DB$167,F$13,FALSE), IF(Calc2!$C$17=Trucks!$D$48,VLOOKUP(Inputs!$F$62,Trucks!$D$168:$DB$169,F$13,FALSE)))))))))","v":0},{"$f":"IF(Calc2!$C$17=Trucks!$D$13,VLOOKUP(Inputs!$F$62,Trucks!$D$141:$DB$169,G$13,FALSE), IF(Calc2!$C$17=Trucks!$D$14,VLOOKUP(Inputs!$F$62,Trucks!$D$143:$DB$150,G$13,FALSE), IF(AND(Calc2!$C$17=Trucks!$D$29,Inputs!$F$8=Trucks!$B$151),VLOOKUP(Inputs!$F$62,Trucks!$D$151:$DB$154,G$13,FALSE),IF(AND(Calc2!$C$17=Trucks!$D$34,Inputs!$F$8=Trucks!$B$155),VLOOKUP(Inputs!$F$62,Trucks!$D$155:$DB$159,G$13,FALSE),IF(Calc2!$C$17=Trucks!$D$39,VLOOKUP(Inputs!$F$62,Trucks!$D$160:$DB$162,G$13,FALSE),IF(Calc2!$C$17=Trucks!$D$43,VLOOKUP(Inputs!$F$62,Trucks!$D$163:$DB$165,G$13,FALSE),IF(Calc2!$C$17=Trucks!$D$46,VLOOKUP(Inputs!$F$62,Trucks!$D$166:$DB$167,G$13,FALSE), IF(Calc2!$C$17=Trucks!$D$48,VLOOKUP(Inputs!$F$62,Trucks!$D$168:$DB$169,G$13,FALSE)))))))))","v":0},{"$f":"IF(Calc2!$C$17=Trucks!$D$13,VLOOKUP(Inputs!$F$62,Trucks!$D$141:$DB$169,H$13,FALSE), IF(Calc2!$C$17=Trucks!$D$14,VLOOKUP(Inputs!$F$62,Trucks!$D$143:$DB$150,H$13,FALSE), IF(AND(Calc2!$C$17=Trucks!$D$29,Inputs!$F$8=Trucks!$B$151),VLOOKUP(Inputs!$F$62,Trucks!$D$151:$DB$154,H$13,FALSE),IF(AND(Calc2!$C$17=Trucks!$D$34,Inputs!$F$8=Trucks!$B$155),VLOOKUP(Inputs!$F$62,Trucks!$D$155:$DB$159,H$13,FALSE),IF(Calc2!$C$17=Trucks!$D$39,VLOOKUP(Inputs!$F$62,Trucks!$D$160:$DB$162,H$13,FALSE),IF(Calc2!$C$17=Trucks!$D$43,VLOOKUP(Inputs!$F$62,Trucks!$D$163:$DB$165,H$13,FALSE),IF(Calc2!$C$17=Trucks!$D$46,VLOOKUP(Inputs!$F$62,Trucks!$D$166:$DB$167,H$13,FALSE), IF(Calc2!$C$17=Trucks!$D$48,VLOOKUP(Inputs!$F$62,Trucks!$D$168:$DB$169,H$13,FALSE)))))))))","v":0},{"$f":"IF(Calc2!$C$17=Trucks!$D$13,VLOOKUP(Inputs!$F$62,Trucks!$D$141:$DB$169,I$13,FALSE), IF(Calc2!$C$17=Trucks!$D$14,VLOOKUP(Inputs!$F$62,Trucks!$D$143:$DB$150,I$13,FALSE), IF(AND(Calc2!$C$17=Trucks!$D$29,Inputs!$F$8=Trucks!$B$151),VLOOKUP(Inputs!$F$62,Trucks!$D$151:$DB$154,I$13,FALSE),IF(AND(Calc2!$C$17=Trucks!$D$34,Inputs!$F$8=Trucks!$B$155),VLOOKUP(Inputs!$F$62,Trucks!$D$155:$DB$159,I$13,FALSE),IF(Calc2!$C$17=Trucks!$D$39,VLOOKUP(Inputs!$F$62,Trucks!$D$160:$DB$162,I$13,FALSE),IF(Calc2!$C$17=Trucks!$D$43,VLOOKUP(Inputs!$F$62,Trucks!$D$163:$DB$165,I$13,FALSE),IF(Calc2!$C$17=Trucks!$D$46,VLOOKUP(Inputs!$F$62,Trucks!$D$166:$DB$167,I$13,FALSE), IF(Calc2!$C$17=Trucks!$D$48,VLOOKUP(Inputs!$F$62,Trucks!$D$168:$DB$169,I$13,FALSE)))))))))","v":0},{"$f":"IF(Calc2!$C$17=Trucks!$D$13,VLOOKUP(Inputs!$F$62,Trucks!$D$141:$DB$169,J$13,FALSE), IF(Calc2!$C$17=Trucks!$D$14,VLOOKUP(Inputs!$F$62,Trucks!$D$143:$DB$150,J$13,FALSE), IF(AND(Calc2!$C$17=Trucks!$D$29,Inputs!$F$8=Trucks!$B$151),VLOOKUP(Inputs!$F$62,Trucks!$D$151:$DB$154,J$13,FALSE),IF(AND(Calc2!$C$17=Trucks!$D$34,Inputs!$F$8=Trucks!$B$155),VLOOKUP(Inputs!$F$62,Trucks!$D$155:$DB$159,J$13,FALSE),IF(Calc2!$C$17=Trucks!$D$39,VLOOKUP(Inputs!$F$62,Trucks!$D$160:$DB$162,J$13,FALSE),IF(Calc2!$C$17=Trucks!$D$43,VLOOKUP(Inputs!$F$62,Trucks!$D$163:$DB$165,J$13,FALSE),IF(Calc2!$C$17=Trucks!$D$46,VLOOKUP(Inputs!$F$62,Trucks!$D$166:$DB$167,J$13,FALSE), IF(Calc2!$C$17=Trucks!$D$48,VLOOKUP(Inputs!$F$62,Trucks!$D$168:$DB$169,J$13,FALSE)))))))))","v":0},{"$f":"IF(Calc2!$C$17=Trucks!$D$13,VLOOKUP(Inputs!$F$62,Trucks!$D$141:$DB$169,K$13,FALSE), IF(Calc2!$C$17=Trucks!$D$14,VLOOKUP(Inputs!$F$62,Trucks!$D$143:$DB$150,K$13,FALSE), IF(AND(Calc2!$C$17=Trucks!$D$29,Inputs!$F$8=Trucks!$B$151),VLOOKUP(Inputs!$F$62,Trucks!$D$151:$DB$154,K$13,FALSE),IF(AND(Calc2!$C$17=Trucks!$D$34,Inputs!$F$8=Trucks!$B$155),VLOOKUP(Inputs!$F$62,Trucks!$D$155:$DB$159,K$13,FALSE),IF(Calc2!$C$17=Trucks!$D$39,VLOOKUP(Inputs!$F$62,Trucks!$D$160:$DB$162,K$13,FALSE),IF(Calc2!$C$17=Trucks!$D$43,VLOOKUP(Inputs!$F$62,Trucks!$D$163:$DB$165,K$13,FALSE),IF(Calc2!$C$17=Trucks!$D$46,VLOOKUP(Inputs!$F$62,Trucks!$D$166:$DB$167,K$13,FALSE), IF(Calc2!$C$17=Trucks!$D$48,VLOOKUP(Inputs!$F$62,Trucks!$D$168:$DB$169,K$13,FALSE)))))))))","v":0},{"$f":"IF(Calc2!$C$17=Trucks!$D$13,VLOOKUP(Inputs!$F$62,Trucks!$D$141:$DB$169,L$13,FALSE), IF(Calc2!$C$17=Trucks!$D$14,VLOOKUP(Inputs!$F$62,Trucks!$D$143:$DB$150,L$13,FALSE), IF(AND(Calc2!$C$17=Trucks!$D$29,Inputs!$F$8=Trucks!$B$151),VLOOKUP(Inputs!$F$62,Trucks!$D$151:$DB$154,L$13,FALSE),IF(AND(Calc2!$C$17=Trucks!$D$34,Inputs!$F$8=Trucks!$B$155),VLOOKUP(Inputs!$F$62,Trucks!$D$155:$DB$159,L$13,FALSE),IF(Calc2!$C$17=Trucks!$D$39,VLOOKUP(Inputs!$F$62,Trucks!$D$160:$DB$162,L$13,FALSE),IF(Calc2!$C$17=Trucks!$D$43,VLOOKUP(Inputs!$F$62,Trucks!$D$163:$DB$165,L$13,FALSE),IF(Calc2!$C$17=Trucks!$D$46,VLOOKUP(Inputs!$F$62,Trucks!$D$166:$DB$167,L$13,FALSE), IF(Calc2!$C$17=Trucks!$D$48,VLOOKUP(Inputs!$F$62,Trucks!$D$168:$DB$169,L$13,FALSE)))))))))","v":0},{"$f":"IF(Calc2!$C$17=Trucks!$D$13,VLOOKUP(Inputs!$F$62,Trucks!$D$141:$DB$169,M$13,FALSE), IF(Calc2!$C$17=Trucks!$D$14,VLOOKUP(Inputs!$F$62,Trucks!$D$143:$DB$150,M$13,FALSE), IF(AND(Calc2!$C$17=Trucks!$D$29,Inputs!$F$8=Trucks!$B$151),VLOOKUP(Inputs!$F$62,Trucks!$D$151:$DB$154,M$13,FALSE),IF(AND(Calc2!$C$17=Trucks!$D$34,Inputs!$F$8=Trucks!$B$155),VLOOKUP(Inputs!$F$62,Trucks!$D$155:$DB$159,M$13,FALSE),IF(Calc2!$C$17=Trucks!$D$39,VLOOKUP(Inputs!$F$62,Trucks!$D$160:$DB$162,M$13,FALSE),IF(Calc2!$C$17=Trucks!$D$43,VLOOKUP(Inputs!$F$62,Trucks!$D$163:$DB$165,M$13,FALSE),IF(Calc2!$C$17=Trucks!$D$46,VLOOKUP(Inputs!$F$62,Trucks!$D$166:$DB$167,M$13,FALSE), IF(Calc2!$C$17=Trucks!$D$48,VLOOKUP(Inputs!$F$62,Trucks!$D$168:$DB$169,M$13,FALSE)))))))))","v":0},{"$f":"IF(Calc2!$C$17=Trucks!$D$13,VLOOKUP(Inputs!$F$62,Trucks!$D$141:$DB$169,N$13,FALSE), IF(Calc2!$C$17=Trucks!$D$14,VLOOKUP(Inputs!$F$62,Trucks!$D$143:$DB$150,N$13,FALSE), IF(AND(Calc2!$C$17=Trucks!$D$29,Inputs!$F$8=Trucks!$B$151),VLOOKUP(Inputs!$F$62,Trucks!$D$151:$DB$154,N$13,FALSE),IF(AND(Calc2!$C$17=Trucks!$D$34,Inputs!$F$8=Trucks!$B$155),VLOOKUP(Inputs!$F$62,Trucks!$D$155:$DB$159,N$13,FALSE),IF(Calc2!$C$17=Trucks!$D$39,VLOOKUP(Inputs!$F$62,Trucks!$D$160:$DB$162,N$13,FALSE),IF(Calc2!$C$17=Trucks!$D$43,VLOOKUP(Inputs!$F$62,Trucks!$D$163:$DB$165,N$13,FALSE),IF(Calc2!$C$17=Trucks!$D$46,VLOOKUP(Inputs!$F$62,Trucks!$D$166:$DB$167,N$13,FALSE), IF(Calc2!$C$17=Trucks!$D$48,VLOOKUP(Inputs!$F$62,Trucks!$D$168:$DB$169,N$13,FALSE)))))))))","v":0},{"$f":"IF(Calc2!$C$17=Trucks!$D$13,VLOOKUP(Inputs!$F$62,Trucks!$D$141:$DB$169,O$13,FALSE), IF(Calc2!$C$17=Trucks!$D$14,VLOOKUP(Inputs!$F$62,Trucks!$D$143:$DB$150,O$13,FALSE), IF(AND(Calc2!$C$17=Trucks!$D$29,Inputs!$F$8=Trucks!$B$151),VLOOKUP(Inputs!$F$62,Trucks!$D$151:$DB$154,O$13,FALSE),IF(AND(Calc2!$C$17=Trucks!$D$34,Inputs!$F$8=Trucks!$B$155),VLOOKUP(Inputs!$F$62,Trucks!$D$155:$DB$159,O$13,FALSE),IF(Calc2!$C$17=Trucks!$D$39,VLOOKUP(Inputs!$F$62,Trucks!$D$160:$DB$162,O$13,FALSE),IF(Calc2!$C$17=Trucks!$D$43,VLOOKUP(Inputs!$F$62,Trucks!$D$163:$DB$165,O$13,FALSE),IF(Calc2!$C$17=Trucks!$D$46,VLOOKUP(Inputs!$F$62,Trucks!$D$166:$DB$167,O$13,FALSE), IF(Calc2!$C$17=Trucks!$D$48,VLOOKUP(Inputs!$F$62,Trucks!$D$168:$DB$169,O$13,FALSE)))))))))","v":0},{"$f":"IF(Calc2!$C$17=Trucks!$D$13,VLOOKUP(Inputs!$F$62,Trucks!$D$141:$DB$169,P$13,FALSE), IF(Calc2!$C$17=Trucks!$D$14,VLOOKUP(Inputs!$F$62,Trucks!$D$143:$DB$150,P$13,FALSE), IF(AND(Calc2!$C$17=Trucks!$D$29,Inputs!$F$8=Trucks!$B$151),VLOOKUP(Inputs!$F$62,Trucks!$D$151:$DB$154,P$13,FALSE),IF(AND(Calc2!$C$17=Trucks!$D$34,Inputs!$F$8=Trucks!$B$155),VLOOKUP(Inputs!$F$62,Trucks!$D$155:$DB$159,P$13,FALSE),IF(Calc2!$C$17=Trucks!$D$39,VLOOKUP(Inputs!$F$62,Trucks!$D$160:$DB$162,P$13,FALSE),IF(Calc2!$C$17=Trucks!$D$43,VLOOKUP(Inputs!$F$62,Trucks!$D$163:$DB$165,P$13,FALSE),IF(Calc2!$C$17=Trucks!$D$46,VLOOKUP(Inputs!$F$62,Trucks!$D$166:$DB$167,P$13,FALSE), IF(Calc2!$C$17=Trucks!$D$48,VLOOKUP(Inputs!$F$62,Trucks!$D$168:$DB$169,P$13,FALSE)))))))))","v":0},{"$f":"IF(Calc2!$C$17=Trucks!$D$13,VLOOKUP(Inputs!$F$62,Trucks!$D$141:$DB$169,Q$13,FALSE), IF(Calc2!$C$17=Trucks!$D$14,VLOOKUP(Inputs!$F$62,Trucks!$D$143:$DB$150,Q$13,FALSE), IF(AND(Calc2!$C$17=Trucks!$D$29,Inputs!$F$8=Trucks!$B$151),VLOOKUP(Inputs!$F$62,Trucks!$D$151:$DB$154,Q$13,FALSE),IF(AND(Calc2!$C$17=Trucks!$D$34,Inputs!$F$8=Trucks!$B$155),VLOOKUP(Inputs!$F$62,Trucks!$D$155:$DB$159,Q$13,FALSE),IF(Calc2!$C$17=Trucks!$D$39,VLOOKUP(Inputs!$F$62,Trucks!$D$160:$DB$162,Q$13,FALSE),IF(Calc2!$C$17=Trucks!$D$43,VLOOKUP(Inputs!$F$62,Trucks!$D$163:$DB$165,Q$13,FALSE),IF(Calc2!$C$17=Trucks!$D$46,VLOOKUP(Inputs!$F$62,Trucks!$D$166:$DB$167,Q$13,FALSE), IF(Calc2!$C$17=Trucks!$D$48,VLOOKUP(Inputs!$F$62,Trucks!$D$168:$DB$169,Q$13,FALSE)))))))))","v":0},{"$f":"IF(Calc2!$C$17=Trucks!$D$13,VLOOKUP(Inputs!$F$62,Trucks!$D$141:$DB$169,R$13,FALSE), IF(Calc2!$C$17=Trucks!$D$14,VLOOKUP(Inputs!$F$62,Trucks!$D$143:$DB$150,R$13,FALSE), IF(AND(Calc2!$C$17=Trucks!$D$29,Inputs!$F$8=Trucks!$B$151),VLOOKUP(Inputs!$F$62,Trucks!$D$151:$DB$154,R$13,FALSE),IF(AND(Calc2!$C$17=Trucks!$D$34,Inputs!$F$8=Trucks!$B$155),VLOOKUP(Inputs!$F$62,Trucks!$D$155:$DB$159,R$13,FALSE),IF(Calc2!$C$17=Trucks!$D$39,VLOOKUP(Inputs!$F$62,Trucks!$D$160:$DB$162,R$13,FALSE),IF(Calc2!$C$17=Trucks!$D$43,VLOOKUP(Inputs!$F$62,Trucks!$D$163:$DB$165,R$13,FALSE),IF(Calc2!$C$17=Trucks!$D$46,VLOOKUP(Inputs!$F$62,Trucks!$D$166:$DB$167,R$13,FALSE), IF(Calc2!$C$17=Trucks!$D$48,VLOOKUP(Inputs!$F$62,Trucks!$D$168:$DB$169,R$13,FALSE)))))))))","v":0},{"$f":"IF(Calc2!$C$17=Trucks!$D$13,VLOOKUP(Inputs!$F$62,Trucks!$D$141:$DB$169,S$13,FALSE), IF(Calc2!$C$17=Trucks!$D$14,VLOOKUP(Inputs!$F$62,Trucks!$D$143:$DB$150,S$13,FALSE), IF(AND(Calc2!$C$17=Trucks!$D$29,Inputs!$F$8=Trucks!$B$151),VLOOKUP(Inputs!$F$62,Trucks!$D$151:$DB$154,S$13,FALSE),IF(AND(Calc2!$C$17=Trucks!$D$34,Inputs!$F$8=Trucks!$B$155),VLOOKUP(Inputs!$F$62,Trucks!$D$155:$DB$159,S$13,FALSE),IF(Calc2!$C$17=Trucks!$D$39,VLOOKUP(Inputs!$F$62,Trucks!$D$160:$DB$162,S$13,FALSE),IF(Calc2!$C$17=Trucks!$D$43,VLOOKUP(Inputs!$F$62,Trucks!$D$163:$DB$165,S$13,FALSE),IF(Calc2!$C$17=Trucks!$D$46,VLOOKUP(Inputs!$F$62,Trucks!$D$166:$DB$167,S$13,FALSE), IF(Calc2!$C$17=Trucks!$D$48,VLOOKUP(Inputs!$F$62,Trucks!$D$168:$DB$169,S$13,FALSE)))))))))","v":0},{"$f":"IF(Calc2!$C$17=Trucks!$D$13,VLOOKUP(Inputs!$F$62,Trucks!$D$141:$DB$169,T$13,FALSE), IF(Calc2!$C$17=Trucks!$D$14,VLOOKUP(Inputs!$F$62,Trucks!$D$143:$DB$150,T$13,FALSE), IF(AND(Calc2!$C$17=Trucks!$D$29,Inputs!$F$8=Trucks!$B$151),VLOOKUP(Inputs!$F$62,Trucks!$D$151:$DB$154,T$13,FALSE),IF(AND(Calc2!$C$17=Trucks!$D$34,Inputs!$F$8=Trucks!$B$155),VLOOKUP(Inputs!$F$62,Trucks!$D$155:$DB$159,T$13,FALSE),IF(Calc2!$C$17=Trucks!$D$39,VLOOKUP(Inputs!$F$62,Trucks!$D$160:$DB$162,T$13,FALSE),IF(Calc2!$C$17=Trucks!$D$43,VLOOKUP(Inputs!$F$62,Trucks!$D$163:$DB$165,T$13,FALSE),IF(Calc2!$C$17=Trucks!$D$46,VLOOKUP(Inputs!$F$62,Trucks!$D$166:$DB$167,T$13,FALSE), IF(Calc2!$C$17=Trucks!$D$48,VLOOKUP(Inputs!$F$62,Trucks!$D$168:$DB$169,T$13,FALSE)))))))))","v":0},{"$f":"IF(Calc2!$C$17=Trucks!$D$13,VLOOKUP(Inputs!$F$62,Trucks!$D$141:$DB$169,U$13,FALSE), IF(Calc2!$C$17=Trucks!$D$14,VLOOKUP(Inputs!$F$62,Trucks!$D$143:$DB$150,U$13,FALSE), IF(AND(Calc2!$C$17=Trucks!$D$29,Inputs!$F$8=Trucks!$B$151),VLOOKUP(Inputs!$F$62,Trucks!$D$151:$DB$154,U$13,FALSE),IF(AND(Calc2!$C$17=Trucks!$D$34,Inputs!$F$8=Trucks!$B$155),VLOOKUP(Inputs!$F$62,Trucks!$D$155:$DB$159,U$13,FALSE),IF(Calc2!$C$17=Trucks!$D$39,VLOOKUP(Inputs!$F$62,Trucks!$D$160:$DB$162,U$13,FALSE),IF(Calc2!$C$17=Trucks!$D$43,VLOOKUP(Inputs!$F$62,Trucks!$D$163:$DB$165,U$13,FALSE),IF(Calc2!$C$17=Trucks!$D$46,VLOOKUP(Inputs!$F$62,Trucks!$D$166:$DB$167,U$13,FALSE), IF(Calc2!$C$17=Trucks!$D$48,VLOOKUP(Inputs!$F$62,Trucks!$D$168:$DB$169,U$13,FALSE)))))))))","v":0},{"$f":"IF(Calc2!$C$17=Trucks!$D$13,VLOOKUP(Inputs!$F$62,Trucks!$D$141:$DB$169,V$13,FALSE), IF(Calc2!$C$17=Trucks!$D$14,VLOOKUP(Inputs!$F$62,Trucks!$D$143:$DB$150,V$13,FALSE), IF(AND(Calc2!$C$17=Trucks!$D$29,Inputs!$F$8=Trucks!$B$151),VLOOKUP(Inputs!$F$62,Trucks!$D$151:$DB$154,V$13,FALSE),IF(AND(Calc2!$C$17=Trucks!$D$34,Inputs!$F$8=Trucks!$B$155),VLOOKUP(Inputs!$F$62,Trucks!$D$155:$DB$159,V$13,FALSE),IF(Calc2!$C$17=Trucks!$D$39,VLOOKUP(Inputs!$F$62,Trucks!$D$160:$DB$162,V$13,FALSE),IF(Calc2!$C$17=Trucks!$D$43,VLOOKUP(Inputs!$F$62,Trucks!$D$163:$DB$165,V$13,FALSE),IF(Calc2!$C$17=Trucks!$D$46,VLOOKUP(Inputs!$F$62,Trucks!$D$166:$DB$167,V$13,FALSE), IF(Calc2!$C$17=Trucks!$D$48,VLOOKUP(Inputs!$F$62,Trucks!$D$168:$DB$169,V$13,FALSE)))))))))","v":0},{"$f":"IF(Calc2!$C$17=Trucks!$D$13,VLOOKUP(Inputs!$F$62,Trucks!$D$141:$DB$169,W$13,FALSE), IF(Calc2!$C$17=Trucks!$D$14,VLOOKUP(Inputs!$F$62,Trucks!$D$143:$DB$150,W$13,FALSE), IF(AND(Calc2!$C$17=Trucks!$D$29,Inputs!$F$8=Trucks!$B$151),VLOOKUP(Inputs!$F$62,Trucks!$D$151:$DB$154,W$13,FALSE),IF(AND(Calc2!$C$17=Trucks!$D$34,Inputs!$F$8=Trucks!$B$155),VLOOKUP(Inputs!$F$62,Trucks!$D$155:$DB$159,W$13,FALSE),IF(Calc2!$C$17=Trucks!$D$39,VLOOKUP(Inputs!$F$62,Trucks!$D$160:$DB$162,W$13,FALSE),IF(Calc2!$C$17=Trucks!$D$43,VLOOKUP(Inputs!$F$62,Trucks!$D$163:$DB$165,W$13,FALSE),IF(Calc2!$C$17=Trucks!$D$46,VLOOKUP(Inputs!$F$62,Trucks!$D$166:$DB$167,W$13,FALSE), IF(Calc2!$C$17=Trucks!$D$48,VLOOKUP(Inputs!$F$62,Trucks!$D$168:$DB$169,W$13,FALSE)))))))))","v":0},{"$f":"IF(Calc2!$C$17=Trucks!$D$13,VLOOKUP(Inputs!$F$62,Trucks!$D$141:$DB$169,X$13,FALSE), IF(Calc2!$C$17=Trucks!$D$14,VLOOKUP(Inputs!$F$62,Trucks!$D$143:$DB$150,X$13,FALSE), IF(AND(Calc2!$C$17=Trucks!$D$29,Inputs!$F$8=Trucks!$B$151),VLOOKUP(Inputs!$F$62,Trucks!$D$151:$DB$154,X$13,FALSE),IF(AND(Calc2!$C$17=Trucks!$D$34,Inputs!$F$8=Trucks!$B$155),VLOOKUP(Inputs!$F$62,Trucks!$D$155:$DB$159,X$13,FALSE),IF(Calc2!$C$17=Trucks!$D$39,VLOOKUP(Inputs!$F$62,Trucks!$D$160:$DB$162,X$13,FALSE),IF(Calc2!$C$17=Trucks!$D$43,VLOOKUP(Inputs!$F$62,Trucks!$D$163:$DB$165,X$13,FALSE),IF(Calc2!$C$17=Trucks!$D$46,VLOOKUP(Inputs!$F$62,Trucks!$D$166:$DB$167,X$13,FALSE), IF(Calc2!$C$17=Trucks!$D$48,VLOOKUP(Inputs!$F$62,Trucks!$D$168:$DB$169,X$13,FALSE)))))))))","v":0},{"$f":"IF(Calc2!$C$17=Trucks!$D$13,VLOOKUP(Inputs!$F$62,Trucks!$D$141:$DB$169,Y$13,FALSE), IF(Calc2!$C$17=Trucks!$D$14,VLOOKUP(Inputs!$F$62,Trucks!$D$143:$DB$150,Y$13,FALSE), IF(AND(Calc2!$C$17=Trucks!$D$29,Inputs!$F$8=Trucks!$B$151),VLOOKUP(Inputs!$F$62,Trucks!$D$151:$DB$154,Y$13,FALSE),IF(AND(Calc2!$C$17=Trucks!$D$34,Inputs!$F$8=Trucks!$B$155),VLOOKUP(Inputs!$F$62,Trucks!$D$155:$DB$159,Y$13,FALSE),IF(Calc2!$C$17=Trucks!$D$39,VLOOKUP(Inputs!$F$62,Trucks!$D$160:$DB$162,Y$13,FALSE),IF(Calc2!$C$17=Trucks!$D$43,VLOOKUP(Inputs!$F$62,Trucks!$D$163:$DB$165,Y$13,FALSE),IF(Calc2!$C$17=Trucks!$D$46,VLOOKUP(Inputs!$F$62,Trucks!$D$166:$DB$167,Y$13,FALSE), IF(Calc2!$C$17=Trucks!$D$48,VLOOKUP(Inputs!$F$62,Trucks!$D$168:$DB$169,Y$13,FALSE)))))))))","v":0},{"$f":"IF(Calc2!$C$17=Trucks!$D$13,VLOOKUP(Inputs!$F$62,Trucks!$D$141:$DB$169,Z$13,FALSE), IF(Calc2!$C$17=Trucks!$D$14,VLOOKUP(Inputs!$F$62,Trucks!$D$143:$DB$150,Z$13,FALSE), IF(AND(Calc2!$C$17=Trucks!$D$29,Inputs!$F$8=Trucks!$B$151),VLOOKUP(Inputs!$F$62,Trucks!$D$151:$DB$154,Z$13,FALSE),IF(AND(Calc2!$C$17=Trucks!$D$34,Inputs!$F$8=Trucks!$B$155),VLOOKUP(Inputs!$F$62,Trucks!$D$155:$DB$159,Z$13,FALSE),IF(Calc2!$C$17=Trucks!$D$39,VLOOKUP(Inputs!$F$62,Trucks!$D$160:$DB$162,Z$13,FALSE),IF(Calc2!$C$17=Trucks!$D$43,VLOOKUP(Inputs!$F$62,Trucks!$D$163:$DB$165,Z$13,FALSE),IF(Calc2!$C$17=Trucks!$D$46,VLOOKUP(Inputs!$F$62,Trucks!$D$166:$DB$167,Z$13,FALSE), IF(Calc2!$C$17=Trucks!$D$48,VLOOKUP(Inputs!$F$62,Trucks!$D$168:$DB$169,Z$13,FALSE)))))))))","v":0},{"$f":"IF(Calc2!$C$17=Trucks!$D$13,VLOOKUP(Inputs!$F$62,Trucks!$D$141:$DB$169,AA$13,FALSE), IF(Calc2!$C$17=Trucks!$D$14,VLOOKUP(Inputs!$F$62,Trucks!$D$143:$DB$150,AA$13,FALSE), IF(AND(Calc2!$C$17=Trucks!$D$29,Inputs!$F$8=Trucks!$B$151),VLOOKUP(Inputs!$F$62,Trucks!$D$151:$DB$154,AA$13,FALSE),IF(AND(Calc2!$C$17=Trucks!$D$34,Inputs!$F$8=Trucks!$B$155),VLOOKUP(Inputs!$F$62,Trucks!$D$155:$DB$159,AA$13,FALSE),IF(Calc2!$C$17=Trucks!$D$39,VLOOKUP(Inputs!$F$62,Trucks!$D$160:$DB$162,AA$13,FALSE),IF(Calc2!$C$17=Trucks!$D$43,VLOOKUP(Inputs!$F$62,Trucks!$D$163:$DB$165,AA$13,FALSE),IF(Calc2!$C$17=Trucks!$D$46,VLOOKUP(Inputs!$F$62,Trucks!$D$166:$DB$167,AA$13,FALSE), IF(Calc2!$C$17=Trucks!$D$48,VLOOKUP(Inputs!$F$62,Trucks!$D$168:$DB$169,AA$13,FALSE)))))))))","v":0},{"$f":"IF(Calc2!$C$17=Trucks!$D$13,VLOOKUP(Inputs!$F$62,Trucks!$D$141:$DB$169,AB$13,FALSE), IF(Calc2!$C$17=Trucks!$D$14,VLOOKUP(Inputs!$F$62,Trucks!$D$143:$DB$150,AB$13,FALSE), IF(AND(Calc2!$C$17=Trucks!$D$29,Inputs!$F$8=Trucks!$B$151),VLOOKUP(Inputs!$F$62,Trucks!$D$151:$DB$154,AB$13,FALSE),IF(AND(Calc2!$C$17=Trucks!$D$34,Inputs!$F$8=Trucks!$B$155),VLOOKUP(Inputs!$F$62,Trucks!$D$155:$DB$159,AB$13,FALSE),IF(Calc2!$C$17=Trucks!$D$39,VLOOKUP(Inputs!$F$62,Trucks!$D$160:$DB$162,AB$13,FALSE),IF(Calc2!$C$17=Trucks!$D$43,VLOOKUP(Inputs!$F$62,Trucks!$D$163:$DB$165,AB$13,FALSE),IF(Calc2!$C$17=Trucks!$D$46,VLOOKUP(Inputs!$F$62,Trucks!$D$166:$DB$167,AB$13,FALSE), IF(Calc2!$C$17=Trucks!$D$48,VLOOKUP(Inputs!$F$62,Trucks!$D$168:$DB$169,AB$13,FALSE)))))))))","v":0},{"$f":"IF(Calc2!$C$17=Trucks!$D$13,VLOOKUP(Inputs!$F$62,Trucks!$D$141:$DB$169,AC$13,FALSE), IF(Calc2!$C$17=Trucks!$D$14,VLOOKUP(Inputs!$F$62,Trucks!$D$143:$DB$150,AC$13,FALSE), IF(AND(Calc2!$C$17=Trucks!$D$29,Inputs!$F$8=Trucks!$B$151),VLOOKUP(Inputs!$F$62,Trucks!$D$151:$DB$154,AC$13,FALSE),IF(AND(Calc2!$C$17=Trucks!$D$34,Inputs!$F$8=Trucks!$B$155),VLOOKUP(Inputs!$F$62,Trucks!$D$155:$DB$159,AC$13,FALSE),IF(Calc2!$C$17=Trucks!$D$39,VLOOKUP(Inputs!$F$62,Trucks!$D$160:$DB$162,AC$13,FALSE),IF(Calc2!$C$17=Trucks!$D$43,VLOOKUP(Inputs!$F$62,Trucks!$D$163:$DB$165,AC$13,FALSE),IF(Calc2!$C$17=Trucks!$D$46,VLOOKUP(Inputs!$F$62,Trucks!$D$166:$DB$167,AC$13,FALSE), IF(Calc2!$C$17=Trucks!$D$48,VLOOKUP(Inputs!$F$62,Trucks!$D$168:$DB$169,AC$13,FALSE)))))))))","v":0},{"$f":"IF(Calc2!$C$17=Trucks!$D$13,VLOOKUP(Inputs!$F$62,Trucks!$D$141:$DB$169,AD$13,FALSE), IF(Calc2!$C$17=Trucks!$D$14,VLOOKUP(Inputs!$F$62,Trucks!$D$143:$DB$150,AD$13,FALSE), IF(AND(Calc2!$C$17=Trucks!$D$29,Inputs!$F$8=Trucks!$B$151),VLOOKUP(Inputs!$F$62,Trucks!$D$151:$DB$154,AD$13,FALSE),IF(AND(Calc2!$C$17=Trucks!$D$34,Inputs!$F$8=Trucks!$B$155),VLOOKUP(Inputs!$F$62,Trucks!$D$155:$DB$159,AD$13,FALSE),IF(Calc2!$C$17=Trucks!$D$39,VLOOKUP(Inputs!$F$62,Trucks!$D$160:$DB$162,AD$13,FALSE),IF(Calc2!$C$17=Trucks!$D$43,VLOOKUP(Inputs!$F$62,Trucks!$D$163:$DB$165,AD$13,FALSE),IF(Calc2!$C$17=Trucks!$D$46,VLOOKUP(Inputs!$F$62,Trucks!$D$166:$DB$167,AD$13,FALSE), IF(Calc2!$C$17=Trucks!$D$48,VLOOKUP(Inputs!$F$62,Trucks!$D$168:$DB$169,AD$13,FALSE)))))))))","v":0},{"$f":"IF(Calc2!$C$17=Trucks!$D$13,VLOOKUP(Inputs!$F$62,Trucks!$D$141:$DB$169,AE$13,FALSE), IF(Calc2!$C$17=Trucks!$D$14,VLOOKUP(Inputs!$F$62,Trucks!$D$143:$DB$150,AE$13,FALSE), IF(AND(Calc2!$C$17=Trucks!$D$29,Inputs!$F$8=Trucks!$B$151),VLOOKUP(Inputs!$F$62,Trucks!$D$151:$DB$154,AE$13,FALSE),IF(AND(Calc2!$C$17=Trucks!$D$34,Inputs!$F$8=Trucks!$B$155),VLOOKUP(Inputs!$F$62,Trucks!$D$155:$DB$159,AE$13,FALSE),IF(Calc2!$C$17=Trucks!$D$39,VLOOKUP(Inputs!$F$62,Trucks!$D$160:$DB$162,AE$13,FALSE),IF(Calc2!$C$17=Trucks!$D$43,VLOOKUP(Inputs!$F$62,Trucks!$D$163:$DB$165,AE$13,FALSE),IF(Calc2!$C$17=Trucks!$D$46,VLOOKUP(Inputs!$F$62,Trucks!$D$166:$DB$167,AE$13,FALSE), IF(Calc2!$C$17=Trucks!$D$48,VLOOKUP(Inputs!$F$62,Trucks!$D$168:$DB$169,AE$13,FALSE)))))))))","v":0},{"$f":"IF(Calc2!$C$17=Trucks!$D$13,VLOOKUP(Inputs!$F$62,Trucks!$D$141:$DB$169,AF$13,FALSE), IF(Calc2!$C$17=Trucks!$D$14,VLOOKUP(Inputs!$F$62,Trucks!$D$143:$DB$150,AF$13,FALSE), IF(AND(Calc2!$C$17=Trucks!$D$29,Inputs!$F$8=Trucks!$B$151),VLOOKUP(Inputs!$F$62,Trucks!$D$151:$DB$154,AF$13,FALSE),IF(AND(Calc2!$C$17=Trucks!$D$34,Inputs!$F$8=Trucks!$B$155),VLOOKUP(Inputs!$F$62,Trucks!$D$155:$DB$159,AF$13,FALSE),IF(Calc2!$C$17=Trucks!$D$39,VLOOKUP(Inputs!$F$62,Trucks!$D$160:$DB$162,AF$13,FALSE),IF(Calc2!$C$17=Trucks!$D$43,VLOOKUP(Inputs!$F$62,Trucks!$D$163:$DB$165,AF$13,FALSE),IF(Calc2!$C$17=Trucks!$D$46,VLOOKUP(Inputs!$F$62,Trucks!$D$166:$DB$167,AF$13,FALSE), IF(Calc2!$C$17=Trucks!$D$48,VLOOKUP(Inputs!$F$62,Trucks!$D$168:$DB$169,AF$13,FALSE)))))))))","v":0},{"$f":"IF(Calc2!$C$17=Trucks!$D$13,VLOOKUP(Inputs!$F$62,Trucks!$D$141:$DB$169,AG$13,FALSE), IF(Calc2!$C$17=Trucks!$D$14,VLOOKUP(Inputs!$F$62,Trucks!$D$143:$DB$150,AG$13,FALSE), IF(AND(Calc2!$C$17=Trucks!$D$29,Inputs!$F$8=Trucks!$B$151),VLOOKUP(Inputs!$F$62,Trucks!$D$151:$DB$154,AG$13,FALSE),IF(AND(Calc2!$C$17=Trucks!$D$34,Inputs!$F$8=Trucks!$B$155),VLOOKUP(Inputs!$F$62,Trucks!$D$155:$DB$159,AG$13,FALSE),IF(Calc2!$C$17=Trucks!$D$39,VLOOKUP(Inputs!$F$62,Trucks!$D$160:$DB$162,AG$13,FALSE),IF(Calc2!$C$17=Trucks!$D$43,VLOOKUP(Inputs!$F$62,Trucks!$D$163:$DB$165,AG$13,FALSE),IF(Calc2!$C$17=Trucks!$D$46,VLOOKUP(Inputs!$F$62,Trucks!$D$166:$DB$167,AG$13,FALSE), IF(Calc2!$C$17=Trucks!$D$48,VLOOKUP(Inputs!$F$62,Trucks!$D$168:$DB$169,AG$13,FALSE)))))))))","v":0},{"$f":"IF(Calc2!$C$17=Trucks!$D$13,VLOOKUP(Inputs!$F$62,Trucks!$D$141:$DB$169,AH$13,FALSE), IF(Calc2!$C$17=Trucks!$D$14,VLOOKUP(Inputs!$F$62,Trucks!$D$143:$DB$150,AH$13,FALSE), IF(AND(Calc2!$C$17=Trucks!$D$29,Inputs!$F$8=Trucks!$B$151),VLOOKUP(Inputs!$F$62,Trucks!$D$151:$DB$154,AH$13,FALSE),IF(AND(Calc2!$C$17=Trucks!$D$34,Inputs!$F$8=Trucks!$B$155),VLOOKUP(Inputs!$F$62,Trucks!$D$155:$DB$159,AH$13,FALSE),IF(Calc2!$C$17=Trucks!$D$39,VLOOKUP(Inputs!$F$62,Trucks!$D$160:$DB$162,AH$13,FALSE),IF(Calc2!$C$17=Trucks!$D$43,VLOOKUP(Inputs!$F$62,Trucks!$D$163:$DB$165,AH$13,FALSE),IF(Calc2!$C$17=Trucks!$D$46,VLOOKUP(Inputs!$F$62,Trucks!$D$166:$DB$167,AH$13,FALSE), IF(Calc2!$C$17=Trucks!$D$48,VLOOKUP(Inputs!$F$62,Trucks!$D$168:$DB$169,AH$13,FALSE)))))))))","v":0},{"$f":"IF(Calc2!$C$17=Trucks!$D$13,VLOOKUP(Inputs!$F$62,Trucks!$D$141:$DB$169,AI$13,FALSE), IF(Calc2!$C$17=Trucks!$D$14,VLOOKUP(Inputs!$F$62,Trucks!$D$143:$DB$150,AI$13,FALSE), IF(AND(Calc2!$C$17=Trucks!$D$29,Inputs!$F$8=Trucks!$B$151),VLOOKUP(Inputs!$F$62,Trucks!$D$151:$DB$154,AI$13,FALSE),IF(AND(Calc2!$C$17=Trucks!$D$34,Inputs!$F$8=Trucks!$B$155),VLOOKUP(Inputs!$F$62,Trucks!$D$155:$DB$159,AI$13,FALSE),IF(Calc2!$C$17=Trucks!$D$39,VLOOKUP(Inputs!$F$62,Trucks!$D$160:$DB$162,AI$13,FALSE),IF(Calc2!$C$17=Trucks!$D$43,VLOOKUP(Inputs!$F$62,Trucks!$D$163:$DB$165,AI$13,FALSE),IF(Calc2!$C$17=Trucks!$D$46,VLOOKUP(Inputs!$F$62,Trucks!$D$166:$DB$167,AI$13,FALSE), IF(Calc2!$C$17=Trucks!$D$48,VLOOKUP(Inputs!$F$62,Trucks!$D$168:$DB$169,AI$13,FALSE)))))))))","v":0},{"$f":"IF(Calc2!$C$17=Trucks!$D$13,VLOOKUP(Inputs!$F$62,Trucks!$D$141:$DB$169,AJ$13,FALSE), IF(Calc2!$C$17=Trucks!$D$14,VLOOKUP(Inputs!$F$62,Trucks!$D$143:$DB$150,AJ$13,FALSE), IF(AND(Calc2!$C$17=Trucks!$D$29,Inputs!$F$8=Trucks!$B$151),VLOOKUP(Inputs!$F$62,Trucks!$D$151:$DB$154,AJ$13,FALSE),IF(AND(Calc2!$C$17=Trucks!$D$34,Inputs!$F$8=Trucks!$B$155),VLOOKUP(Inputs!$F$62,Trucks!$D$155:$DB$159,AJ$13,FALSE),IF(Calc2!$C$17=Trucks!$D$39,VLOOKUP(Inputs!$F$62,Trucks!$D$160:$DB$162,AJ$13,FALSE),IF(Calc2!$C$17=Trucks!$D$43,VLOOKUP(Inputs!$F$62,Trucks!$D$163:$DB$165,AJ$13,FALSE),IF(Calc2!$C$17=Trucks!$D$46,VLOOKUP(Inputs!$F$62,Trucks!$D$166:$DB$167,AJ$13,FALSE), IF(Calc2!$C$17=Trucks!$D$48,VLOOKUP(Inputs!$F$62,Trucks!$D$168:$DB$169,AJ$13,FALSE)))))))))","v":0},{"$f":"IF(Calc2!$C$17=Trucks!$D$13,VLOOKUP(Inputs!$F$62,Trucks!$D$141:$DB$169,AK$13,FALSE), IF(Calc2!$C$17=Trucks!$D$14,VLOOKUP(Inputs!$F$62,Trucks!$D$143:$DB$150,AK$13,FALSE), IF(AND(Calc2!$C$17=Trucks!$D$29,Inputs!$F$8=Trucks!$B$151),VLOOKUP(Inputs!$F$62,Trucks!$D$151:$DB$154,AK$13,FALSE),IF(AND(Calc2!$C$17=Trucks!$D$34,Inputs!$F$8=Trucks!$B$155),VLOOKUP(Inputs!$F$62,Trucks!$D$155:$DB$159,AK$13,FALSE),IF(Calc2!$C$17=Trucks!$D$39,VLOOKUP(Inputs!$F$62,Trucks!$D$160:$DB$162,AK$13,FALSE),IF(Calc2!$C$17=Trucks!$D$43,VLOOKUP(Inputs!$F$62,Trucks!$D$163:$DB$165,AK$13,FALSE),IF(Calc2!$C$17=Trucks!$D$46,VLOOKUP(Inputs!$F$62,Trucks!$D$166:$DB$167,AK$13,FALSE), IF(Calc2!$C$17=Trucks!$D$48,VLOOKUP(Inputs!$F$62,Trucks!$D$168:$DB$169,AK$13,FALSE)))))))))","v":0},{"$f":"IF(Calc2!$C$17=Trucks!$D$13,VLOOKUP(Inputs!$F$62,Trucks!$D$141:$DB$169,AL$13,FALSE), IF(Calc2!$C$17=Trucks!$D$14,VLOOKUP(Inputs!$F$62,Trucks!$D$143:$DB$150,AL$13,FALSE), IF(AND(Calc2!$C$17=Trucks!$D$29,Inputs!$F$8=Trucks!$B$151),VLOOKUP(Inputs!$F$62,Trucks!$D$151:$DB$154,AL$13,FALSE),IF(AND(Calc2!$C$17=Trucks!$D$34,Inputs!$F$8=Trucks!$B$155),VLOOKUP(Inputs!$F$62,Trucks!$D$155:$DB$159,AL$13,FALSE),IF(Calc2!$C$17=Trucks!$D$39,VLOOKUP(Inputs!$F$62,Trucks!$D$160:$DB$162,AL$13,FALSE),IF(Calc2!$C$17=Trucks!$D$43,VLOOKUP(Inputs!$F$62,Trucks!$D$163:$DB$165,AL$13,FALSE),IF(Calc2!$C$17=Trucks!$D$46,VLOOKUP(Inputs!$F$62,Trucks!$D$166:$DB$167,AL$13,FALSE), IF(Calc2!$C$17=Trucks!$D$48,VLOOKUP(Inputs!$F$62,Trucks!$D$168:$DB$169,AL$13,FALSE)))))))))","v":0},{"$f":"IF(Calc2!$C$17=Trucks!$D$13,VLOOKUP(Inputs!$F$62,Trucks!$D$141:$DB$169,AM$13,FALSE), IF(Calc2!$C$17=Trucks!$D$14,VLOOKUP(Inputs!$F$62,Trucks!$D$143:$DB$150,AM$13,FALSE), IF(AND(Calc2!$C$17=Trucks!$D$29,Inputs!$F$8=Trucks!$B$151),VLOOKUP(Inputs!$F$62,Trucks!$D$151:$DB$154,AM$13,FALSE),IF(AND(Calc2!$C$17=Trucks!$D$34,Inputs!$F$8=Trucks!$B$155),VLOOKUP(Inputs!$F$62,Trucks!$D$155:$DB$159,AM$13,FALSE),IF(Calc2!$C$17=Trucks!$D$39,VLOOKUP(Inputs!$F$62,Trucks!$D$160:$DB$162,AM$13,FALSE),IF(Calc2!$C$17=Trucks!$D$43,VLOOKUP(Inputs!$F$62,Trucks!$D$163:$DB$165,AM$13,FALSE),IF(Calc2!$C$17=Trucks!$D$46,VLOOKUP(Inputs!$F$62,Trucks!$D$166:$DB$167,AM$13,FALSE), IF(Calc2!$C$17=Trucks!$D$48,VLOOKUP(Inputs!$F$62,Trucks!$D$168:$DB$169,AM$13,FALSE)))))))))","v":0},{"$f":"IF(Calc2!$C$17=Trucks!$D$13,VLOOKUP(Inputs!$F$62,Trucks!$D$141:$DB$169,AN$13,FALSE), IF(Calc2!$C$17=Trucks!$D$14,VLOOKUP(Inputs!$F$62,Trucks!$D$143:$DB$150,AN$13,FALSE), IF(AND(Calc2!$C$17=Trucks!$D$29,Inputs!$F$8=Trucks!$B$151),VLOOKUP(Inputs!$F$62,Trucks!$D$151:$DB$154,AN$13,FALSE),IF(AND(Calc2!$C$17=Trucks!$D$34,Inputs!$F$8=Trucks!$B$155),VLOOKUP(Inputs!$F$62,Trucks!$D$155:$DB$159,AN$13,FALSE),IF(Calc2!$C$17=Trucks!$D$39,VLOOKUP(Inputs!$F$62,Trucks!$D$160:$DB$162,AN$13,FALSE),IF(Calc2!$C$17=Trucks!$D$43,VLOOKUP(Inputs!$F$62,Trucks!$D$163:$DB$165,AN$13,FALSE),IF(Calc2!$C$17=Trucks!$D$46,VLOOKUP(Inputs!$F$62,Trucks!$D$166:$DB$167,AN$13,FALSE), IF(Calc2!$C$17=Trucks!$D$48,VLOOKUP(Inputs!$F$62,Trucks!$D$168:$DB$169,AN$13,FALSE)))))))))","v":0},{"$f":"IF(Calc2!$C$17=Trucks!$D$13,VLOOKUP(Inputs!$F$62,Trucks!$D$141:$DB$169,AO$13,FALSE), IF(Calc2!$C$17=Trucks!$D$14,VLOOKUP(Inputs!$F$62,Trucks!$D$143:$DB$150,AO$13,FALSE), IF(AND(Calc2!$C$17=Trucks!$D$29,Inputs!$F$8=Trucks!$B$151),VLOOKUP(Inputs!$F$62,Trucks!$D$151:$DB$154,AO$13,FALSE),IF(AND(Calc2!$C$17=Trucks!$D$34,Inputs!$F$8=Trucks!$B$155),VLOOKUP(Inputs!$F$62,Trucks!$D$155:$DB$159,AO$13,FALSE),IF(Calc2!$C$17=Trucks!$D$39,VLOOKUP(Inputs!$F$62,Trucks!$D$160:$DB$162,AO$13,FALSE),IF(Calc2!$C$17=Trucks!$D$43,VLOOKUP(Inputs!$F$62,Trucks!$D$163:$DB$165,AO$13,FALSE),IF(Calc2!$C$17=Trucks!$D$46,VLOOKUP(Inputs!$F$62,Trucks!$D$166:$DB$167,AO$13,FALSE), IF(Calc2!$C$17=Trucks!$D$48,VLOOKUP(Inputs!$F$62,Trucks!$D$168:$DB$169,AO$13,FALSE)))))))))","v":0},{"$f":"IF(Calc2!$C$17=Trucks!$D$13,VLOOKUP(Inputs!$F$62,Trucks!$D$141:$DB$169,AP$13,FALSE), IF(Calc2!$C$17=Trucks!$D$14,VLOOKUP(Inputs!$F$62,Trucks!$D$143:$DB$150,AP$13,FALSE), IF(AND(Calc2!$C$17=Trucks!$D$29,Inputs!$F$8=Trucks!$B$151),VLOOKUP(Inputs!$F$62,Trucks!$D$151:$DB$154,AP$13,FALSE),IF(AND(Calc2!$C$17=Trucks!$D$34,Inputs!$F$8=Trucks!$B$155),VLOOKUP(Inputs!$F$62,Trucks!$D$155:$DB$159,AP$13,FALSE),IF(Calc2!$C$17=Trucks!$D$39,VLOOKUP(Inputs!$F$62,Trucks!$D$160:$DB$162,AP$13,FALSE),IF(Calc2!$C$17=Trucks!$D$43,VLOOKUP(Inputs!$F$62,Trucks!$D$163:$DB$165,AP$13,FALSE),IF(Calc2!$C$17=Trucks!$D$46,VLOOKUP(Inputs!$F$62,Trucks!$D$166:$DB$167,AP$13,FALSE), IF(Calc2!$C$17=Trucks!$D$48,VLOOKUP(Inputs!$F$62,Trucks!$D$168:$DB$169,AP$13,FALSE)))))))))","v":0},{"$f":"IF(Calc2!$C$17=Trucks!$D$13,VLOOKUP(Inputs!$F$62,Trucks!$D$141:$DB$169,AQ$13,FALSE), IF(Calc2!$C$17=Trucks!$D$14,VLOOKUP(Inputs!$F$62,Trucks!$D$143:$DB$150,AQ$13,FALSE), IF(AND(Calc2!$C$17=Trucks!$D$29,Inputs!$F$8=Trucks!$B$151),VLOOKUP(Inputs!$F$62,Trucks!$D$151:$DB$154,AQ$13,FALSE),IF(AND(Calc2!$C$17=Trucks!$D$34,Inputs!$F$8=Trucks!$B$155),VLOOKUP(Inputs!$F$62,Trucks!$D$155:$DB$159,AQ$13,FALSE),IF(Calc2!$C$17=Trucks!$D$39,VLOOKUP(Inputs!$F$62,Trucks!$D$160:$DB$162,AQ$13,FALSE),IF(Calc2!$C$17=Trucks!$D$43,VLOOKUP(Inputs!$F$62,Trucks!$D$163:$DB$165,AQ$13,FALSE),IF(Calc2!$C$17=Trucks!$D$46,VLOOKUP(Inputs!$F$62,Trucks!$D$166:$DB$167,AQ$13,FALSE), IF(Calc2!$C$17=Trucks!$D$48,VLOOKUP(Inputs!$F$62,Trucks!$D$168:$DB$169,AQ$13,FALSE)))))))))","v":0},{"$f":"IF(Calc2!$C$17=Trucks!$D$13,VLOOKUP(Inputs!$F$62,Trucks!$D$141:$DB$169,AR$13,FALSE), IF(Calc2!$C$17=Trucks!$D$14,VLOOKUP(Inputs!$F$62,Trucks!$D$143:$DB$150,AR$13,FALSE), IF(AND(Calc2!$C$17=Trucks!$D$29,Inputs!$F$8=Trucks!$B$151),VLOOKUP(Inputs!$F$62,Trucks!$D$151:$DB$154,AR$13,FALSE),IF(AND(Calc2!$C$17=Trucks!$D$34,Inputs!$F$8=Trucks!$B$155),VLOOKUP(Inputs!$F$62,Trucks!$D$155:$DB$159,AR$13,FALSE),IF(Calc2!$C$17=Trucks!$D$39,VLOOKUP(Inputs!$F$62,Trucks!$D$160:$DB$162,AR$13,FALSE),IF(Calc2!$C$17=Trucks!$D$43,VLOOKUP(Inputs!$F$62,Trucks!$D$163:$DB$165,AR$13,FALSE),IF(Calc2!$C$17=Trucks!$D$46,VLOOKUP(Inputs!$F$62,Trucks!$D$166:$DB$167,AR$13,FALSE), IF(Calc2!$C$17=Trucks!$D$48,VLOOKUP(Inputs!$F$62,Trucks!$D$168:$DB$169,AR$13,FALSE)))))))))","v":0},{"$f":"IF(Calc2!$C$17=Trucks!$D$13,VLOOKUP(Inputs!$F$62,Trucks!$D$141:$DB$169,AS$13,FALSE), IF(Calc2!$C$17=Trucks!$D$14,VLOOKUP(Inputs!$F$62,Trucks!$D$143:$DB$150,AS$13,FALSE), IF(AND(Calc2!$C$17=Trucks!$D$29,Inputs!$F$8=Trucks!$B$151),VLOOKUP(Inputs!$F$62,Trucks!$D$151:$DB$154,AS$13,FALSE),IF(AND(Calc2!$C$17=Trucks!$D$34,Inputs!$F$8=Trucks!$B$155),VLOOKUP(Inputs!$F$62,Trucks!$D$155:$DB$159,AS$13,FALSE),IF(Calc2!$C$17=Trucks!$D$39,VLOOKUP(Inputs!$F$62,Trucks!$D$160:$DB$162,AS$13,FALSE),IF(Calc2!$C$17=Trucks!$D$43,VLOOKUP(Inputs!$F$62,Trucks!$D$163:$DB$165,AS$13,FALSE),IF(Calc2!$C$17=Trucks!$D$46,VLOOKUP(Inputs!$F$62,Trucks!$D$166:$DB$167,AS$13,FALSE), IF(Calc2!$C$17=Trucks!$D$48,VLOOKUP(Inputs!$F$62,Trucks!$D$168:$DB$169,AS$13,FALSE)))))))))","v":0},{"$f":"IF(Calc2!$C$17=Trucks!$D$13,VLOOKUP(Inputs!$F$62,Trucks!$D$141:$DB$169,AT$13,FALSE), IF(Calc2!$C$17=Trucks!$D$14,VLOOKUP(Inputs!$F$62,Trucks!$D$143:$DB$150,AT$13,FALSE), IF(AND(Calc2!$C$17=Trucks!$D$29,Inputs!$F$8=Trucks!$B$151),VLOOKUP(Inputs!$F$62,Trucks!$D$151:$DB$154,AT$13,FALSE),IF(AND(Calc2!$C$17=Trucks!$D$34,Inputs!$F$8=Trucks!$B$155),VLOOKUP(Inputs!$F$62,Trucks!$D$155:$DB$159,AT$13,FALSE),IF(Calc2!$C$17=Trucks!$D$39,VLOOKUP(Inputs!$F$62,Trucks!$D$160:$DB$162,AT$13,FALSE),IF(Calc2!$C$17=Trucks!$D$43,VLOOKUP(Inputs!$F$62,Trucks!$D$163:$DB$165,AT$13,FALSE),IF(Calc2!$C$17=Trucks!$D$46,VLOOKUP(Inputs!$F$62,Trucks!$D$166:$DB$167,AT$13,FALSE), IF(Calc2!$C$17=Trucks!$D$48,VLOOKUP(Inputs!$F$62,Trucks!$D$168:$DB$169,AT$13,FALSE)))))))))","v":0},{"$f":"IF(Calc2!$C$17=Trucks!$D$13,VLOOKUP(Inputs!$F$62,Trucks!$D$141:$DB$169,AU$13,FALSE), IF(Calc2!$C$17=Trucks!$D$14,VLOOKUP(Inputs!$F$62,Trucks!$D$143:$DB$150,AU$13,FALSE), IF(AND(Calc2!$C$17=Trucks!$D$29,Inputs!$F$8=Trucks!$B$151),VLOOKUP(Inputs!$F$62,Trucks!$D$151:$DB$154,AU$13,FALSE),IF(AND(Calc2!$C$17=Trucks!$D$34,Inputs!$F$8=Trucks!$B$155),VLOOKUP(Inputs!$F$62,Trucks!$D$155:$DB$159,AU$13,FALSE),IF(Calc2!$C$17=Trucks!$D$39,VLOOKUP(Inputs!$F$62,Trucks!$D$160:$DB$162,AU$13,FALSE),IF(Calc2!$C$17=Trucks!$D$43,VLOOKUP(Inputs!$F$62,Trucks!$D$163:$DB$165,AU$13,FALSE),IF(Calc2!$C$17=Trucks!$D$46,VLOOKUP(Inputs!$F$62,Trucks!$D$166:$DB$167,AU$13,FALSE), IF(Calc2!$C$17=Trucks!$D$48,VLOOKUP(Inputs!$F$62,Trucks!$D$168:$DB$169,AU$13,FALSE)))))))))","v":0},{"$f":"IF(Calc2!$C$17=Trucks!$D$13,VLOOKUP(Inputs!$F$62,Trucks!$D$141:$DB$169,AV$13,FALSE), IF(Calc2!$C$17=Trucks!$D$14,VLOOKUP(Inputs!$F$62,Trucks!$D$143:$DB$150,AV$13,FALSE), IF(AND(Calc2!$C$17=Trucks!$D$29,Inputs!$F$8=Trucks!$B$151),VLOOKUP(Inputs!$F$62,Trucks!$D$151:$DB$154,AV$13,FALSE),IF(AND(Calc2!$C$17=Trucks!$D$34,Inputs!$F$8=Trucks!$B$155),VLOOKUP(Inputs!$F$62,Trucks!$D$155:$DB$159,AV$13,FALSE),IF(Calc2!$C$17=Trucks!$D$39,VLOOKUP(Inputs!$F$62,Trucks!$D$160:$DB$162,AV$13,FALSE),IF(Calc2!$C$17=Trucks!$D$43,VLOOKUP(Inputs!$F$62,Trucks!$D$163:$DB$165,AV$13,FALSE),IF(Calc2!$C$17=Trucks!$D$46,VLOOKUP(Inputs!$F$62,Trucks!$D$166:$DB$167,AV$13,FALSE), IF(Calc2!$C$17=Trucks!$D$48,VLOOKUP(Inputs!$F$62,Trucks!$D$168:$DB$169,AV$13,FALSE)))))))))","v":0},{"$f":"IF(Calc2!$C$17=Trucks!$D$13,VLOOKUP(Inputs!$F$62,Trucks!$D$141:$DB$169,AW$13,FALSE), IF(Calc2!$C$17=Trucks!$D$14,VLOOKUP(Inputs!$F$62,Trucks!$D$143:$DB$150,AW$13,FALSE), IF(AND(Calc2!$C$17=Trucks!$D$29,Inputs!$F$8=Trucks!$B$151),VLOOKUP(Inputs!$F$62,Trucks!$D$151:$DB$154,AW$13,FALSE),IF(AND(Calc2!$C$17=Trucks!$D$34,Inputs!$F$8=Trucks!$B$155),VLOOKUP(Inputs!$F$62,Trucks!$D$155:$DB$159,AW$13,FALSE),IF(Calc2!$C$17=Trucks!$D$39,VLOOKUP(Inputs!$F$62,Trucks!$D$160:$DB$162,AW$13,FALSE),IF(Calc2!$C$17=Trucks!$D$43,VLOOKUP(Inputs!$F$62,Trucks!$D$163:$DB$165,AW$13,FALSE),IF(Calc2!$C$17=Trucks!$D$46,VLOOKUP(Inputs!$F$62,Trucks!$D$166:$DB$167,AW$13,FALSE), IF(Calc2!$C$17=Trucks!$D$48,VLOOKUP(Inputs!$F$62,Trucks!$D$168:$DB$169,AW$13,FALSE)))))))))","v":0},{"$f":"IF(Calc2!$C$17=Trucks!$D$13,VLOOKUP(Inputs!$F$62,Trucks!$D$141:$DB$169,AX$13,FALSE), IF(Calc2!$C$17=Trucks!$D$14,VLOOKUP(Inputs!$F$62,Trucks!$D$143:$DB$150,AX$13,FALSE), IF(AND(Calc2!$C$17=Trucks!$D$29,Inputs!$F$8=Trucks!$B$151),VLOOKUP(Inputs!$F$62,Trucks!$D$151:$DB$154,AX$13,FALSE),IF(AND(Calc2!$C$17=Trucks!$D$34,Inputs!$F$8=Trucks!$B$155),VLOOKUP(Inputs!$F$62,Trucks!$D$155:$DB$159,AX$13,FALSE),IF(Calc2!$C$17=Trucks!$D$39,VLOOKUP(Inputs!$F$62,Trucks!$D$160:$DB$162,AX$13,FALSE),IF(Calc2!$C$17=Trucks!$D$43,VLOOKUP(Inputs!$F$62,Trucks!$D$163:$DB$165,AX$13,FALSE),IF(Calc2!$C$17=Trucks!$D$46,VLOOKUP(Inputs!$F$62,Trucks!$D$166:$DB$167,AX$13,FALSE), IF(Calc2!$C$17=Trucks!$D$48,VLOOKUP(Inputs!$F$62,Trucks!$D$168:$DB$169,AX$13,FALSE)))))))))","v":0},{"$f":"IF(Calc2!$C$17=Trucks!$D$13,VLOOKUP(Inputs!$F$62,Trucks!$D$141:$DB$169,AY$13,FALSE), IF(Calc2!$C$17=Trucks!$D$14,VLOOKUP(Inputs!$F$62,Trucks!$D$143:$DB$150,AY$13,FALSE), IF(AND(Calc2!$C$17=Trucks!$D$29,Inputs!$F$8=Trucks!$B$151),VLOOKUP(Inputs!$F$62,Trucks!$D$151:$DB$154,AY$13,FALSE),IF(AND(Calc2!$C$17=Trucks!$D$34,Inputs!$F$8=Trucks!$B$155),VLOOKUP(Inputs!$F$62,Trucks!$D$155:$DB$159,AY$13,FALSE),IF(Calc2!$C$17=Trucks!$D$39,VLOOKUP(Inputs!$F$62,Trucks!$D$160:$DB$162,AY$13,FALSE),IF(Calc2!$C$17=Trucks!$D$43,VLOOKUP(Inputs!$F$62,Trucks!$D$163:$DB$165,AY$13,FALSE),IF(Calc2!$C$17=Trucks!$D$46,VLOOKUP(Inputs!$F$62,Trucks!$D$166:$DB$167,AY$13,FALSE), IF(Calc2!$C$17=Trucks!$D$48,VLOOKUP(Inputs!$F$62,Trucks!$D$168:$DB$169,AY$13,FALSE)))))))))","v":0},{"$f":"IF(Calc2!$C$17=Trucks!$D$13,VLOOKUP(Inputs!$F$62,Trucks!$D$141:$DB$169,AZ$13,FALSE), IF(Calc2!$C$17=Trucks!$D$14,VLOOKUP(Inputs!$F$62,Trucks!$D$143:$DB$150,AZ$13,FALSE), IF(AND(Calc2!$C$17=Trucks!$D$29,Inputs!$F$8=Trucks!$B$151),VLOOKUP(Inputs!$F$62,Trucks!$D$151:$DB$154,AZ$13,FALSE),IF(AND(Calc2!$C$17=Trucks!$D$34,Inputs!$F$8=Trucks!$B$155),VLOOKUP(Inputs!$F$62,Trucks!$D$155:$DB$159,AZ$13,FALSE),IF(Calc2!$C$17=Trucks!$D$39,VLOOKUP(Inputs!$F$62,Trucks!$D$160:$DB$162,AZ$13,FALSE),IF(Calc2!$C$17=Trucks!$D$43,VLOOKUP(Inputs!$F$62,Trucks!$D$163:$DB$165,AZ$13,FALSE),IF(Calc2!$C$17=Trucks!$D$46,VLOOKUP(Inputs!$F$62,Trucks!$D$166:$DB$167,AZ$13,FALSE), IF(Calc2!$C$17=Trucks!$D$48,VLOOKUP(Inputs!$F$62,Trucks!$D$168:$DB$169,AZ$13,FALSE)))))))))","v":0},{"$f":"IF(Calc2!$C$17=Trucks!$D$13,VLOOKUP(Inputs!$F$62,Trucks!$D$141:$DB$169,BA$13,FALSE), IF(Calc2!$C$17=Trucks!$D$14,VLOOKUP(Inputs!$F$62,Trucks!$D$143:$DB$150,BA$13,FALSE), IF(AND(Calc2!$C$17=Trucks!$D$29,Inputs!$F$8=Trucks!$B$151),VLOOKUP(Inputs!$F$62,Trucks!$D$151:$DB$154,BA$13,FALSE),IF(AND(Calc2!$C$17=Trucks!$D$34,Inputs!$F$8=Trucks!$B$155),VLOOKUP(Inputs!$F$62,Trucks!$D$155:$DB$159,BA$13,FALSE),IF(Calc2!$C$17=Trucks!$D$39,VLOOKUP(Inputs!$F$62,Trucks!$D$160:$DB$162,BA$13,FALSE),IF(Calc2!$C$17=Trucks!$D$43,VLOOKUP(Inputs!$F$62,Trucks!$D$163:$DB$165,BA$13,FALSE),IF(Calc2!$C$17=Trucks!$D$46,VLOOKUP(Inputs!$F$62,Trucks!$D$166:$DB$167,BA$13,FALSE), IF(Calc2!$C$17=Trucks!$D$48,VLOOKUP(Inputs!$F$62,Trucks!$D$168:$DB$169,BA$13,FALSE)))))))))","v":0},{"$f":"IF(Calc2!$C$17=Trucks!$D$13,VLOOKUP(Inputs!$F$62,Trucks!$D$141:$DB$169,BB$13,FALSE), IF(Calc2!$C$17=Trucks!$D$14,VLOOKUP(Inputs!$F$62,Trucks!$D$143:$DB$150,BB$13,FALSE), IF(AND(Calc2!$C$17=Trucks!$D$29,Inputs!$F$8=Trucks!$B$151),VLOOKUP(Inputs!$F$62,Trucks!$D$151:$DB$154,BB$13,FALSE),IF(AND(Calc2!$C$17=Trucks!$D$34,Inputs!$F$8=Trucks!$B$155),VLOOKUP(Inputs!$F$62,Trucks!$D$155:$DB$159,BB$13,FALSE),IF(Calc2!$C$17=Trucks!$D$39,VLOOKUP(Inputs!$F$62,Trucks!$D$160:$DB$162,BB$13,FALSE),IF(Calc2!$C$17=Trucks!$D$43,VLOOKUP(Inputs!$F$62,Trucks!$D$163:$DB$165,BB$13,FALSE),IF(Calc2!$C$17=Trucks!$D$46,VLOOKUP(Inputs!$F$62,Trucks!$D$166:$DB$167,BB$13,FALSE), IF(Calc2!$C$17=Trucks!$D$48,VLOOKUP(Inputs!$F$62,Trucks!$D$168:$DB$169,BB$13,FALSE)))))))))","v":0},{"$f":"IF(Calc2!$C$17=Trucks!$D$13,VLOOKUP(Inputs!$F$62,Trucks!$D$141:$DB$169,BC$13,FALSE), IF(Calc2!$C$17=Trucks!$D$14,VLOOKUP(Inputs!$F$62,Trucks!$D$143:$DB$150,BC$13,FALSE), IF(AND(Calc2!$C$17=Trucks!$D$29,Inputs!$F$8=Trucks!$B$151),VLOOKUP(Inputs!$F$62,Trucks!$D$151:$DB$154,BC$13,FALSE),IF(AND(Calc2!$C$17=Trucks!$D$34,Inputs!$F$8=Trucks!$B$155),VLOOKUP(Inputs!$F$62,Trucks!$D$155:$DB$159,BC$13,FALSE),IF(Calc2!$C$17=Trucks!$D$39,VLOOKUP(Inputs!$F$62,Trucks!$D$160:$DB$162,BC$13,FALSE),IF(Calc2!$C$17=Trucks!$D$43,VLOOKUP(Inputs!$F$62,Trucks!$D$163:$DB$165,BC$13,FALSE),IF(Calc2!$C$17=Trucks!$D$46,VLOOKUP(Inputs!$F$62,Trucks!$D$166:$DB$167,BC$13,FALSE), IF(Calc2!$C$17=Trucks!$D$48,VLOOKUP(Inputs!$F$62,Trucks!$D$168:$DB$169,BC$13,FALSE)))))))))","v":0},{"$f":"IF(Calc2!$C$17=Trucks!$D$13,VLOOKUP(Inputs!$F$62,Trucks!$D$141:$DB$169,BD$13,FALSE), IF(Calc2!$C$17=Trucks!$D$14,VLOOKUP(Inputs!$F$62,Trucks!$D$143:$DB$150,BD$13,FALSE), IF(AND(Calc2!$C$17=Trucks!$D$29,Inputs!$F$8=Trucks!$B$151),VLOOKUP(Inputs!$F$62,Trucks!$D$151:$DB$154,BD$13,FALSE),IF(AND(Calc2!$C$17=Trucks!$D$34,Inputs!$F$8=Trucks!$B$155),VLOOKUP(Inputs!$F$62,Trucks!$D$155:$DB$159,BD$13,FALSE),IF(Calc2!$C$17=Trucks!$D$39,VLOOKUP(Inputs!$F$62,Trucks!$D$160:$DB$162,BD$13,FALSE),IF(Calc2!$C$17=Trucks!$D$43,VLOOKUP(Inputs!$F$62,Trucks!$D$163:$DB$165,BD$13,FALSE),IF(Calc2!$C$17=Trucks!$D$46,VLOOKUP(Inputs!$F$62,Trucks!$D$166:$DB$167,BD$13,FALSE), IF(Calc2!$C$17=Trucks!$D$48,VLOOKUP(Inputs!$F$62,Trucks!$D$168:$DB$169,BD$13,FALSE)))))))))","v":0},{"$f":"IF(Calc2!$C$17=Trucks!$D$13,VLOOKUP(Inputs!$F$62,Trucks!$D$141:$DB$169,BE$13,FALSE), IF(Calc2!$C$17=Trucks!$D$14,VLOOKUP(Inputs!$F$62,Trucks!$D$143:$DB$150,BE$13,FALSE), IF(AND(Calc2!$C$17=Trucks!$D$29,Inputs!$F$8=Trucks!$B$151),VLOOKUP(Inputs!$F$62,Trucks!$D$151:$DB$154,BE$13,FALSE),IF(AND(Calc2!$C$17=Trucks!$D$34,Inputs!$F$8=Trucks!$B$155),VLOOKUP(Inputs!$F$62,Trucks!$D$155:$DB$159,BE$13,FALSE),IF(Calc2!$C$17=Trucks!$D$39,VLOOKUP(Inputs!$F$62,Trucks!$D$160:$DB$162,BE$13,FALSE),IF(Calc2!$C$17=Trucks!$D$43,VLOOKUP(Inputs!$F$62,Trucks!$D$163:$DB$165,BE$13,FALSE),IF(Calc2!$C$17=Trucks!$D$46,VLOOKUP(Inputs!$F$62,Trucks!$D$166:$DB$167,BE$13,FALSE), IF(Calc2!$C$17=Trucks!$D$48,VLOOKUP(Inputs!$F$62,Trucks!$D$168:$DB$169,BE$13,FALSE)))))))))","v":0},{"$f":"IF(Calc2!$C$17=Trucks!$D$13,VLOOKUP(Inputs!$F$62,Trucks!$D$141:$DB$169,BF$13,FALSE), IF(Calc2!$C$17=Trucks!$D$14,VLOOKUP(Inputs!$F$62,Trucks!$D$143:$DB$150,BF$13,FALSE), IF(AND(Calc2!$C$17=Trucks!$D$29,Inputs!$F$8=Trucks!$B$151),VLOOKUP(Inputs!$F$62,Trucks!$D$151:$DB$154,BF$13,FALSE),IF(AND(Calc2!$C$17=Trucks!$D$34,Inputs!$F$8=Trucks!$B$155),VLOOKUP(Inputs!$F$62,Trucks!$D$155:$DB$159,BF$13,FALSE),IF(Calc2!$C$17=Trucks!$D$39,VLOOKUP(Inputs!$F$62,Trucks!$D$160:$DB$162,BF$13,FALSE),IF(Calc2!$C$17=Trucks!$D$43,VLOOKUP(Inputs!$F$62,Trucks!$D$163:$DB$165,BF$13,FALSE),IF(Calc2!$C$17=Trucks!$D$46,VLOOKUP(Inputs!$F$62,Trucks!$D$166:$DB$167,BF$13,FALSE), IF(Calc2!$C$17=Trucks!$D$48,VLOOKUP(Inputs!$F$62,Trucks!$D$168:$DB$169,BF$13,FALSE)))))))))","v":0},{"$f":"IF(Calc2!$C$17=Trucks!$D$13,VLOOKUP(Inputs!$F$62,Trucks!$D$141:$DB$169,BG$13,FALSE), IF(Calc2!$C$17=Trucks!$D$14,VLOOKUP(Inputs!$F$62,Trucks!$D$143:$DB$150,BG$13,FALSE), IF(AND(Calc2!$C$17=Trucks!$D$29,Inputs!$F$8=Trucks!$B$151),VLOOKUP(Inputs!$F$62,Trucks!$D$151:$DB$154,BG$13,FALSE),IF(AND(Calc2!$C$17=Trucks!$D$34,Inputs!$F$8=Trucks!$B$155),VLOOKUP(Inputs!$F$62,Trucks!$D$155:$DB$159,BG$13,FALSE),IF(Calc2!$C$17=Trucks!$D$39,VLOOKUP(Inputs!$F$62,Trucks!$D$160:$DB$162,BG$13,FALSE),IF(Calc2!$C$17=Trucks!$D$43,VLOOKUP(Inputs!$F$62,Trucks!$D$163:$DB$165,BG$13,FALSE),IF(Calc2!$C$17=Trucks!$D$46,VLOOKUP(Inputs!$F$62,Trucks!$D$166:$DB$167,BG$13,FALSE), IF(Calc2!$C$17=Trucks!$D$48,VLOOKUP(Inputs!$F$62,Trucks!$D$168:$DB$169,BG$13,FALSE)))))))))","v":0},{"$f":"IF(Calc2!$C$17=Trucks!$D$13,VLOOKUP(Inputs!$F$62,Trucks!$D$141:$DB$169,BH$13,FALSE), IF(Calc2!$C$17=Trucks!$D$14,VLOOKUP(Inputs!$F$62,Trucks!$D$143:$DB$150,BH$13,FALSE), IF(AND(Calc2!$C$17=Trucks!$D$29,Inputs!$F$8=Trucks!$B$151),VLOOKUP(Inputs!$F$62,Trucks!$D$151:$DB$154,BH$13,FALSE),IF(AND(Calc2!$C$17=Trucks!$D$34,Inputs!$F$8=Trucks!$B$155),VLOOKUP(Inputs!$F$62,Trucks!$D$155:$DB$159,BH$13,FALSE),IF(Calc2!$C$17=Trucks!$D$39,VLOOKUP(Inputs!$F$62,Trucks!$D$160:$DB$162,BH$13,FALSE),IF(Calc2!$C$17=Trucks!$D$43,VLOOKUP(Inputs!$F$62,Trucks!$D$163:$DB$165,BH$13,FALSE),IF(Calc2!$C$17=Trucks!$D$46,VLOOKUP(Inputs!$F$62,Trucks!$D$166:$DB$167,BH$13,FALSE), IF(Calc2!$C$17=Trucks!$D$48,VLOOKUP(Inputs!$F$62,Trucks!$D$168:$DB$169,BH$13,FALSE)))))))))","v":0},{"$f":"IF(Calc2!$C$17=Trucks!$D$13,VLOOKUP(Inputs!$F$62,Trucks!$D$141:$DB$169,BI$13,FALSE), IF(Calc2!$C$17=Trucks!$D$14,VLOOKUP(Inputs!$F$62,Trucks!$D$143:$DB$150,BI$13,FALSE), IF(AND(Calc2!$C$17=Trucks!$D$29,Inputs!$F$8=Trucks!$B$151),VLOOKUP(Inputs!$F$62,Trucks!$D$151:$DB$154,BI$13,FALSE),IF(AND(Calc2!$C$17=Trucks!$D$34,Inputs!$F$8=Trucks!$B$155),VLOOKUP(Inputs!$F$62,Trucks!$D$155:$DB$159,BI$13,FALSE),IF(Calc2!$C$17=Trucks!$D$39,VLOOKUP(Inputs!$F$62,Trucks!$D$160:$DB$162,BI$13,FALSE),IF(Calc2!$C$17=Trucks!$D$43,VLOOKUP(Inputs!$F$62,Trucks!$D$163:$DB$165,BI$13,FALSE),IF(Calc2!$C$17=Trucks!$D$46,VLOOKUP(Inputs!$F$62,Trucks!$D$166:$DB$167,BI$13,FALSE), IF(Calc2!$C$17=Trucks!$D$48,VLOOKUP(Inputs!$F$62,Trucks!$D$168:$DB$169,BI$13,FALSE)))))))))","v":0},{"$f":"IF(Calc2!$C$17=Trucks!$D$13,VLOOKUP(Inputs!$F$62,Trucks!$D$141:$DB$169,BJ$13,FALSE), IF(Calc2!$C$17=Trucks!$D$14,VLOOKUP(Inputs!$F$62,Trucks!$D$143:$DB$150,BJ$13,FALSE), IF(AND(Calc2!$C$17=Trucks!$D$29,Inputs!$F$8=Trucks!$B$151),VLOOKUP(Inputs!$F$62,Trucks!$D$151:$DB$154,BJ$13,FALSE),IF(AND(Calc2!$C$17=Trucks!$D$34,Inputs!$F$8=Trucks!$B$155),VLOOKUP(Inputs!$F$62,Trucks!$D$155:$DB$159,BJ$13,FALSE),IF(Calc2!$C$17=Trucks!$D$39,VLOOKUP(Inputs!$F$62,Trucks!$D$160:$DB$162,BJ$13,FALSE),IF(Calc2!$C$17=Trucks!$D$43,VLOOKUP(Inputs!$F$62,Trucks!$D$163:$DB$165,BJ$13,FALSE),IF(Calc2!$C$17=Trucks!$D$46,VLOOKUP(Inputs!$F$62,Trucks!$D$166:$DB$167,BJ$13,FALSE), IF(Calc2!$C$17=Trucks!$D$48,VLOOKUP(Inputs!$F$62,Trucks!$D$168:$DB$169,BJ$13,FALSE)))))))))","v":0},{"$f":"IF(Calc2!$C$17=Trucks!$D$13,VLOOKUP(Inputs!$F$62,Trucks!$D$141:$DB$169,BK$13,FALSE), IF(Calc2!$C$17=Trucks!$D$14,VLOOKUP(Inputs!$F$62,Trucks!$D$143:$DB$150,BK$13,FALSE), IF(AND(Calc2!$C$17=Trucks!$D$29,Inputs!$F$8=Trucks!$B$151),VLOOKUP(Inputs!$F$62,Trucks!$D$151:$DB$154,BK$13,FALSE),IF(AND(Calc2!$C$17=Trucks!$D$34,Inputs!$F$8=Trucks!$B$155),VLOOKUP(Inputs!$F$62,Trucks!$D$155:$DB$159,BK$13,FALSE),IF(Calc2!$C$17=Trucks!$D$39,VLOOKUP(Inputs!$F$62,Trucks!$D$160:$DB$162,BK$13,FALSE),IF(Calc2!$C$17=Trucks!$D$43,VLOOKUP(Inputs!$F$62,Trucks!$D$163:$DB$165,BK$13,FALSE),IF(Calc2!$C$17=Trucks!$D$46,VLOOKUP(Inputs!$F$62,Trucks!$D$166:$DB$167,BK$13,FALSE), IF(Calc2!$C$17=Trucks!$D$48,VLOOKUP(Inputs!$F$62,Trucks!$D$168:$DB$169,BK$13,FALSE)))))))))","v":0},{"$f":"IF(Calc2!$C$17=Trucks!$D$13,VLOOKUP(Inputs!$F$62,Trucks!$D$141:$DB$169,BL$13,FALSE), IF(Calc2!$C$17=Trucks!$D$14,VLOOKUP(Inputs!$F$62,Trucks!$D$143:$DB$150,BL$13,FALSE), IF(AND(Calc2!$C$17=Trucks!$D$29,Inputs!$F$8=Trucks!$B$151),VLOOKUP(Inputs!$F$62,Trucks!$D$151:$DB$154,BL$13,FALSE),IF(AND(Calc2!$C$17=Trucks!$D$34,Inputs!$F$8=Trucks!$B$155),VLOOKUP(Inputs!$F$62,Trucks!$D$155:$DB$159,BL$13,FALSE),IF(Calc2!$C$17=Trucks!$D$39,VLOOKUP(Inputs!$F$62,Trucks!$D$160:$DB$162,BL$13,FALSE),IF(Calc2!$C$17=Trucks!$D$43,VLOOKUP(Inputs!$F$62,Trucks!$D$163:$DB$165,BL$13,FALSE),IF(Calc2!$C$17=Trucks!$D$46,VLOOKUP(Inputs!$F$62,Trucks!$D$166:$DB$167,BL$13,FALSE), IF(Calc2!$C$17=Trucks!$D$48,VLOOKUP(Inputs!$F$62,Trucks!$D$168:$DB$169,BL$13,FALSE)))))))))","v":0},{"$f":"IF(Calc2!$C$17=Trucks!$D$13,VLOOKUP(Inputs!$F$62,Trucks!$D$141:$DB$169,BM$13,FALSE), IF(Calc2!$C$17=Trucks!$D$14,VLOOKUP(Inputs!$F$62,Trucks!$D$143:$DB$150,BM$13,FALSE), IF(AND(Calc2!$C$17=Trucks!$D$29,Inputs!$F$8=Trucks!$B$151),VLOOKUP(Inputs!$F$62,Trucks!$D$151:$DB$154,BM$13,FALSE),IF(AND(Calc2!$C$17=Trucks!$D$34,Inputs!$F$8=Trucks!$B$155),VLOOKUP(Inputs!$F$62,Trucks!$D$155:$DB$159,BM$13,FALSE),IF(Calc2!$C$17=Trucks!$D$39,VLOOKUP(Inputs!$F$62,Trucks!$D$160:$DB$162,BM$13,FALSE),IF(Calc2!$C$17=Trucks!$D$43,VLOOKUP(Inputs!$F$62,Trucks!$D$163:$DB$165,BM$13,FALSE),IF(Calc2!$C$17=Trucks!$D$46,VLOOKUP(Inputs!$F$62,Trucks!$D$166:$DB$167,BM$13,FALSE), IF(Calc2!$C$17=Trucks!$D$48,VLOOKUP(Inputs!$F$62,Trucks!$D$168:$DB$169,BM$13,FALSE)))))))))","v":0},{"$f":"IF(Calc2!$C$17=Trucks!$D$13,VLOOKUP(Inputs!$F$62,Trucks!$D$141:$DB$169,BN$13,FALSE), IF(Calc2!$C$17=Trucks!$D$14,VLOOKUP(Inputs!$F$62,Trucks!$D$143:$DB$150,BN$13,FALSE), IF(AND(Calc2!$C$17=Trucks!$D$29,Inputs!$F$8=Trucks!$B$151),VLOOKUP(Inputs!$F$62,Trucks!$D$151:$DB$154,BN$13,FALSE),IF(AND(Calc2!$C$17=Trucks!$D$34,Inputs!$F$8=Trucks!$B$155),VLOOKUP(Inputs!$F$62,Trucks!$D$155:$DB$159,BN$13,FALSE),IF(Calc2!$C$17=Trucks!$D$39,VLOOKUP(Inputs!$F$62,Trucks!$D$160:$DB$162,BN$13,FALSE),IF(Calc2!$C$17=Trucks!$D$43,VLOOKUP(Inputs!$F$62,Trucks!$D$163:$DB$165,BN$13,FALSE),IF(Calc2!$C$17=Trucks!$D$46,VLOOKUP(Inputs!$F$62,Trucks!$D$166:$DB$167,BN$13,FALSE), IF(Calc2!$C$17=Trucks!$D$48,VLOOKUP(Inputs!$F$62,Trucks!$D$168:$DB$169,BN$13,FALSE)))))))))","v":0},{"$f":"IF(Calc2!$C$17=Trucks!$D$13,VLOOKUP(Inputs!$F$62,Trucks!$D$141:$DB$169,BO$13,FALSE), IF(Calc2!$C$17=Trucks!$D$14,VLOOKUP(Inputs!$F$62,Trucks!$D$143:$DB$150,BO$13,FALSE), IF(AND(Calc2!$C$17=Trucks!$D$29,Inputs!$F$8=Trucks!$B$151),VLOOKUP(Inputs!$F$62,Trucks!$D$151:$DB$154,BO$13,FALSE),IF(AND(Calc2!$C$17=Trucks!$D$34,Inputs!$F$8=Trucks!$B$155),VLOOKUP(Inputs!$F$62,Trucks!$D$155:$DB$159,BO$13,FALSE),IF(Calc2!$C$17=Trucks!$D$39,VLOOKUP(Inputs!$F$62,Trucks!$D$160:$DB$162,BO$13,FALSE),IF(Calc2!$C$17=Trucks!$D$43,VLOOKUP(Inputs!$F$62,Trucks!$D$163:$DB$165,BO$13,FALSE),IF(Calc2!$C$17=Trucks!$D$46,VLOOKUP(Inputs!$F$62,Trucks!$D$166:$DB$167,BO$13,FALSE), IF(Calc2!$C$17=Trucks!$D$48,VLOOKUP(Inputs!$F$62,Trucks!$D$168:$DB$169,BO$13,FALSE)))))))))","v":0},{"$f":"IF(Calc2!$C$17=Trucks!$D$13,VLOOKUP(Inputs!$F$62,Trucks!$D$141:$DB$169,BP$13,FALSE), IF(Calc2!$C$17=Trucks!$D$14,VLOOKUP(Inputs!$F$62,Trucks!$D$143:$DB$150,BP$13,FALSE), IF(AND(Calc2!$C$17=Trucks!$D$29,Inputs!$F$8=Trucks!$B$151),VLOOKUP(Inputs!$F$62,Trucks!$D$151:$DB$154,BP$13,FALSE),IF(AND(Calc2!$C$17=Trucks!$D$34,Inputs!$F$8=Trucks!$B$155),VLOOKUP(Inputs!$F$62,Trucks!$D$155:$DB$159,BP$13,FALSE),IF(Calc2!$C$17=Trucks!$D$39,VLOOKUP(Inputs!$F$62,Trucks!$D$160:$DB$162,BP$13,FALSE),IF(Calc2!$C$17=Trucks!$D$43,VLOOKUP(Inputs!$F$62,Trucks!$D$163:$DB$165,BP$13,FALSE),IF(Calc2!$C$17=Trucks!$D$46,VLOOKUP(Inputs!$F$62,Trucks!$D$166:$DB$167,BP$13,FALSE), IF(Calc2!$C$17=Trucks!$D$48,VLOOKUP(Inputs!$F$62,Trucks!$D$168:$DB$169,BP$13,FALSE)))))))))","v":0},{"$f":"IF(Calc2!$C$17=Trucks!$D$13,VLOOKUP(Inputs!$F$62,Trucks!$D$141:$DB$169,BQ$13,FALSE), IF(Calc2!$C$17=Trucks!$D$14,VLOOKUP(Inputs!$F$62,Trucks!$D$143:$DB$150,BQ$13,FALSE), IF(AND(Calc2!$C$17=Trucks!$D$29,Inputs!$F$8=Trucks!$B$151),VLOOKUP(Inputs!$F$62,Trucks!$D$151:$DB$154,BQ$13,FALSE),IF(AND(Calc2!$C$17=Trucks!$D$34,Inputs!$F$8=Trucks!$B$155),VLOOKUP(Inputs!$F$62,Trucks!$D$155:$DB$159,BQ$13,FALSE),IF(Calc2!$C$17=Trucks!$D$39,VLOOKUP(Inputs!$F$62,Trucks!$D$160:$DB$162,BQ$13,FALSE),IF(Calc2!$C$17=Trucks!$D$43,VLOOKUP(Inputs!$F$62,Trucks!$D$163:$DB$165,BQ$13,FALSE),IF(Calc2!$C$17=Trucks!$D$46,VLOOKUP(Inputs!$F$62,Trucks!$D$166:$DB$167,BQ$13,FALSE), IF(Calc2!$C$17=Trucks!$D$48,VLOOKUP(Inputs!$F$62,Trucks!$D$168:$DB$169,BQ$13,FALSE)))))))))","v":0},{"$f":"IF(Calc2!$C$17=Trucks!$D$13,VLOOKUP(Inputs!$F$62,Trucks!$D$141:$DB$169,BR$13,FALSE), IF(Calc2!$C$17=Trucks!$D$14,VLOOKUP(Inputs!$F$62,Trucks!$D$143:$DB$150,BR$13,FALSE), IF(AND(Calc2!$C$17=Trucks!$D$29,Inputs!$F$8=Trucks!$B$151),VLOOKUP(Inputs!$F$62,Trucks!$D$151:$DB$154,BR$13,FALSE),IF(AND(Calc2!$C$17=Trucks!$D$34,Inputs!$F$8=Trucks!$B$155),VLOOKUP(Inputs!$F$62,Trucks!$D$155:$DB$159,BR$13,FALSE),IF(Calc2!$C$17=Trucks!$D$39,VLOOKUP(Inputs!$F$62,Trucks!$D$160:$DB$162,BR$13,FALSE),IF(Calc2!$C$17=Trucks!$D$43,VLOOKUP(Inputs!$F$62,Trucks!$D$163:$DB$165,BR$13,FALSE),IF(Calc2!$C$17=Trucks!$D$46,VLOOKUP(Inputs!$F$62,Trucks!$D$166:$DB$167,BR$13,FALSE), IF(Calc2!$C$17=Trucks!$D$48,VLOOKUP(Inputs!$F$62,Trucks!$D$168:$DB$169,BR$13,FALSE)))))))))","v":0},{"$f":"IF(Calc2!$C$17=Trucks!$D$13,VLOOKUP(Inputs!$F$62,Trucks!$D$141:$DB$169,BS$13,FALSE), IF(Calc2!$C$17=Trucks!$D$14,VLOOKUP(Inputs!$F$62,Trucks!$D$143:$DB$150,BS$13,FALSE), IF(AND(Calc2!$C$17=Trucks!$D$29,Inputs!$F$8=Trucks!$B$151),VLOOKUP(Inputs!$F$62,Trucks!$D$151:$DB$154,BS$13,FALSE),IF(AND(Calc2!$C$17=Trucks!$D$34,Inputs!$F$8=Trucks!$B$155),VLOOKUP(Inputs!$F$62,Trucks!$D$155:$DB$159,BS$13,FALSE),IF(Calc2!$C$17=Trucks!$D$39,VLOOKUP(Inputs!$F$62,Trucks!$D$160:$DB$162,BS$13,FALSE),IF(Calc2!$C$17=Trucks!$D$43,VLOOKUP(Inputs!$F$62,Trucks!$D$163:$DB$165,BS$13,FALSE),IF(Calc2!$C$17=Trucks!$D$46,VLOOKUP(Inputs!$F$62,Trucks!$D$166:$DB$167,BS$13,FALSE), IF(Calc2!$C$17=Trucks!$D$48,VLOOKUP(Inputs!$F$62,Trucks!$D$168:$DB$169,BS$13,FALSE)))))))))","v":0},{"$f":"IF(Calc2!$C$17=Trucks!$D$13,VLOOKUP(Inputs!$F$62,Trucks!$D$141:$DB$169,BT$13,FALSE), IF(Calc2!$C$17=Trucks!$D$14,VLOOKUP(Inputs!$F$62,Trucks!$D$143:$DB$150,BT$13,FALSE), IF(AND(Calc2!$C$17=Trucks!$D$29,Inputs!$F$8=Trucks!$B$151),VLOOKUP(Inputs!$F$62,Trucks!$D$151:$DB$154,BT$13,FALSE),IF(AND(Calc2!$C$17=Trucks!$D$34,Inputs!$F$8=Trucks!$B$155),VLOOKUP(Inputs!$F$62,Trucks!$D$155:$DB$159,BT$13,FALSE),IF(Calc2!$C$17=Trucks!$D$39,VLOOKUP(Inputs!$F$62,Trucks!$D$160:$DB$162,BT$13,FALSE),IF(Calc2!$C$17=Trucks!$D$43,VLOOKUP(Inputs!$F$62,Trucks!$D$163:$DB$165,BT$13,FALSE),IF(Calc2!$C$17=Trucks!$D$46,VLOOKUP(Inputs!$F$62,Trucks!$D$166:$DB$167,BT$13,FALSE), IF(Calc2!$C$17=Trucks!$D$48,VLOOKUP(Inputs!$F$62,Trucks!$D$168:$DB$169,BT$13,FALSE)))))))))","v":0},{"$f":"IF(Calc2!$C$17=Trucks!$D$13,VLOOKUP(Inputs!$F$62,Trucks!$D$141:$DB$169,BU$13,FALSE), IF(Calc2!$C$17=Trucks!$D$14,VLOOKUP(Inputs!$F$62,Trucks!$D$143:$DB$150,BU$13,FALSE), IF(AND(Calc2!$C$17=Trucks!$D$29,Inputs!$F$8=Trucks!$B$151),VLOOKUP(Inputs!$F$62,Trucks!$D$151:$DB$154,BU$13,FALSE),IF(AND(Calc2!$C$17=Trucks!$D$34,Inputs!$F$8=Trucks!$B$155),VLOOKUP(Inputs!$F$62,Trucks!$D$155:$DB$159,BU$13,FALSE),IF(Calc2!$C$17=Trucks!$D$39,VLOOKUP(Inputs!$F$62,Trucks!$D$160:$DB$162,BU$13,FALSE),IF(Calc2!$C$17=Trucks!$D$43,VLOOKUP(Inputs!$F$62,Trucks!$D$163:$DB$165,BU$13,FALSE),IF(Calc2!$C$17=Trucks!$D$46,VLOOKUP(Inputs!$F$62,Trucks!$D$166:$DB$167,BU$13,FALSE), IF(Calc2!$C$17=Trucks!$D$48,VLOOKUP(Inputs!$F$62,Trucks!$D$168:$DB$169,BU$13,FALSE)))))))))","v":0},{"$f":"IF(Calc2!$C$17=Trucks!$D$13,VLOOKUP(Inputs!$F$62,Trucks!$D$141:$DB$169,BV$13,FALSE), IF(Calc2!$C$17=Trucks!$D$14,VLOOKUP(Inputs!$F$62,Trucks!$D$143:$DB$150,BV$13,FALSE), IF(AND(Calc2!$C$17=Trucks!$D$29,Inputs!$F$8=Trucks!$B$151),VLOOKUP(Inputs!$F$62,Trucks!$D$151:$DB$154,BV$13,FALSE),IF(AND(Calc2!$C$17=Trucks!$D$34,Inputs!$F$8=Trucks!$B$155),VLOOKUP(Inputs!$F$62,Trucks!$D$155:$DB$159,BV$13,FALSE),IF(Calc2!$C$17=Trucks!$D$39,VLOOKUP(Inputs!$F$62,Trucks!$D$160:$DB$162,BV$13,FALSE),IF(Calc2!$C$17=Trucks!$D$43,VLOOKUP(Inputs!$F$62,Trucks!$D$163:$DB$165,BV$13,FALSE),IF(Calc2!$C$17=Trucks!$D$46,VLOOKUP(Inputs!$F$62,Trucks!$D$166:$DB$167,BV$13,FALSE), IF(Calc2!$C$17=Trucks!$D$48,VLOOKUP(Inputs!$F$62,Trucks!$D$168:$DB$169,BV$13,FALSE)))))))))","v":0},{"$f":"IF(Calc2!$C$17=Trucks!$D$13,VLOOKUP(Inputs!$F$62,Trucks!$D$141:$DB$169,BW$13,FALSE), IF(Calc2!$C$17=Trucks!$D$14,VLOOKUP(Inputs!$F$62,Trucks!$D$143:$DB$150,BW$13,FALSE), IF(AND(Calc2!$C$17=Trucks!$D$29,Inputs!$F$8=Trucks!$B$151),VLOOKUP(Inputs!$F$62,Trucks!$D$151:$DB$154,BW$13,FALSE),IF(AND(Calc2!$C$17=Trucks!$D$34,Inputs!$F$8=Trucks!$B$155),VLOOKUP(Inputs!$F$62,Trucks!$D$155:$DB$159,BW$13,FALSE),IF(Calc2!$C$17=Trucks!$D$39,VLOOKUP(Inputs!$F$62,Trucks!$D$160:$DB$162,BW$13,FALSE),IF(Calc2!$C$17=Trucks!$D$43,VLOOKUP(Inputs!$F$62,Trucks!$D$163:$DB$165,BW$13,FALSE),IF(Calc2!$C$17=Trucks!$D$46,VLOOKUP(Inputs!$F$62,Trucks!$D$166:$DB$167,BW$13,FALSE), IF(Calc2!$C$17=Trucks!$D$48,VLOOKUP(Inputs!$F$62,Trucks!$D$168:$DB$169,BW$13,FALSE)))))))))","v":0},{"$f":"IF(Calc2!$C$17=Trucks!$D$13,VLOOKUP(Inputs!$F$62,Trucks!$D$141:$DB$169,BX$13,FALSE), IF(Calc2!$C$17=Trucks!$D$14,VLOOKUP(Inputs!$F$62,Trucks!$D$143:$DB$150,BX$13,FALSE), IF(AND(Calc2!$C$17=Trucks!$D$29,Inputs!$F$8=Trucks!$B$151),VLOOKUP(Inputs!$F$62,Trucks!$D$151:$DB$154,BX$13,FALSE),IF(AND(Calc2!$C$17=Trucks!$D$34,Inputs!$F$8=Trucks!$B$155),VLOOKUP(Inputs!$F$62,Trucks!$D$155:$DB$159,BX$13,FALSE),IF(Calc2!$C$17=Trucks!$D$39,VLOOKUP(Inputs!$F$62,Trucks!$D$160:$DB$162,BX$13,FALSE),IF(Calc2!$C$17=Trucks!$D$43,VLOOKUP(Inputs!$F$62,Trucks!$D$163:$DB$165,BX$13,FALSE),IF(Calc2!$C$17=Trucks!$D$46,VLOOKUP(Inputs!$F$62,Trucks!$D$166:$DB$167,BX$13,FALSE), IF(Calc2!$C$17=Trucks!$D$48,VLOOKUP(Inputs!$F$62,Trucks!$D$168:$DB$169,BX$13,FALSE)))))))))","v":0},{"$f":"IF(Calc2!$C$17=Trucks!$D$13,VLOOKUP(Inputs!$F$62,Trucks!$D$141:$DB$169,BY$13,FALSE), IF(Calc2!$C$17=Trucks!$D$14,VLOOKUP(Inputs!$F$62,Trucks!$D$143:$DB$150,BY$13,FALSE), IF(AND(Calc2!$C$17=Trucks!$D$29,Inputs!$F$8=Trucks!$B$151),VLOOKUP(Inputs!$F$62,Trucks!$D$151:$DB$154,BY$13,FALSE),IF(AND(Calc2!$C$17=Trucks!$D$34,Inputs!$F$8=Trucks!$B$155),VLOOKUP(Inputs!$F$62,Trucks!$D$155:$DB$159,BY$13,FALSE),IF(Calc2!$C$17=Trucks!$D$39,VLOOKUP(Inputs!$F$62,Trucks!$D$160:$DB$162,BY$13,FALSE),IF(Calc2!$C$17=Trucks!$D$43,VLOOKUP(Inputs!$F$62,Trucks!$D$163:$DB$165,BY$13,FALSE),IF(Calc2!$C$17=Trucks!$D$46,VLOOKUP(Inputs!$F$62,Trucks!$D$166:$DB$167,BY$13,FALSE), IF(Calc2!$C$17=Trucks!$D$48,VLOOKUP(Inputs!$F$62,Trucks!$D$168:$DB$169,BY$13,FALSE)))))))))","v":0},{"$f":"IF(Calc2!$C$17=Trucks!$D$13,VLOOKUP(Inputs!$F$62,Trucks!$D$141:$DB$169,BZ$13,FALSE), IF(Calc2!$C$17=Trucks!$D$14,VLOOKUP(Inputs!$F$62,Trucks!$D$143:$DB$150,BZ$13,FALSE), IF(AND(Calc2!$C$17=Trucks!$D$29,Inputs!$F$8=Trucks!$B$151),VLOOKUP(Inputs!$F$62,Trucks!$D$151:$DB$154,BZ$13,FALSE),IF(AND(Calc2!$C$17=Trucks!$D$34,Inputs!$F$8=Trucks!$B$155),VLOOKUP(Inputs!$F$62,Trucks!$D$155:$DB$159,BZ$13,FALSE),IF(Calc2!$C$17=Trucks!$D$39,VLOOKUP(Inputs!$F$62,Trucks!$D$160:$DB$162,BZ$13,FALSE),IF(Calc2!$C$17=Trucks!$D$43,VLOOKUP(Inputs!$F$62,Trucks!$D$163:$DB$165,BZ$13,FALSE),IF(Calc2!$C$17=Trucks!$D$46,VLOOKUP(Inputs!$F$62,Trucks!$D$166:$DB$167,BZ$13,FALSE), IF(Calc2!$C$17=Trucks!$D$48,VLOOKUP(Inputs!$F$62,Trucks!$D$168:$DB$169,BZ$13,FALSE)))))))))","v":0},{"$f":"IF(Calc2!$C$17=Trucks!$D$13,VLOOKUP(Inputs!$F$62,Trucks!$D$141:$DB$169,CA$13,FALSE), IF(Calc2!$C$17=Trucks!$D$14,VLOOKUP(Inputs!$F$62,Trucks!$D$143:$DB$150,CA$13,FALSE), IF(AND(Calc2!$C$17=Trucks!$D$29,Inputs!$F$8=Trucks!$B$151),VLOOKUP(Inputs!$F$62,Trucks!$D$151:$DB$154,CA$13,FALSE),IF(AND(Calc2!$C$17=Trucks!$D$34,Inputs!$F$8=Trucks!$B$155),VLOOKUP(Inputs!$F$62,Trucks!$D$155:$DB$159,CA$13,FALSE),IF(Calc2!$C$17=Trucks!$D$39,VLOOKUP(Inputs!$F$62,Trucks!$D$160:$DB$162,CA$13,FALSE),IF(Calc2!$C$17=Trucks!$D$43,VLOOKUP(Inputs!$F$62,Trucks!$D$163:$DB$165,CA$13,FALSE),IF(Calc2!$C$17=Trucks!$D$46,VLOOKUP(Inputs!$F$62,Trucks!$D$166:$DB$167,CA$13,FALSE), IF(Calc2!$C$17=Trucks!$D$48,VLOOKUP(Inputs!$F$62,Trucks!$D$168:$DB$169,CA$13,FALSE)))))))))","v":0},{"$f":"IF(Calc2!$C$17=Trucks!$D$13,VLOOKUP(Inputs!$F$62,Trucks!$D$141:$DB$169,CB$13,FALSE), IF(Calc2!$C$17=Trucks!$D$14,VLOOKUP(Inputs!$F$62,Trucks!$D$143:$DB$150,CB$13,FALSE), IF(AND(Calc2!$C$17=Trucks!$D$29,Inputs!$F$8=Trucks!$B$151),VLOOKUP(Inputs!$F$62,Trucks!$D$151:$DB$154,CB$13,FALSE),IF(AND(Calc2!$C$17=Trucks!$D$34,Inputs!$F$8=Trucks!$B$155),VLOOKUP(Inputs!$F$62,Trucks!$D$155:$DB$159,CB$13,FALSE),IF(Calc2!$C$17=Trucks!$D$39,VLOOKUP(Inputs!$F$62,Trucks!$D$160:$DB$162,CB$13,FALSE),IF(Calc2!$C$17=Trucks!$D$43,VLOOKUP(Inputs!$F$62,Trucks!$D$163:$DB$165,CB$13,FALSE),IF(Calc2!$C$17=Trucks!$D$46,VLOOKUP(Inputs!$F$62,Trucks!$D$166:$DB$167,CB$13,FALSE), IF(Calc2!$C$17=Trucks!$D$48,VLOOKUP(Inputs!$F$62,Trucks!$D$168:$DB$169,CB$13,FALSE)))))))))","v":0},{"$f":"IF(Calc2!$C$17=Trucks!$D$13,VLOOKUP(Inputs!$F$62,Trucks!$D$141:$DB$169,CC$13,FALSE), IF(Calc2!$C$17=Trucks!$D$14,VLOOKUP(Inputs!$F$62,Trucks!$D$143:$DB$150,CC$13,FALSE), IF(AND(Calc2!$C$17=Trucks!$D$29,Inputs!$F$8=Trucks!$B$151),VLOOKUP(Inputs!$F$62,Trucks!$D$151:$DB$154,CC$13,FALSE),IF(AND(Calc2!$C$17=Trucks!$D$34,Inputs!$F$8=Trucks!$B$155),VLOOKUP(Inputs!$F$62,Trucks!$D$155:$DB$159,CC$13,FALSE),IF(Calc2!$C$17=Trucks!$D$39,VLOOKUP(Inputs!$F$62,Trucks!$D$160:$DB$162,CC$13,FALSE),IF(Calc2!$C$17=Trucks!$D$43,VLOOKUP(Inputs!$F$62,Trucks!$D$163:$DB$165,CC$13,FALSE),IF(Calc2!$C$17=Trucks!$D$46,VLOOKUP(Inputs!$F$62,Trucks!$D$166:$DB$167,CC$13,FALSE), IF(Calc2!$C$17=Trucks!$D$48,VLOOKUP(Inputs!$F$62,Trucks!$D$168:$DB$169,CC$13,FALSE)))))))))","v":0},{"$f":"IF(Calc2!$C$17=Trucks!$D$13,VLOOKUP(Inputs!$F$62,Trucks!$D$141:$DB$169,CD$13,FALSE), IF(Calc2!$C$17=Trucks!$D$14,VLOOKUP(Inputs!$F$62,Trucks!$D$143:$DB$150,CD$13,FALSE), IF(AND(Calc2!$C$17=Trucks!$D$29,Inputs!$F$8=Trucks!$B$151),VLOOKUP(Inputs!$F$62,Trucks!$D$151:$DB$154,CD$13,FALSE),IF(AND(Calc2!$C$17=Trucks!$D$34,Inputs!$F$8=Trucks!$B$155),VLOOKUP(Inputs!$F$62,Trucks!$D$155:$DB$159,CD$13,FALSE),IF(Calc2!$C$17=Trucks!$D$39,VLOOKUP(Inputs!$F$62,Trucks!$D$160:$DB$162,CD$13,FALSE),IF(Calc2!$C$17=Trucks!$D$43,VLOOKUP(Inputs!$F$62,Trucks!$D$163:$DB$165,CD$13,FALSE),IF(Calc2!$C$17=Trucks!$D$46,VLOOKUP(Inputs!$F$62,Trucks!$D$166:$DB$167,CD$13,FALSE), IF(Calc2!$C$17=Trucks!$D$48,VLOOKUP(Inputs!$F$62,Trucks!$D$168:$DB$169,CD$13,FALSE)))))))))","v":0},{"$f":"IF(Calc2!$C$17=Trucks!$D$13,VLOOKUP(Inputs!$F$62,Trucks!$D$141:$DB$169,CE$13,FALSE), IF(Calc2!$C$17=Trucks!$D$14,VLOOKUP(Inputs!$F$62,Trucks!$D$143:$DB$150,CE$13,FALSE), IF(AND(Calc2!$C$17=Trucks!$D$29,Inputs!$F$8=Trucks!$B$151),VLOOKUP(Inputs!$F$62,Trucks!$D$151:$DB$154,CE$13,FALSE),IF(AND(Calc2!$C$17=Trucks!$D$34,Inputs!$F$8=Trucks!$B$155),VLOOKUP(Inputs!$F$62,Trucks!$D$155:$DB$159,CE$13,FALSE),IF(Calc2!$C$17=Trucks!$D$39,VLOOKUP(Inputs!$F$62,Trucks!$D$160:$DB$162,CE$13,FALSE),IF(Calc2!$C$17=Trucks!$D$43,VLOOKUP(Inputs!$F$62,Trucks!$D$163:$DB$165,CE$13,FALSE),IF(Calc2!$C$17=Trucks!$D$46,VLOOKUP(Inputs!$F$62,Trucks!$D$166:$DB$167,CE$13,FALSE), IF(Calc2!$C$17=Trucks!$D$48,VLOOKUP(Inputs!$F$62,Trucks!$D$168:$DB$169,CE$13,FALSE)))))))))","v":0},{"$f":"IF(Calc2!$C$17=Trucks!$D$13,VLOOKUP(Inputs!$F$62,Trucks!$D$141:$DB$169,CF$13,FALSE), IF(Calc2!$C$17=Trucks!$D$14,VLOOKUP(Inputs!$F$62,Trucks!$D$143:$DB$150,CF$13,FALSE), IF(AND(Calc2!$C$17=Trucks!$D$29,Inputs!$F$8=Trucks!$B$151),VLOOKUP(Inputs!$F$62,Trucks!$D$151:$DB$154,CF$13,FALSE),IF(AND(Calc2!$C$17=Trucks!$D$34,Inputs!$F$8=Trucks!$B$155),VLOOKUP(Inputs!$F$62,Trucks!$D$155:$DB$159,CF$13,FALSE),IF(Calc2!$C$17=Trucks!$D$39,VLOOKUP(Inputs!$F$62,Trucks!$D$160:$DB$162,CF$13,FALSE),IF(Calc2!$C$17=Trucks!$D$43,VLOOKUP(Inputs!$F$62,Trucks!$D$163:$DB$165,CF$13,FALSE),IF(Calc2!$C$17=Trucks!$D$46,VLOOKUP(Inputs!$F$62,Trucks!$D$166:$DB$167,CF$13,FALSE), IF(Calc2!$C$17=Trucks!$D$48,VLOOKUP(Inputs!$F$62,Trucks!$D$168:$DB$169,CF$13,FALSE)))))))))","v":0},{"$f":"IF(Calc2!$C$17=Trucks!$D$13,VLOOKUP(Inputs!$F$62,Trucks!$D$141:$DB$169,CG$13,FALSE), IF(Calc2!$C$17=Trucks!$D$14,VLOOKUP(Inputs!$F$62,Trucks!$D$143:$DB$150,CG$13,FALSE), IF(AND(Calc2!$C$17=Trucks!$D$29,Inputs!$F$8=Trucks!$B$151),VLOOKUP(Inputs!$F$62,Trucks!$D$151:$DB$154,CG$13,FALSE),IF(AND(Calc2!$C$17=Trucks!$D$34,Inputs!$F$8=Trucks!$B$155),VLOOKUP(Inputs!$F$62,Trucks!$D$155:$DB$159,CG$13,FALSE),IF(Calc2!$C$17=Trucks!$D$39,VLOOKUP(Inputs!$F$62,Trucks!$D$160:$DB$162,CG$13,FALSE),IF(Calc2!$C$17=Trucks!$D$43,VLOOKUP(Inputs!$F$62,Trucks!$D$163:$DB$165,CG$13,FALSE),IF(Calc2!$C$17=Trucks!$D$46,VLOOKUP(Inputs!$F$62,Trucks!$D$166:$DB$167,CG$13,FALSE), IF(Calc2!$C$17=Trucks!$D$48,VLOOKUP(Inputs!$F$62,Trucks!$D$168:$DB$169,CG$13,FALSE)))))))))","v":0},{"$f":"IF(Calc2!$C$17=Trucks!$D$13,VLOOKUP(Inputs!$F$62,Trucks!$D$141:$DB$169,CH$13,FALSE), IF(Calc2!$C$17=Trucks!$D$14,VLOOKUP(Inputs!$F$62,Trucks!$D$143:$DB$150,CH$13,FALSE), IF(AND(Calc2!$C$17=Trucks!$D$29,Inputs!$F$8=Trucks!$B$151),VLOOKUP(Inputs!$F$62,Trucks!$D$151:$DB$154,CH$13,FALSE),IF(AND(Calc2!$C$17=Trucks!$D$34,Inputs!$F$8=Trucks!$B$155),VLOOKUP(Inputs!$F$62,Trucks!$D$155:$DB$159,CH$13,FALSE),IF(Calc2!$C$17=Trucks!$D$39,VLOOKUP(Inputs!$F$62,Trucks!$D$160:$DB$162,CH$13,FALSE),IF(Calc2!$C$17=Trucks!$D$43,VLOOKUP(Inputs!$F$62,Trucks!$D$163:$DB$165,CH$13,FALSE),IF(Calc2!$C$17=Trucks!$D$46,VLOOKUP(Inputs!$F$62,Trucks!$D$166:$DB$167,CH$13,FALSE), IF(Calc2!$C$17=Trucks!$D$48,VLOOKUP(Inputs!$F$62,Trucks!$D$168:$DB$169,CH$13,FALSE)))))))))","v":0},{"$f":"IF(Calc2!$C$17=Trucks!$D$13,VLOOKUP(Inputs!$F$62,Trucks!$D$141:$DB$169,CI$13,FALSE), IF(Calc2!$C$17=Trucks!$D$14,VLOOKUP(Inputs!$F$62,Trucks!$D$143:$DB$150,CI$13,FALSE), IF(AND(Calc2!$C$17=Trucks!$D$29,Inputs!$F$8=Trucks!$B$151),VLOOKUP(Inputs!$F$62,Trucks!$D$151:$DB$154,CI$13,FALSE),IF(AND(Calc2!$C$17=Trucks!$D$34,Inputs!$F$8=Trucks!$B$155),VLOOKUP(Inputs!$F$62,Trucks!$D$155:$DB$159,CI$13,FALSE),IF(Calc2!$C$17=Trucks!$D$39,VLOOKUP(Inputs!$F$62,Trucks!$D$160:$DB$162,CI$13,FALSE),IF(Calc2!$C$17=Trucks!$D$43,VLOOKUP(Inputs!$F$62,Trucks!$D$163:$DB$165,CI$13,FALSE),IF(Calc2!$C$17=Trucks!$D$46,VLOOKUP(Inputs!$F$62,Trucks!$D$166:$DB$167,CI$13,FALSE), IF(Calc2!$C$17=Trucks!$D$48,VLOOKUP(Inputs!$F$62,Trucks!$D$168:$DB$169,CI$13,FALSE)))))))))","v":0},{"$f":"IF(Calc2!$C$17=Trucks!$D$13,VLOOKUP(Inputs!$F$62,Trucks!$D$141:$DB$169,CJ$13,FALSE), IF(Calc2!$C$17=Trucks!$D$14,VLOOKUP(Inputs!$F$62,Trucks!$D$143:$DB$150,CJ$13,FALSE), IF(AND(Calc2!$C$17=Trucks!$D$29,Inputs!$F$8=Trucks!$B$151),VLOOKUP(Inputs!$F$62,Trucks!$D$151:$DB$154,CJ$13,FALSE),IF(AND(Calc2!$C$17=Trucks!$D$34,Inputs!$F$8=Trucks!$B$155),VLOOKUP(Inputs!$F$62,Trucks!$D$155:$DB$159,CJ$13,FALSE),IF(Calc2!$C$17=Trucks!$D$39,VLOOKUP(Inputs!$F$62,Trucks!$D$160:$DB$162,CJ$13,FALSE),IF(Calc2!$C$17=Trucks!$D$43,VLOOKUP(Inputs!$F$62,Trucks!$D$163:$DB$165,CJ$13,FALSE),IF(Calc2!$C$17=Trucks!$D$46,VLOOKUP(Inputs!$F$62,Trucks!$D$166:$DB$167,CJ$13,FALSE), IF(Calc2!$C$17=Trucks!$D$48,VLOOKUP(Inputs!$F$62,Trucks!$D$168:$DB$169,CJ$13,FALSE)))))))))","v":0},{"$f":"IF(Calc2!$C$17=Trucks!$D$13,VLOOKUP(Inputs!$F$62,Trucks!$D$141:$DB$169,CK$13,FALSE), IF(Calc2!$C$17=Trucks!$D$14,VLOOKUP(Inputs!$F$62,Trucks!$D$143:$DB$150,CK$13,FALSE), IF(AND(Calc2!$C$17=Trucks!$D$29,Inputs!$F$8=Trucks!$B$151),VLOOKUP(Inputs!$F$62,Trucks!$D$151:$DB$154,CK$13,FALSE),IF(AND(Calc2!$C$17=Trucks!$D$34,Inputs!$F$8=Trucks!$B$155),VLOOKUP(Inputs!$F$62,Trucks!$D$155:$DB$159,CK$13,FALSE),IF(Calc2!$C$17=Trucks!$D$39,VLOOKUP(Inputs!$F$62,Trucks!$D$160:$DB$162,CK$13,FALSE),IF(Calc2!$C$17=Trucks!$D$43,VLOOKUP(Inputs!$F$62,Trucks!$D$163:$DB$165,CK$13,FALSE),IF(Calc2!$C$17=Trucks!$D$46,VLOOKUP(Inputs!$F$62,Trucks!$D$166:$DB$167,CK$13,FALSE), IF(Calc2!$C$17=Trucks!$D$48,VLOOKUP(Inputs!$F$62,Trucks!$D$168:$DB$169,CK$13,FALSE)))))))))","v":0},{"$f":"IF(Calc2!$C$17=Trucks!$D$13,VLOOKUP(Inputs!$F$62,Trucks!$D$141:$DB$169,CL$13,FALSE), IF(Calc2!$C$17=Trucks!$D$14,VLOOKUP(Inputs!$F$62,Trucks!$D$143:$DB$150,CL$13,FALSE), IF(AND(Calc2!$C$17=Trucks!$D$29,Inputs!$F$8=Trucks!$B$151),VLOOKUP(Inputs!$F$62,Trucks!$D$151:$DB$154,CL$13,FALSE),IF(AND(Calc2!$C$17=Trucks!$D$34,Inputs!$F$8=Trucks!$B$155),VLOOKUP(Inputs!$F$62,Trucks!$D$155:$DB$159,CL$13,FALSE),IF(Calc2!$C$17=Trucks!$D$39,VLOOKUP(Inputs!$F$62,Trucks!$D$160:$DB$162,CL$13,FALSE),IF(Calc2!$C$17=Trucks!$D$43,VLOOKUP(Inputs!$F$62,Trucks!$D$163:$DB$165,CL$13,FALSE),IF(Calc2!$C$17=Trucks!$D$46,VLOOKUP(Inputs!$F$62,Trucks!$D$166:$DB$167,CL$13,FALSE), IF(Calc2!$C$17=Trucks!$D$48,VLOOKUP(Inputs!$F$62,Trucks!$D$168:$DB$169,CL$13,FALSE)))))))))","v":0},{"$f":"IF(Calc2!$C$17=Trucks!$D$13,VLOOKUP(Inputs!$F$62,Trucks!$D$141:$DB$169,CM$13,FALSE), IF(Calc2!$C$17=Trucks!$D$14,VLOOKUP(Inputs!$F$62,Trucks!$D$143:$DB$150,CM$13,FALSE), IF(AND(Calc2!$C$17=Trucks!$D$29,Inputs!$F$8=Trucks!$B$151),VLOOKUP(Inputs!$F$62,Trucks!$D$151:$DB$154,CM$13,FALSE),IF(AND(Calc2!$C$17=Trucks!$D$34,Inputs!$F$8=Trucks!$B$155),VLOOKUP(Inputs!$F$62,Trucks!$D$155:$DB$159,CM$13,FALSE),IF(Calc2!$C$17=Trucks!$D$39,VLOOKUP(Inputs!$F$62,Trucks!$D$160:$DB$162,CM$13,FALSE),IF(Calc2!$C$17=Trucks!$D$43,VLOOKUP(Inputs!$F$62,Trucks!$D$163:$DB$165,CM$13,FALSE),IF(Calc2!$C$17=Trucks!$D$46,VLOOKUP(Inputs!$F$62,Trucks!$D$166:$DB$167,CM$13,FALSE), IF(Calc2!$C$17=Trucks!$D$48,VLOOKUP(Inputs!$F$62,Trucks!$D$168:$DB$169,CM$13,FALSE)))))))))","v":0},{"$f":"IF(Calc2!$C$17=Trucks!$D$13,VLOOKUP(Inputs!$F$62,Trucks!$D$141:$DB$169,CN$13,FALSE), IF(Calc2!$C$17=Trucks!$D$14,VLOOKUP(Inputs!$F$62,Trucks!$D$143:$DB$150,CN$13,FALSE), IF(AND(Calc2!$C$17=Trucks!$D$29,Inputs!$F$8=Trucks!$B$151),VLOOKUP(Inputs!$F$62,Trucks!$D$151:$DB$154,CN$13,FALSE),IF(AND(Calc2!$C$17=Trucks!$D$34,Inputs!$F$8=Trucks!$B$155),VLOOKUP(Inputs!$F$62,Trucks!$D$155:$DB$159,CN$13,FALSE),IF(Calc2!$C$17=Trucks!$D$39,VLOOKUP(Inputs!$F$62,Trucks!$D$160:$DB$162,CN$13,FALSE),IF(Calc2!$C$17=Trucks!$D$43,VLOOKUP(Inputs!$F$62,Trucks!$D$163:$DB$165,CN$13,FALSE),IF(Calc2!$C$17=Trucks!$D$46,VLOOKUP(Inputs!$F$62,Trucks!$D$166:$DB$167,CN$13,FALSE), IF(Calc2!$C$17=Trucks!$D$48,VLOOKUP(Inputs!$F$62,Trucks!$D$168:$DB$169,CN$13,FALSE)))))))))","v":0},{"$f":"IF(Calc2!$C$17=Trucks!$D$13,VLOOKUP(Inputs!$F$62,Trucks!$D$141:$DB$169,CO$13,FALSE), IF(Calc2!$C$17=Trucks!$D$14,VLOOKUP(Inputs!$F$62,Trucks!$D$143:$DB$150,CO$13,FALSE), IF(AND(Calc2!$C$17=Trucks!$D$29,Inputs!$F$8=Trucks!$B$151),VLOOKUP(Inputs!$F$62,Trucks!$D$151:$DB$154,CO$13,FALSE),IF(AND(Calc2!$C$17=Trucks!$D$34,Inputs!$F$8=Trucks!$B$155),VLOOKUP(Inputs!$F$62,Trucks!$D$155:$DB$159,CO$13,FALSE),IF(Calc2!$C$17=Trucks!$D$39,VLOOKUP(Inputs!$F$62,Trucks!$D$160:$DB$162,CO$13,FALSE),IF(Calc2!$C$17=Trucks!$D$43,VLOOKUP(Inputs!$F$62,Trucks!$D$163:$DB$165,CO$13,FALSE),IF(Calc2!$C$17=Trucks!$D$46,VLOOKUP(Inputs!$F$62,Trucks!$D$166:$DB$167,CO$13,FALSE), IF(Calc2!$C$17=Trucks!$D$48,VLOOKUP(Inputs!$F$62,Trucks!$D$168:$DB$169,CO$13,FALSE)))))))))","v":0},{"$f":"IF(Calc2!$C$17=Trucks!$D$13,VLOOKUP(Inputs!$F$62,Trucks!$D$141:$DB$169,CP$13,FALSE), IF(Calc2!$C$17=Trucks!$D$14,VLOOKUP(Inputs!$F$62,Trucks!$D$143:$DB$150,CP$13,FALSE), IF(AND(Calc2!$C$17=Trucks!$D$29,Inputs!$F$8=Trucks!$B$151),VLOOKUP(Inputs!$F$62,Trucks!$D$151:$DB$154,CP$13,FALSE),IF(AND(Calc2!$C$17=Trucks!$D$34,Inputs!$F$8=Trucks!$B$155),VLOOKUP(Inputs!$F$62,Trucks!$D$155:$DB$159,CP$13,FALSE),IF(Calc2!$C$17=Trucks!$D$39,VLOOKUP(Inputs!$F$62,Trucks!$D$160:$DB$162,CP$13,FALSE),IF(Calc2!$C$17=Trucks!$D$43,VLOOKUP(Inputs!$F$62,Trucks!$D$163:$DB$165,CP$13,FALSE),IF(Calc2!$C$17=Trucks!$D$46,VLOOKUP(Inputs!$F$62,Trucks!$D$166:$DB$167,CP$13,FALSE), IF(Calc2!$C$17=Trucks!$D$48,VLOOKUP(Inputs!$F$62,Trucks!$D$168:$DB$169,CP$13,FALSE)))))))))","v":0},{"$f":"IF(Calc2!$C$17=Trucks!$D$13,VLOOKUP(Inputs!$F$62,Trucks!$D$141:$DB$169,CQ$13,FALSE), IF(Calc2!$C$17=Trucks!$D$14,VLOOKUP(Inputs!$F$62,Trucks!$D$143:$DB$150,CQ$13,FALSE), IF(AND(Calc2!$C$17=Trucks!$D$29,Inputs!$F$8=Trucks!$B$151),VLOOKUP(Inputs!$F$62,Trucks!$D$151:$DB$154,CQ$13,FALSE),IF(AND(Calc2!$C$17=Trucks!$D$34,Inputs!$F$8=Trucks!$B$155),VLOOKUP(Inputs!$F$62,Trucks!$D$155:$DB$159,CQ$13,FALSE),IF(Calc2!$C$17=Trucks!$D$39,VLOOKUP(Inputs!$F$62,Trucks!$D$160:$DB$162,CQ$13,FALSE),IF(Calc2!$C$17=Trucks!$D$43,VLOOKUP(Inputs!$F$62,Trucks!$D$163:$DB$165,CQ$13,FALSE),IF(Calc2!$C$17=Trucks!$D$46,VLOOKUP(Inputs!$F$62,Trucks!$D$166:$DB$167,CQ$13,FALSE), IF(Calc2!$C$17=Trucks!$D$48,VLOOKUP(Inputs!$F$62,Trucks!$D$168:$DB$169,CQ$13,FALSE)))))))))","v":0},{"$f":"IF(Calc2!$C$17=Trucks!$D$13,VLOOKUP(Inputs!$F$62,Trucks!$D$141:$DB$169,CR$13,FALSE), IF(Calc2!$C$17=Trucks!$D$14,VLOOKUP(Inputs!$F$62,Trucks!$D$143:$DB$150,CR$13,FALSE), IF(AND(Calc2!$C$17=Trucks!$D$29,Inputs!$F$8=Trucks!$B$151),VLOOKUP(Inputs!$F$62,Trucks!$D$151:$DB$154,CR$13,FALSE),IF(AND(Calc2!$C$17=Trucks!$D$34,Inputs!$F$8=Trucks!$B$155),VLOOKUP(Inputs!$F$62,Trucks!$D$155:$DB$159,CR$13,FALSE),IF(Calc2!$C$17=Trucks!$D$39,VLOOKUP(Inputs!$F$62,Trucks!$D$160:$DB$162,CR$13,FALSE),IF(Calc2!$C$17=Trucks!$D$43,VLOOKUP(Inputs!$F$62,Trucks!$D$163:$DB$165,CR$13,FALSE),IF(Calc2!$C$17=Trucks!$D$46,VLOOKUP(Inputs!$F$62,Trucks!$D$166:$DB$167,CR$13,FALSE), IF(Calc2!$C$17=Trucks!$D$48,VLOOKUP(Inputs!$F$62,Trucks!$D$168:$DB$169,CR$13,FALSE)))))))))","v":0},{"$f":"IF(Calc2!$C$17=Trucks!$D$13,VLOOKUP(Inputs!$F$62,Trucks!$D$141:$DB$169,CS$13,FALSE), IF(Calc2!$C$17=Trucks!$D$14,VLOOKUP(Inputs!$F$62,Trucks!$D$143:$DB$150,CS$13,FALSE), IF(AND(Calc2!$C$17=Trucks!$D$29,Inputs!$F$8=Trucks!$B$151),VLOOKUP(Inputs!$F$62,Trucks!$D$151:$DB$154,CS$13,FALSE),IF(AND(Calc2!$C$17=Trucks!$D$34,Inputs!$F$8=Trucks!$B$155),VLOOKUP(Inputs!$F$62,Trucks!$D$155:$DB$159,CS$13,FALSE),IF(Calc2!$C$17=Trucks!$D$39,VLOOKUP(Inputs!$F$62,Trucks!$D$160:$DB$162,CS$13,FALSE),IF(Calc2!$C$17=Trucks!$D$43,VLOOKUP(Inputs!$F$62,Trucks!$D$163:$DB$165,CS$13,FALSE),IF(Calc2!$C$17=Trucks!$D$46,VLOOKUP(Inputs!$F$62,Trucks!$D$166:$DB$167,CS$13,FALSE), IF(Calc2!$C$17=Trucks!$D$48,VLOOKUP(Inputs!$F$62,Trucks!$D$168:$DB$169,CS$13,FALSE)))))))))","v":0},{"$f":"IF(Calc2!$C$17=Trucks!$D$13,VLOOKUP(Inputs!$F$62,Trucks!$D$141:$DB$169,CT$13,FALSE), IF(Calc2!$C$17=Trucks!$D$14,VLOOKUP(Inputs!$F$62,Trucks!$D$143:$DB$150,CT$13,FALSE), IF(AND(Calc2!$C$17=Trucks!$D$29,Inputs!$F$8=Trucks!$B$151),VLOOKUP(Inputs!$F$62,Trucks!$D$151:$DB$154,CT$13,FALSE),IF(AND(Calc2!$C$17=Trucks!$D$34,Inputs!$F$8=Trucks!$B$155),VLOOKUP(Inputs!$F$62,Trucks!$D$155:$DB$159,CT$13,FALSE),IF(Calc2!$C$17=Trucks!$D$39,VLOOKUP(Inputs!$F$62,Trucks!$D$160:$DB$162,CT$13,FALSE),IF(Calc2!$C$17=Trucks!$D$43,VLOOKUP(Inputs!$F$62,Trucks!$D$163:$DB$165,CT$13,FALSE),IF(Calc2!$C$17=Trucks!$D$46,VLOOKUP(Inputs!$F$62,Trucks!$D$166:$DB$167,CT$13,FALSE), IF(Calc2!$C$17=Trucks!$D$48,VLOOKUP(Inputs!$F$62,Trucks!$D$168:$DB$169,CT$13,FALSE)))))))))","v":0},{"$f":"IF(Calc2!$C$17=Trucks!$D$13,VLOOKUP(Inputs!$F$62,Trucks!$D$141:$DB$169,CU$13,FALSE), IF(Calc2!$C$17=Trucks!$D$14,VLOOKUP(Inputs!$F$62,Trucks!$D$143:$DB$150,CU$13,FALSE), IF(AND(Calc2!$C$17=Trucks!$D$29,Inputs!$F$8=Trucks!$B$151),VLOOKUP(Inputs!$F$62,Trucks!$D$151:$DB$154,CU$13,FALSE),IF(AND(Calc2!$C$17=Trucks!$D$34,Inputs!$F$8=Trucks!$B$155),VLOOKUP(Inputs!$F$62,Trucks!$D$155:$DB$159,CU$13,FALSE),IF(Calc2!$C$17=Trucks!$D$39,VLOOKUP(Inputs!$F$62,Trucks!$D$160:$DB$162,CU$13,FALSE),IF(Calc2!$C$17=Trucks!$D$43,VLOOKUP(Inputs!$F$62,Trucks!$D$163:$DB$165,CU$13,FALSE),IF(Calc2!$C$17=Trucks!$D$46,VLOOKUP(Inputs!$F$62,Trucks!$D$166:$DB$167,CU$13,FALSE), IF(Calc2!$C$17=Trucks!$D$48,VLOOKUP(Inputs!$F$62,Trucks!$D$168:$DB$169,CU$13,FALSE)))))))))","v":0}]
[]
[null,"Hourly rate driver",{"$f":"IF(Inputs!F39=0,Variables!C10,Inputs!F39)","v":30}]
[]
[null,"Cost electricity",{"$f":"IF(Inputs!F40=0,Variables!C13,Inputs!F40)","v":0.12}]
[]
[null,"Water cost per litre",{"$f":"IF(Inputs!#REF!=0,Variables!C22,Inputs!#REF!)","v":{"$error":"#REF!"}}]
[]
[]
[]
[null,"Schedule"]
[]
[null,"Period start time","00:00:00","01:00:00","02:00:00","03:00:00","04:00:00","05:00:00","06:00:00","07:00:00","08:00:00","09:00:00","10:00:00","11:00:00","12:00:00","13:00:00","14:00:00","15:00:00","16:00:00","17:00:00","18:00:00","19:00:00","20:00:00","21:00:00","22:00:00","23:00:00"]
[]
[null,"start time","break times"]
[null,"00:00:00","No Break","00:30:00","01:00:00","01:30:00","02:00:00","02:30:00","03:00:00","03:30:00","04:00:00","04:30:00","05:00:00","05:30:00","06:00:00","06:30:00","07:00:00","07:30:00","08:00:00","08:30:00","09:00:00","09:30:00","10:00:00","10:30:00","11:00:00","11:30:00","12:00:00","12:30:00","13:00:00","13:30:00","14:00:00","14:30:00","15:00:00","15:30:00","16:00:00","16:30:00","17:00:00","17:30:00","18:00:00","18:30:00","19:00:00","19:30:00","20:00:00","20:30:00","21:00:00","21:30:00","22:00:00","22:30:00","23:00:00","23:30:00"]
[null,"01:00:00","No Break","01:30:00","02:00:00","02:30:00","03:00:00","03:30:00","04:00:00","04:30:00","05:00:00","05:30:00","06:00:00","06:30:00","07:00:00","07:30:00","08:00:00","08:30:00","09:00:00","09:30:00","10:00:00","10:30:00","11:00:00","11:30:00","12:00:00","12:30:00","13:00:00","13:30:00","14:00:00","14:30:00","15:00:00","15:30:00","16:00:00","16:30:00","17:00:00","17:30:00","18:00:00","18:30:00","19:00:00","19:30:00","20:00:00","20:30:00","21:00:00","21:30:00","22:00:00","22:30:00","23:00:00","23:30:00",1,1.0208333333333299]
[null,"02:00:00","No Break","02:30:00","03:00:00","03:30:00","04:00:00","04:30:00","05:00:00","05:30:00","06:00:00","06:30:00","07:00:00","07:30:00","08:00:00","08:30:00","09:00:00","09:30:00","10:00:00","10:30:00","11:00:00","11:30:00","12:00:00","12:30:00","13:00:00","13:30:00","14:00:00","14:30:00","15:00:00","15:30:00","16:00:00","16:30:00","17:00:00","17:30:00","18:00:00","18:30:00","19:00:00","19:30:00","20:00:00","20:30:00","21:00:00","21:30:00","22:00:00","22:30:00","23:00:00","23:30:00",1,1.0208333333333299,1.0416666666666701,1.0625]
[null,"03:00:00","No Break","03:30:00","04:00:00","04:30:00","05:00:00","05:30:00","06:00:00","06:30:00","07:00:00","07:30:00","08:00:00","08:30:00","09:00:00","09:30:00","10:00:00","10:30:00","11:00:00","11:30:00","12:00:00","12:30:00","13:00:00","13:30:00","14:00:00","14:30:00","15:00:00","15:30:00","16:00:00","16:30:00","17:00:00","17:30:00","18:00:00","18:30:00","19:00:00","19:30:00","20:00:00","20:30:00","21:00:00","21:30:00","22:00:00","22:30:00","23:00:00","23:30:00",1,1.0208333333333299,1.0416666666666701,1.0625,1.0833333333333299,1.1041666666666701]
[null,"04:00:00","No Break","04:30:00","05:00:00","05:30:00","06:00:00","06:30:00","07:00:00","07:30:00","08:00:00","08:30:00","09:00:00","09:30:00","10:00:00","10:30:00","11:00:00","11:30:00","12:00:00","12:30:00","13:00:00","13:30:00","14:00:00","14:30:00","15:00:00","15:30:00","16:00:00","16:30:00","17:00:00","17:30:00","18:00:00","18:30:00","19:00:00","19:30:00","20:00:00","20:30:00","21:00:00","21:30:00","22:00:00","22:30:00","23:00:00","23:30:00",1,1.0208333333333299,1.0416666666666701,1.0625,1.0833333333333299,1.1041666666666701,1.125,1.1458333333333299]
[null,"05:00:00","No Break","05:30:00","06:00:00","06:30:00","07:00:00","07:30:00","08:00:00","08:30:00","09:00:00","09:30:00","10:00:00","10:30:00","11:00:00","11:30:00","12:00:00","12:30:00","13:00:00","13:30:00","14:00:00","14:30:00","15:00:00","15:30:00","16:00:00","16:30:00","17:00:00","17:30:00","18:00:00","18:30:00","19:00:00","19:30:00","20:00:00","20:30:00","21:00:00","21:30:00","22:00:00","22:30:00","23:00:00","23:30:00",1,1.0208333333333333,1.0416666666666667,1.0625,1.0833333333333333,1.1041666666666667,1.125,1.1458333333333333,1.1666666666666667,1.1875]
[null,"06:00:00","No Break","06:30:00","07:00:00","07:30:00","08:00:00","08:30:00","09:00:00","09:30:00","10:00:00","10:30:00","11:00:00","11:30:00","12:00:00","12:30:00","13:00:00","13:30:00","14:00:00","14:30:00","15:00:00","15:30:00","16:00:00","16:30:00","17:00:00","17:30:00","18:00:00","18:30:00","19:00:00","19:30:00","20:00:00","20:30:00","21:00:00","21:30:00","22:00:00","22:30:00","23:00:00","23:30:00",1,1.0208333333333333,1.0416666666666667,1.0625,1.0833333333333333,1.1041666666666667,1.125,1.1458333333333333,1.1666666666666667,1.1875,1.2083333333333333,1.2291666666666667]
[null,"07:00:00","No Break","07:30:00","08:00:00","08:30:00","09:00:00","09:30:00","10:00:00","10:30:00","11:00:00","11:30:00","12:00:00","12:30:00","13:00:00","13:30:00","14:00:00","14:30:00","15:00:00","15:30:00","16:00:00","16:30:00","17:00:00","17:30:00","18:00:00","18:30:00","19:00:00","19:30:00","20:00:00","20:30:00","21:00:00","21:30:00","22:00:00","22:30:00","23:00:00","23:30:00",1,1.0208333333333333,1.0416666666666667,1.0625,1.0833333333333333,1.1041666666666667,1.125,1.1458333333333333,1.1666666666666667,1.1875,1.2083333333333333,1.2291666666666667,1.25,1.2708333333333333]
[null,"08:00:00","No Break","08:30:00","09:00:00","09:30:00","10:00:00","10:30:00","11:00:00","11:30:00","12:00:00","12:30:00","13:00:00","13:30:00","14:00:00","14:30:00","15:00:00","15:30:00","16:00:00","16:30:00","17:00:00","17:30:00","18:00:00","18:30:00","19:00:00","19:30:00","20:00:00","20:30:00","21:00:00","21:30:00","22:00:00","22:30:00","23:00:00","23:30:00",1,1.0208333333333333,1.0416666666666667,1.0625,1.0833333333333333,1.1041666666666667,1.125,1.1458333333333333,1.1666666666666667,1.1875,1.2083333333333333,1.2291666666666667,1.25,1.2708333333333333,1.2916666666666667,1.3125]
[null,"09:00:00","No Break","09:30:00","10:00:00","10:30:00","11:00:00","11:30:00","12:00:00","12:30:00","13:00:00","13:30:00","14:00:00","14:30:00","15:00:00","15:30:00","16:00:00","16:30:00","17:00:00","17:30:00","18:00:00","18:30:00","19:00:00","19:30:00","20:00:00","20:30:00","21:00:00","21:30:00","22:00:00","22:30:00","23:00:00","23:30:00",1,1.0208333333333333,1.0416666666666667,1.0625,1.0833333333333333,1.1041666666666667,1.125,1.1458333333333333,1.1666666666666667,1.1875,1.2083333333333333,1.2291666666666667,1.25,1.2708333333333333,1.2916666666666667,1.3125,1.3333333333333333,1.3541666666666667]
[null,"10:00:00","No Break","10:30:00","11:00:00","11:30:00","12:00:00","12:30:00","13:00:00","13:30:00","14:00:00","14:30:00","15:00:00","15:30:00","16:00:00","16:30:00","17:00:00","17:30:00","18:00:00","18:30:00","19:00:00","19:30:00","20:00:00","20:30:00","21:00:00","21:30:00","22:00:00","22:30:00","23:00:00","23:30:00",1,1.0208333333333299,1.0416666666666701,1.0625,1.0833333333333299,1.1041666666666701,1.125,1.1458333333333299,1.1666666666666701,1.1875,1.2083333333333299,1.2291666666666701,1.25,1.2708333333333299,1.2916666666666701,1.3125,1.3333333333333299,1.3541666666666701,1.375,1.3958333333333299]
[null,"11:00:00","No Break","11:30:00","12:00:00","12:30:00","13:00:00","13:30:00","14:00:00","14:30:00","15:00:00","15:30:00","16:00:00","16:30:00","17:00:00","17:30:00","18:00:00","18:30:00","19:00:00","19:30:00","20:00:00","20:30:00","21:00:00","21:30:00","22:00:00","22:30:00","23:00:00","23:30:00",1,1.0208333333333299,1.0416666666666701,1.0625,1.0833333333333299,1.1041666666666701,1.125,1.1458333333333299,1.1666666666666701,1.1875,1.2083333333333299,1.2291666666666701,1.25,1.2708333333333299,1.2916666666666701,1.3125,1.3333333333333299,1.3541666666666701,1.375,1.3958333333333299,1.4166666666666701,1.4375]
[null,"12:00:00","No Break","12:30:00","13:00:00","13:30:00","14:00:00","14:30:00","15:00:00","15:30:00","16:00:00","16:30:00","17:00:00","17:30:00","18:00:00","18:30:00","19:00:00","19:30:00","20:00:00","20:30:00","21:00:00","21:30:00","22:00:00","22:30:00","23:00:00","23:30:00",0.999999999999999,1.0208333333333299,1.0416666666666701,1.0625,1.0833333333333299,1.1041666666666701,1.125,1.1458333333333299,1.1666666666666701,1.1875,1.2083333333333299,1.2291666666666701,1.25,1.2708333333333299,1.2916666666666701,1.3125,1.3333333333333299,1.3541666666666701,1.375,1.3958333333333299,1.4166666666666701,1.4375,1.4583333333333299,1.4791666666666701]
[null,"13:00:00","No Break","13:30:00","14:00:00","14:30:00","15:00:00","15:30:00","16:00:00","16:30:00","17:00:00","17:30:00","18:00:00","18:30:00","19:00:00","19:30:00","20:00:00","20:30:00","21:00:00","21:30:00","22:00:00","22:30:00","23:00:00","23:30:00",1,1.0208333333333299,1.0416666666666701,1.0625,1.0833333333333299,1.1041666666666701,1.125,1.1458333333333299,1.1666666666666701,1.1875,1.2083333333333299,1.2291666666666701,1.25,1.2708333333333299,1.2916666666666701,1.3125,1.3333333333333299,1.3541666666666701,1.375,1.3958333333333299,1.4166666666666701,1.4375,1.4583333333333299,1.4791666666666701,1.5,1.5208333333333299]
[null,"14:00:00","No Break","14:30:00","15:00:00","15:30:00","16:00:00","16:30:00","17:00:00","17:30:00","18:00:00","18:30:00","19:00:00","19:30:00","20:00:00","20:30:00","21:00:00","21:30:00","22:00:00","22:30:00","23:00:00","23:30:00",1,1.0208333333333299,1.0416666666666701,1.0625,1.0833333333333299,1.1041666666666701,1.125,1.1458333333333299,1.1666666666666701,1.1875,1.2083333333333299,1.2291666666666701,1.25,1.2708333333333299,1.2916666666666701,1.3125,1.3333333333333299,1.3541666666666701,1.375,1.3958333333333299,1.4166666666666701,1.4375,1.4583333333333299,1.4791666666666701,1.5,1.5208333333333299,1.5416666666666701,1.5625]
[null,"15:00:00","No Break","15:30:00","16:00:00","16:30:00","17:00:00","17:30:00","18:00:00","18:30:00","19:00:00","19:30:00","20:00:00","20:30:00","21:00:00","21:30:00","22:00:00","22:30:00","23:00:00","23:30:00",0.999999999999999,1.0208333333333299,1.0416666666666701,1.0625,1.0833333333333299,1.1041666666666701,1.125,1.1458333333333299,1.1666666666666701,1.1875,1.2083333333333299,1.2291666666666701,1.25,1.2708333333333299,1.2916666666666701,1.3125,1.3333333333333299,1.3541666666666701,1.375,1.3958333333333299,1.4166666666666701,1.4375,1.4583333333333299,1.4791666666666701,1.5,1.5208333333333299,1.5416666666666701,1.5625,1.5833333333333299,1.6041666666666701]
[null,"16:00:00","No Break","16:30:00","17:00:00","17:30:00","18:00:00","18:30:00","19:00:00","19:30:00","20:00:00","20:30:00","21:00:00","21:30:00","22:00:00","22:30:00","23:00:00","23:30:00",1,1.0208333333333299,1.0416666666666701,1.0625,1.0833333333333299,1.1041666666666701,1.125,1.1458333333333299,1.1666666666666701,1.1875,1.2083333333333299,1.2291666666666701,1.25,1.2708333333333299,1.2916666666666701,1.3125,1.3333333333333299,1.3541666666666701,1.375,1.3958333333333299,1.4166666666666701,1.4375,1.4583333333333299,1.4791666666666701,1.5,1.5208333333333299,1.5416666666666701,1.5625,1.5833333333333299,1.6041666666666701,1.625,1.6458333333333299]
[null,"17:00:00","No Break","17:30:00","18:00:00","18:30:00","19:00:00","19:30:00","20:00:00","20:30:00","21:00:00","21:30:00","22:00:00","22:30:00","23:00:00","23:30:00",1,1.0208333333333299,1.0416666666666701,1.0625,1.0833333333333299,1.1041666666666701,1.125,1.1458333333333299,1.1666666666666701,1.1875,1.2083333333333299,1.2291666666666701,1.25,1.2708333333333299,1.2916666666666701,1.3125,1.3333333333333299,1.3541666666666701,1.375,1.3958333333333299,1.4166666666666701,1.4375,1.4583333333333299,1.4791666666666701,1.5,1.5208333333333299,1.5416666666666601,1.5625,1.5833333333333299,1.6041666666666601,1.625,1.6458333333333299,1.6666666666666601,1.6875]
[null,"18:00:00","No Break","18:30:00","19:00:00","19:30:00","20:00:00","20:30:00","21:00:00","21:30:00","22:00:00","22:30:00","23:00:00","23:30:00",1,1.0208333333333299,1.0416666666666701,1.0625,1.0833333333333299,1.1041666666666701,1.125,1.1458333333333299,1.1666666666666701,1.1875,1.2083333333333299,1.2291666666666701,1.25,1.2708333333333299,1.2916666666666701,1.3125,1.3333333333333299,1.3541666666666701,1.375,1.3958333333333299,1.4166666666666701,1.4375,1.4583333333333299,1.4791666666666701,1.5,1.5208333333333299,1.5416666666666701,1.5625,1.5833333333333299,1.6041666666666701,1.625,1.6458333333333299,1.6666666666666701,1.6875,1.7083333333333299,1.7291666666666701]
[null,"19:00:00","No Break","19:30:00","20:00:00","20:30:00","21:00:00","21:30:00","22:00:00","22:30:00","23:00:00","23:30:00",1,1.0208333333333299,1.0416666666666701,1.0625,1.0833333333333299,1.1041666666666701,1.125,1.1458333333333299,1.1666666666666701,1.1875,1.2083333333333299,1.2291666666666701,1.25,1.2708333333333299,1.2916666666666701,1.3125,1.3333333333333299,1.3541666666666701,1.375,1.3958333333333299,1.4166666666666701,1.4375,1.4583333333333299,1.4791666666666701,1.5,1.5208333333333299,1.5416666666666701,1.5625,1.5833333333333299,1.6041666666666701,1.625,1.6458333333333299,1.6666666666666701,1.6875,1.7083333333333299,1.7291666666666701,1.75,1.7708333333333299]
[null,"20:00:00","No Break","20:30:00","21:00:00","21:30:00","22:00:00","22:30:00","23:00:00","23:30:00",1,1.0208333333333299,1.0416666666666701,1.0625,1.0833333333333299,1.1041666666666701,1.125,1.1458333333333299,1.1666666666666701,1.1875,1.2083333333333299,1.2291666666666701,1.25,1.2708333333333299,1.2916666666666701,1.3125,1.3333333333333299,1.3541666666666701,1.375,1.3958333333333299,1.4166666666666701,1.4375,1.4583333333333299,1.4791666666666701,1.5,1.5208333333333299,1.5416666666666701,1.5625,1.5833333333333299,1.6041666666666701,1.625,1.6458333333333299,1.6666666666666601,1.6875,1.7083333333333299,1.7291666666666601,1.75,1.7708333333333299,1.7916666666666601,1.8125]
[null,"21:00:00","No Break","21:30:00","22:00:00","22:30:00","23:00:00","23:30:00",1,1.0208333333333299,1.0416666666666701,1.0625,1.0833333333333299,1.1041666666666701,1.125,1.1458333333333299,1.1666666666666701,1.1875,1.2083333333333299,1.2291666666666701,1.25,1.2708333333333299,1.2916666666666701,1.3125,1.3333333333333299,1.3541666666666701,1.375,1.3958333333333299,1.4166666666666701,1.4375,1.4583333333333299,1.4791666666666701,1.5,1.5208333333333299,1.5416666666666701,1.5625,1.5833333333333299,1.6041666666666701,1.625,1.6458333333333299,1.6666666666666701,1.6875,1.7083333333333299,1.7291666666666701,1.75,1.7708333333333299,1.7916666666666701,1.8125,1.8333333333333299,1.8541666666666701]
[null,"22:00:00","No Break","22:30:00","23:00:00","23:30:00",1,1.0208333333333299,1.0416666666666701,1.0625,1.0833333333333299,1.1041666666666701,1.125,1.1458333333333299,1.1666666666666701,1.1875,1.2083333333333299,1.2291666666666701,1.25,1.2708333333333299,1.2916666666666701,1.3125,1.3333333333333299,1.3541666666666701,1.375,1.3958333333333299,1.4166666666666701,1.4375,1.4583333333333299,1.4791666666666701,1.5,1.5208333333333299,1.5416666666666701,1.5625,1.5833333333333299,1.6041666666666701,1.625,1.6458333333333299,1.6666666666666701,1.6875,1.7083333333333399,1.7291666666666701,1.75,1.7708333333333399,1.7916666666666701,1.8125,1.8333333333333399,1.8541666666666701,1.875,1.8958333333333399]
[null,"23:00:00","No Break","23:30:00",1,1.0208333333333299,1.0416666666666701,1.0625,1.0833333333333299,1.1041666666666701,1.125,1.1458333333333299,1.1666666666666701,1.1875,1.2083333333333299,1.2291666666666701,1.25,1.2708333333333299,1.2916666666666701,1.3125,1.3333333333333299,1.3541666666666701,1.375,1.3958333333333299,1.4166666666666701,1.4375,1.4583333333333299,1.4791666666666701,1.5,1.5208333333333299,1.5416666666666701,1.5625,1.5833333333333299,1.6041666666666701,1.625,1.6458333333333299,1.6666666666666701,1.6875,1.7083333333333299,1.7291666666666701,1.75,1.7708333333333299,1.7916666666666601,1.8125,1.8333333333333299,1.8541666666666601,1.875,1.8958333333333299,1.9166666666666601,1.9375]
[]
[null,"start time","break times"]
[null,{"$f":"Inputs!F15","v":"00:00:00"},{"$f":"VLOOKUP($B$72,$B$46:$AX$69,B$13,FALSE)","v":"No Break"},{"$f":"VLOOKUP($B$72,$B$45:$AX$69,C$13,FALSE)","v":"00:30:00"},"01:00:00","01:30:00","02:00:00","02:30:00","03:00:00","03:30:00","04:00:00","04:30:00","05:00:00","05:30:00","06:00:00","06:30:00","07:00:00","07:30:00","08:00:00","08:30:00","09:00:00","09:30:00","10:00:00","10:30:00","11:00:00","11:30:00","12:00:00","12:30:00","13:00:00","13:30:00","14:00:00","14:30:00","15:00:00","15:30:00","16:00:00","16:30:00","17:00:00","17:30:00","18:00:00","18:30:00","19:00:00","19:30:00","20:00:00","20:30:00","21:00:00","21:30:00","22:00:00","22:30:00","23:00:00","23:30:00"]
[]
[null,"Break duration (mins)",0,5,10,15,20,30,40,45,60,90,120]
[]
[null,"End Time",{"$f":"B72+1/24","v":"01:00:00"},{"$f":"C76+1/24","v":"02:00:00"},{"$f":"D76+1/24","v":"03:00:00"},"04:00:00","05:00:00","06:00:00","07:00:00","08:00:00","09:00:00","10:00:00","11:00:00","12:00:00","13:00:00","14:00:00","15:00:00","16:00:00","17:00:00","18:00:00","19:00:00","20:00:00","21:00:00","22:00:00","23:00:00",0.99999999999999956]
[]
[null,"days per week","Select",5,6,7]
[]
[null,"Lead acid"]
[]
[null,"maximum DOD (%)",80]
[null,"Water topup time suggested on inputs page only default (mins)",20]
[null,"Charger factor (new, flooded)",1]
[null,"Charger efficiency",{"$f":"HLOOKUP(Inputs!F46,Variables!C24:E25,2,FALSE)","v":0}]
[]
[null,"Battery attendant employed","Select","Yes","No"]
[]
[null,"number of life cycles",1200]
[]
[null,"existing facility?","Select","Yes","No"]
[]
[]
[null,"Lithium ion"]
[]
[null,"Cost of battery",{"$f":"Inputs!F67","v":0}]
[]
[null,"Available energy of battery (%) -range of Nominal capacity that appears as 0-100% on truck BDI -  usually 13-93% nominal =80%",{"$f":"VLOOKUP(Inputs!F10,Trucks!B100:D137,3,FALSE)","v":0}]
[null,"max DOD of useable capacity (%)",{"$f":"100-VLOOKUP(Inputs!F10,Trucks!B100:L137,4,FALSE)","v":100}]
[null,"Useable energy as % of Nominal ",{"$f":"C98*C99/100","v":0}]
[]
[null,"Battery resale price",{"$f":"Variables!C63/100*Calc2!C96","v":0}]
[]
[null,"Charger voltage",{"$f":"VLOOKUP(Calc2!C17,Variables!B81:D88,3,FALSE)","v":"Select"}]
[]
[null,null,"TRUCKS"]
[]
[null,"down position of last match",{"$f":"COUNTIF(C113:C303,1)","v":1},{"$f":"COUNTIF(D113:D303,1)","v":12},6,8,0,0,0,0,0,0,0,0,0,0,0,0,0,0,0,0,0,0,0,0,0,0]
[null,"Right position of truck",{"$f":"MATCH(Inputs!$F$8,Calc2!$C$112:$AB$112,0)","v":1}]
[null,"rows down #1",{"$f":"OFFSET(B112,1,C109)","v":1}]
[null,"rows down #last",{"$f":"OFFSET(B108,0,C109)","v":1}]
[null,"truck",{"$f":"OFFSET(Trucks!$B$182,B13,0,1,1)","v":"Select"},{"$f":"OFFSET(Trucks!$B$182,C13,0,1,1)","v":"WH Pedestrian"},{"$f":"OFFSET(Trucks!$B$182,D13,0,1,1)","v":"WH Rider"},{"$f":"OFFSET(Trucks!$B$182,E13,0,1,1)","v":"Counterbalance"},{"$f":"OFFSET(Trucks!$B$182,F13,0,1,1)","v":0},{"$f":"OFFSET(Trucks!$B$182,G13,0,1,1)","v":0},{"$f":"OFFSET(Trucks!$B$182,H13,0,1,1)","v":0},{"$f":"OFFSET(Trucks!$B$182,I13,0,1,1)","v":0},{"$f":"OFFSET(Trucks!$B$182,J13,0,1,1)","v":0},{"$f":"OFFSET(Trucks!$B$182,K13,0,1,1)","v":0},{"$f":"OFFSET(Trucks!$B$182,L13,0,1,1)","v":0},{"$f":"OFFSET(Trucks!$B$182,M13,0,1,1)","v":0},{"$f":"OFFSET(Trucks!$B$182,N13,0,1,1)","v":0},{"$f":"OFFSET(Trucks!$B$182,O13,0,1,1)","v":0},{"$f":"OFFSET(Trucks!$B$182,P13,0,1,1)","v":0},{"$f":"OFFSET(Trucks!$B$182,Q13,0,1,1)","v":0},{"$f":"OFFSET(Trucks!$B$182,R13,0,1,1)","v":0},{"$f":"OFFSET(Trucks!$B$182,S13,0,1,1)","v":0},{"$f":"OFFSET(Trucks!$B$182,T13,0,1,1)","v":0},{"$f":"OFFSET(Trucks!$B$182,U13,0,1,1)","v":0},{"$f":"OFFSET(Trucks!$B$182,V13,0,1,1)","v":0},{"$f":"OFFSET(Trucks!$B$182,W13,0,1,1)","v":0},{"$f":"OFFSET(Trucks!$B$182,X13,0,1,1)","v":0},{"$f":"OFFSET(Trucks!$B$182,Y13,0,1,1)","v":0},{"$f":"OFFSET(Trucks!$B$182,Z13,0,1,1)","v":0},{"$f":"OFFSET(Trucks!$B$182,AA13,0,1,1)","v":0}]
[null,"first position of match",{"$f":"MATCH(Calc2!C$112,Trucks!$B13:$B$49,0)","v":1},{"$f":"MATCH(Calc2!D$112,Trucks!$B13:$B$49,0)","v":2},{"$f":"MATCH(Calc2!E$112,Trucks!$B13:$B$49,0)","v":15},{"$f":"MATCH(Calc2!F$112,Trucks!$B13:$B$49,0)","v":22},{"$f":"MATCH(Calc2!G$112,Trucks!$B13:$B$49,0)","v":{"$error":"#N/A"}},{"$f":"MATCH(Calc2!H$112,Trucks!$B13:$B$49,0)","v":{"$error":"#N/A"}},{"$f":"MATCH(Calc2!I$112,Trucks!$B13:$B$49,0)","v":{"$error":"#N/A"}},{"$f":"MATCH(Calc2!J$112,Trucks!$B13:$B$49,0)","v":{"$error":"#N/A"}},{"$f":"MATCH(Calc2!K$112,Trucks!$B13:$B$49,0)","v":{"$error":"#N/A"}},{"$f":"MATCH(Calc2!L$112,Trucks!$B13:$B$49,0)","v":{"$error":"#N/A"}},{"$f":"MATCH(Calc2!M$112,Trucks!$B13:$B$49,0)","v":{"$error":"#N/A"}},{"$f":"MATCH(Calc2!N$112,Trucks!$B13:$B$49,0)","v":{"$error":"#N/A"}},{"$f":"MATCH(Calc2!O$112,Trucks!$B13:$B$49,0)","v":{"$error":"#N/A"}},{"$f":"MATCH(Calc2!P$112,Trucks!$B13:$B$49,0)","v":{"$error":"#N/A"}},{"$f":"MATCH(Calc2!Q$112,Trucks!$B13:$B$49,0)","v":{"$error":"#N/A"}},{"$f":"MATCH(Calc2!R$112,Trucks!$B13:$B$49,0)","v":{"$error":"#N/A"}},{"$f":"MATCH(Calc2!S$112,Trucks!$B13:$B$49,0)","v":{"$error":"#N/A"}},{"$f":"MATCH(Calc2!T$112,Trucks!$B13:$B$49,0)","v":{"$error":"#N/A"}},{"$f":"MATCH(Calc2!U$112,Trucks!$B13:$B$49,0)","v":{"$error":"#N/A"}},{"$f":"MATCH(Calc2!V$112,Trucks!$B13:$B$49,0)","v":{"$error":"#N/A"}},{"$f":"MATCH(Calc2!W$112,Trucks!$B13:$B$49,0)","v":{"$error":"#N/A"}},{"$f":"MATCH(Calc2!X$112,Trucks!$B13:$B$49,0)","v":{"$error":"#N/A"}},{"$f":"MATCH(Calc2!Y$112,Trucks!$B13:$B$49,0)","v":{"$error":"#N/A"}},{"$f":"MATCH(Calc2!Z$112,Trucks!$B13:$B$49,0)","v":{"$error":"#N/A"}},{"$f":"MATCH(Calc2!AA$112,Trucks!$B13:$B$49,0)","v":{"$error":"#N/A"}},{"$f":"MATCH(Calc2!AB$112,Trucks!$B13:$B$49,0)","v":{"$error":"#N/A"}}]
[null,"match if=1",{"$f":"MATCH(Calc2!C$112,Trucks!$B14:$B$49,0)","v":{"$error":"#N/A"}},{"$f":"MATCH(Calc2!D$112,Trucks!$B14:$B$49,0)","v":1},{"$f":"MATCH(Calc2!E$112,Trucks!$B14:$B$49,0)","v":14},{"$f":"MATCH(Calc2!F$112,Trucks!$B14:$B$49,0)","v":21},{"$f":"MATCH(Calc2!G$112,Trucks!$B14:$B$49,0)","v":{"$error":"#N/A"}},{"$f":"MATCH(Calc2!H$112,Trucks!$B14:$B$49,0)","v":{"$error":"#N/A"}},{"$f":"MATCH(Calc2!I$112,Trucks!$B14:$B$49,0)","v":{"$error":"#N/A"}},{"$f":"MATCH(Calc2!J$112,Trucks!$B14:$B$49,0)","v":{"$error":"#N/A"}},{"$f":"MATCH(Calc2!K$112,Trucks!$B14:$B$49,0)","v":{"$error":"#N/A"}},{"$f":"MATCH(Calc2!L$112,Trucks!$B14:$B$49,0)","v":{"$error":"#N/A"}},{"$f":"MATCH(Calc2!M$112,Trucks!$B14:$B$49,0)","v":{"$error":"#N/A"}},{"$f":"MATCH(Calc2!N$112,Trucks!$B14:$B$49,0)","v":{"$error":"#N/A"}},{"$f":"MATCH(Calc2!O$112,Trucks!$B14:$B$49,0)","v":{"$error":"#N/A"}},{"$f":"MATCH(Calc2!P$112,Trucks!$B14:$B$49,0)","v":{"$error":"#N/A"}},{"$f":"MATCH(Calc2!Q$112,Trucks!$B14:$B$49,0)","v":{"$error":"#N/A"}},{"$f":"MATCH(Calc2!R$112,Trucks!$B14:$B$49,0)","v":{"$error":"#N/A"}},{"$f":"MATCH(Calc2!S$112,Trucks!$B14:$B$49,0)","v":{"$error":"#N/A"}},{"$f":"MATCH(Calc2!T$112,Trucks!$B14:$B$49,0)","v":{"$error":"#N/A"}},{"$f":"MATCH(Calc2!U$112,Trucks!$B14:$B$49,0)","v":{"$error":"#N/A"}},{"$f":"MATCH(Calc2!V$112,Trucks!$B14:$B$49,0)","v":{"$error":"#N/A"}},{"$f":"MATCH(Calc2!W$112,Trucks!$B14:$B$49,0)","v":{"$error":"#N/A"}},{"$f":"MATCH(Calc2!X$112,Trucks!$B14:$B$49,0)","v":{"$error":"#N/A"}},{"$f":"MATCH(Calc2!Y$112,Trucks!$B14:$B$49,0)","v":{"$error":"#N/A"}},{"$f":"MATCH(Calc2!Z$112,Trucks!$B14:$B$49,0)","v":{"$error":"#N/A"}},{"$f":"MATCH(Calc2!AA$112,Trucks!$B14:$B$49,0)","v":{"$error":"#N/A"}},{"$f":"MATCH(Calc2!AB$112,Trucks!$B14:$B$49,0)","v":{"$error":"#N/A"}}]
[null,null,{"$f":"MATCH(Calc2!C$112,Trucks!$B15:$B$49,0)","v":{"$error":"#N/A"}},{"$f":"MATCH(Calc2!D$112,Trucks!$B15:$B$49,0)","v":1},{"$f":"MATCH(Calc2!E$112,Trucks!$B15:$B$49,0)","v":13},{"$f":"MATCH(Calc2!F$112,Trucks!$B15:$B$49,0)","v":20},{"$f":"MATCH(Calc2!G$112,Trucks!$B15:$B$49,0)","v":{"$error":"#N/A"}},{"$f":"MATCH(Calc2!H$112,Trucks!$B15:$B$49,0)","v":{"$error":"#N/A"}},{"$f":"MATCH(Calc2!I$112,Trucks!$B15:$B$49,0)","v":{"$error":"#N/A"}},{"$f":"MATCH(Calc2!J$112,Trucks!$B15:$B$49,0)","v":{"$error":"#N/A"}},{"$f":"MATCH(Calc2!K$112,Trucks!$B15:$B$49,0)","v":{"$error":"#N/A"}},{"$f":"MATCH(Calc2!L$112,Trucks!$B15:$B$49,0)","v":{"$error":"#N/A"}},{"$f":"MATCH(Calc2!M$112,Trucks!$B15:$B$49,0)","v":{"$error":"#N/A"}},{"$f":"MATCH(Calc2!N$112,Trucks!$B15:$B$49,0)","v":{"$error":"#N/A"}},{"$f":"MATCH(Calc2!O$112,Trucks!$B15:$B$49,0)","v":{"$error":"#N/A"}},{"$f":"MATCH(Calc2!P$112,Trucks!$B15:$B$49,0)","v":{"$error":"#N/A"}},{"$f":"MATCH(Calc2!Q$112,Trucks!$B15:$B$49,0)","v":{"$error":"#N/A"}},{"$f":"MATCH(Calc2!R$112,Trucks!$B15:$B$49,0)","v":{"$error":"#N/A"}},{"$f":"MATCH(Calc2!S$112,Trucks!$B15:$B$49,0)","v":{"$error":"#N/A"}},{"$f":"MATCH(Calc2!T$112,Trucks!$B15:$B$49,0)","v":{"$error":"#N/A"}},{"$f":"MATCH(Calc2!U$112,Trucks!$B15:$B$49,0)","v":{"$error":"#N/A"}},{"$f":"MATCH(Calc2!V$112,Trucks!$B15:$B$49,0)","v":{"$error":"#N/A"}},{"$f":"MATCH(Calc2!W$112,Trucks!$B15:$B$49,0)","v":{"$error":"#N/A"}},{"$f":"MATCH(Calc2!X$112,Trucks!$B15:$B$49,0)","v":{"$error":"#N/A"}},{"$f":"MATCH(Calc2!Y$112,Trucks!$B15:$B$49,0)","v":{"$error":"#N/A"}},{"$f":"MATCH(Calc2!Z$112,Trucks!$B15:$B$49,0)","v":{"$error":"#N/A"}},{"$f":"MATCH(Calc2!AA$112,Trucks!$B15:$B$49,0)","v":{"$error":"#N/A"}},{"$f":"MATCH(Calc2!AB$112,Trucks!$B15:$B$49,0)","v":{"$error":"#N/A"}}]
[null,null,{"$f":"MATCH(Calc2!C$112,Trucks!$B16:$B$49,0)","v":{"$error":"#N/A"}},{"$f":"MATCH(Calc2!D$112,Trucks!$B16:$B$49,0)","v":1},{"$f":"MATCH(Calc2!E$112,Trucks!$B16:$B$49,0)","v":12},{"$f":"MATCH(Calc2!F$112,Trucks!$B16:$B$49,0)","v":19},{"$f":"MATCH(Calc2!G$112,Trucks!$B16:$B$49,0)","v":{"$error":"#N/A"}},{"$f":"MATCH(Calc2!H$112,Trucks!$B16:$B$49,0)","v":{"$error":"#N/A"}},{"$f":"MATCH(Calc2!I$112,Trucks!$B16:$B$49,0)","v":{"$error":"#N/A"}},{"$f":"MATCH(Calc2!J$112,Trucks!$B16:$B$49,0)","v":{"$error":"#N/A"}},{"$f":"MATCH(Calc2!K$112,Trucks!$B16:$B$49,0)","v":{"$error":"#N/A"}},{"$f":"MATCH(Calc2!L$112,Trucks!$B16:$B$49,0)","v":{"$error":"#N/A"}},{"$f":"MATCH(Calc2!M$112,Trucks!$B16:$B$49,0)","v":{"$error":"#N/A"}},{"$f":"MATCH(Calc2!N$112,Trucks!$B16:$B$49,0)","v":{"$error":"#N/A"}},{"$f":"MATCH(Calc2!O$112,Trucks!$B16:$B$49,0)","v":{"$error":"#N/A"}},{"$f":"MATCH(Calc2!P$112,Trucks!$B16:$B$49,0)","v":{"$error":"#N/A"}},{"$f":"MATCH(Calc2!Q$112,Trucks!$B16:$B$49,0)","v":{"$error":"#N/A"}},{"$f":"MATCH(Calc2!R$112,Trucks!$B16:$B$49,0)","v":{"$error":"#N/A"}},{"$f":"MATCH(Calc2!S$112,Trucks!$B16:$B$49,0)","v":{"$error":"#N/A"}},{"$f":"MATCH(Calc2!T$112,Trucks!$B16:$B$49,0)","v":{"$error":"#N/A"}},{"$f":"MATCH(Calc2!U$112,Trucks!$B16:$B$49,0)","v":{"$error":"#N/A"}},{"$f":"MATCH(Calc2!V$112,Trucks!$B16:$B$49,0)","v":{"$error":"#N/A"}},{"$f":"MATCH(Calc2!W$112,Trucks!$B16:$B$49,0)","v":{"$error":"#N/A"}},{"$f":"MATCH(Calc2!X$112,Trucks!$B16:$B$49,0)","v":{"$error":"#N/A"}},{"$f":"MATCH(Calc2!Y$112,Trucks!$B16:$B$49,0)","v":{"$error":"#N/A"}},{"$f":"MATCH(Calc2!Z$112,Trucks!$B16:$B$49,0)","v":{"$error":"#N/A"}},{"$f":"MATCH(Calc2!AA$112,Trucks!$B16:$B$49,0)","v":{"$error":"#N/A"}},{"$f":"MATCH(Calc2!AB$112,Trucks!$B16:$B$49,0)","v":{"$error":"#N/A"}}]
[null,null,{"$f":"MATCH(Calc2!C$112,Trucks!$B17:$B$49,0)","v":{"$error":"#N/A"}},{"$f":"MATCH(Calc2!D$112,Trucks!$B17:$B$49,0)","v":1},{"$f":"MATCH(Calc2!E$112,Trucks!$B17:$B$49,0)","v":11},{"$f":"MATCH(Calc2!F$112,Trucks!$B17:$B$49,0)","v":18},{"$f":"MATCH(Calc2!G$112,Trucks!$B17:$B$49,0)","v":{"$error":"#N/A"}},{"$f":"MATCH(Calc2!H$112,Trucks!$B17:$B$49,0)","v":{"$error":"#N/A"}},{"$f":"MATCH(Calc2!I$112,Trucks!$B17:$B$49,0)","v":{"$error":"#N/A"}},{"$f":"MATCH(Calc2!J$112,Trucks!$B17:$B$49,0)","v":{"$error":"#N/A"}},{"$f":"MATCH(Calc2!K$112,Trucks!$B17:$B$49,0)","v":{"$error":"#N/A"}},{"$f":"MATCH(Calc2!L$112,Trucks!$B17:$B$49,0)","v":{"$error":"#N/A"}},{"$f":"MATCH(Calc2!M$112,Trucks!$B17:$B$49,0)","v":{"$error":"#N/A"}},{"$f":"MATCH(Calc2!N$112,Trucks!$B17:$B$49,0)","v":{"$error":"#N/A"}},{"$f":"MATCH(Calc2!O$112,Trucks!$B17:$B$49,0)","v":{"$error":"#N/A"}},{"$f":"MATCH(Calc2!P$112,Trucks!$B17:$B$49,0)","v":{"$error":"#N/A"}},{"$f":"MATCH(Calc2!Q$112,Trucks!$B17:$B$49,0)","v":{"$error":"#N/A"}},{"$f":"MATCH(Calc2!R$112,Trucks!$B17:$B$49,0)","v":{"$error":"#N/A"}},{"$f":"MATCH(Calc2!S$112,Trucks!$B17:$B$49,0)","v":{"$error":"#N/A"}},{"$f":"MATCH(Calc2!T$112,Trucks!$B17:$B$49,0)","v":{"$error":"#N/A"}},{"$f":"MATCH(Calc2!U$112,Trucks!$B17:$B$49,0)","v":{"$error":"#N/A"}},{"$f":"MATCH(Calc2!V$112,Trucks!$B17:$B$49,0)","v":{"$error":"#N/A"}},{"$f":"MATCH(Calc2!W$112,Trucks!$B17:$B$49,0)","v":{"$error":"#N/A"}},{"$f":"MATCH(Calc2!X$112,Trucks!$B17:$B$49,0)","v":{"$error":"#N/A"}},{"$f":"MATCH(Calc2!Y$112,Trucks!$B17:$B$49,0)","v":{"$error":"#N/A"}},{"$f":"MATCH(Calc2!Z$112,Trucks!$B17:$B$49,0)","v":{"$error":"#N/A"}},{"$f":"MATCH(Calc2!AA$112,Trucks!$B17:$B$49,0)","v":{"$error":"#N/A"}},{"$f":"MATCH(Calc2!AB$112,Trucks!$B17:$B$49,0)","v":{"$error":"#N/A"}}]
[null,null,{"$f":"MATCH(Calc2!C$112,Trucks!$B18:$B$49,0)","v":{"$error":"#N/A"}},{"$f":"MATCH(Calc2!D$112,Trucks!$B18:$B$49,0)","v":1},{"$f":"MATCH(Calc2!E$112,Trucks!$B18:$B$49,0)","v":10},{"$f":"MATCH(Calc2!F$112,Trucks!$B18:$B$49,0)","v":17},{"$f":"MATCH(Calc2!G$112,Trucks!$B18:$B$49,0)","v":{"$error":"#N/A"}},{"$f":"MATCH(Calc2!H$112,Trucks!$B18:$B$49,0)","v":{"$error":"#N/A"}},{"$f":"MATCH(Calc2!I$112,Trucks!$B18:$B$49,0)","v":{"$error":"#N/A"}},{"$f":"MATCH(Calc2!J$112,Trucks!$B18:$B$49,0)","v":{"$error":"#N/A"}},{"$f":"MATCH(Calc2!K$112,Trucks!$B18:$B$49,0)","v":{"$error":"#N/A"}},{"$f":"MATCH(Calc2!L$112,Trucks!$B18:$B$49,0)","v":{"$error":"#N/A"}},{"$f":"MATCH(Calc2!M$112,Trucks!$B18:$B$49,0)","v":{"$error":"#N/A"}},{"$f":"MATCH(Calc2!N$112,Trucks!$B18:$B$49,0)","v":{"$error":"#N/A"}},{"$f":"MATCH(Calc2!O$112,Trucks!$B18:$B$49,0)","v":{"$error":"#N/A"}},{"$f":"MATCH(Calc2!P$112,Trucks!$B18:$B$49,0)","v":{"$error":"#N/A"}},{"$f":"MATCH(Calc2!Q$112,Trucks!$B18:$B$49,0)","v":{"$error":"#N/A"}},{"$f":"MATCH(Calc2!R$112,Trucks!$B18:$B$49,0)","v":{"$error":"#N/A"}},{"$f":"MATCH(Calc2!S$112,Trucks!$B18:$B$49,0)","v":{"$error":"#N/A"}},{"$f":"MATCH(Calc2!T$112,Trucks!$B18:$B$49,0)","v":{"$error":"#N/A"}},{"$f":"MATCH(Calc2!U$112,Trucks!$B18:$B$49,0)","v":{"$error":"#N/A"}},{"$f":"MATCH(Calc2!V$112,Trucks!$B18:$B$49,0)","v":{"$error":"#N/A"}},{"$f":"MATCH(Calc2!W$112,Trucks!$B18:$B$49,0)","v":{"$error":"#N/A"}},{"$f":"MATCH(Calc2!X$112,Trucks!$B18:$B$49,0)","v":{"$error":"#N/A"}},{"$f":"MATCH(Calc2!Y$112,Trucks!$B18:$B$49,0)","v":{"$error":"#N/A"}},{"$f":"MATCH(Calc2!Z$112,Trucks!$B18:$B$49,0)","v":{"$error":"#N/A"}},{"$f":"MATCH(Calc2!AA$112,Trucks!$B18:$B$49,0)","v":{"$error":"#N/A"}},{"$f":"MATCH(Calc2!AB$112,Trucks!$B18:$B$49,0)","v":{"$error":"#N/A"}}]
[null,null,{"$f":"MATCH(Calc2!C$112,Trucks!$B19:$B$49,0)","v":{"$error":"#N/A"}},{"$f":"MATCH(Calc2!D$112,Trucks!$B19:$B$49,0)","v":1},{"$f":"MATCH(Calc2!E$112,Trucks!$B19:$B$49,0)","v":9},{"$f":"MATCH(Calc2!F$112,Trucks!$B19:$B$49,0)","v":16},{"$f":"MATCH(Calc2!G$112,Trucks!$B19:$B$49,0)","v":{"$error":"#N/A"}},{"$f":"MATCH(Calc2!H$112,Trucks!$B19:$B$49,0)","v":{"$error":"#N/A"}},{"$f":"MATCH(Calc2!I$112,Trucks!$B19:$B$49,0)","v":{"$error":"#N/A"}},{"$f":"MATCH(Calc2!J$112,Trucks!$B19:$B$49,0)","v":{"$error":"#N/A"}},{"$f":"MATCH(Calc2!K$112,Trucks!$B19:$B$49,0)","v":{"$error":"#N/A"}},{"$f":"MATCH(Calc2!L$112,Trucks!$B19:$B$49,0)","v":{"$error":"#N/A"}},{"$f":"MATCH(Calc2!M$112,Trucks!$B19:$B$49,0)","v":{"$error":"#N/A"}},{"$f":"MATCH(Calc2!N$112,Trucks!$B19:$B$49,0)","v":{"$error":"#N/A"}},{"$f":"MATCH(Calc2!O$112,Trucks!$B19:$B$49,0)","v":{"$error":"#N/A"}},{"$f":"MATCH(Calc2!P$112,Trucks!$B19:$B$49,0)","v":{"$error":"#N/A"}},{"$f":"MATCH(Calc2!Q$112,Trucks!$B19:$B$49,0)","v":{"$error":"#N/A"}},{"$f":"MATCH(Calc2!R$112,Trucks!$B19:$B$49,0)","v":{"$error":"#N/A"}},{"$f":"MATCH(Calc2!S$112,Trucks!$B19:$B$49,0)","v":{"$error":"#N/A"}},{"$f":"MATCH(Calc2!T$112,Trucks!$B19:$B$49,0)","v":{"$error":"#N/A"}},{"$f":"MATCH(Calc2!U$112,Trucks!$B19:$B$49,0)","v":{"$error":"#N/A"}},{"$f":"MATCH(Calc2!V$112,Trucks!$B19:$B$49,0)","v":{"$error":"#N/A"}},{"$f":"MATCH(Calc2!W$112,Trucks!$B19:$B$49,0)","v":{"$error":"#N/A"}},{"$f":"MATCH(Calc2!X$112,Trucks!$B19:$B$49,0)","v":{"$error":"#N/A"}},{"$f":"MATCH(Calc2!Y$112,Trucks!$B19:$B$49,0)","v":{"$error":"#N/A"}},{"$f":"MATCH(Calc2!Z$112,Trucks!$B19:$B$49,0)","v":{"$error":"#N/A"}},{"$f":"MATCH(Calc2!AA$112,Trucks!$B19:$B$49,0)","v":{"$error":"#N/A"}},{"$f":"MATCH(Calc2!AB$112,Trucks!$B19:$B$49,0)","v":{"$error":"#N/A"}}]
[null,null,{"$f":"MATCH(Calc2!C$112,Trucks!$B20:$B$49,0)","v":{"$error":"#N/A"}},{"$f":"MATCH(Calc2!D$112,Trucks!$B20:$B$49,0)","v":1},{"$f":"MATCH(Calc2!E$112,Trucks!$B20:$B$49,0)","v":8},{"$f":"MATCH(Calc2!F$112,Trucks!$B20:$B$49,0)","v":15},{"$f":"MATCH(Calc2!G$112,Trucks!$B20:$B$49,0)","v":{"$error":"#N/A"}},{"$f":"MATCH(Calc2!H$112,Trucks!$B20:$B$49,0)","v":{"$error":"#N/A"}},{"$f":"MATCH(Calc2!I$112,Trucks!$B20:$B$49,0)","v":{"$error":"#N/A"}},{"$f":"MATCH(Calc2!J$112,Trucks!$B20:$B$49,0)","v":{"$error":"#N/A"}},{"$f":"MATCH(Calc2!K$112,Trucks!$B20:$B$49,0)","v":{"$error":"#N/A"}},{"$f":"MATCH(Calc2!L$112,Trucks!$B20:$B$49,0)","v":{"$error":"#N/A"}},{"$f":"MATCH(Calc2!M$112,Trucks!$B20:$B$49,0)","v":{"$error":"#N/A"}},{"$f":"MATCH(Calc2!N$112,Trucks!$B20:$B$49,0)","v":{"$error":"#N/A"}},{"$f":"MATCH(Calc2!O$112,Trucks!$B20:$B$49,0)","v":{"$error":"#N/A"}},{"$f":"MATCH(Calc2!P$112,Trucks!$B20:$B$49,0)","v":{"$error":"#N/A"}},{"$f":"MATCH(Calc2!Q$112,Trucks!$B20:$B$49,0)","v":{"$error":"#N/A"}},{"$f":"MATCH(Calc2!R$112,Trucks!$B20:$B$49,0)","v":{"$error":"#N/A"}},{"$f":"MATCH(Calc2!S$112,Trucks!$B20:$B$49,0)","v":{"$error":"#N/A"}},{"$f":"MATCH(Calc2!T$112,Trucks!$B20:$B$49,0)","v":{"$error":"#N/A"}},{"$f":"MATCH(Calc2!U$112,Trucks!$B20:$B$49,0)","v":{"$error":"#N/A"}},{"$f":"MATCH(Calc2!V$112,Trucks!$B20:$B$49,0)","v":{"$error":"#N/A"}},{"$f":"MATCH(Calc2!W$112,Trucks!$B20:$B$49,0)","v":{"$error":"#N/A"}},{"$f":"MATCH(Calc2!X$112,Trucks!$B20:$B$49,0)","v":{"$error":"#N/A"}},{"$f":"MATCH(Calc2!Y$112,Trucks!$B20:$B$49,0)","v":{"$error":"#N/A"}},{"$f":"MATCH(Calc2!Z$112,Trucks!$B20:$B$49,0)","v":{"$error":"#N/A"}},{"$f":"MATCH(Calc2!AA$112,Trucks!$B20:$B$49,0)","v":{"$error":"#N/A"}},{"$f":"MATCH(Calc2!AB$112,Trucks!$B20:$B$49,0)","v":{"$error":"#N/A"}}]
[null,null,{"$f":"MATCH(Calc2!C$112,Trucks!$B21:$B$49,0)","v":{"$error":"#N/A"}},{"$f":"MATCH(Calc2!D$112,Trucks!$B21:$B$49,0)","v":1},{"$f":"MATCH(Calc2!E$112,Trucks!$B21:$B$49,0)","v":7},{"$f":"MATCH(Calc2!F$112,Trucks!$B21:$B$49,0)","v":14},{"$f":"MATCH(Calc2!G$112,Trucks!$B21:$B$49,0)","v":{"$error":"#N/A"}},{"$f":"MATCH(Calc2!H$112,Trucks!$B21:$B$49,0)","v":{"$error":"#N/A"}},{"$f":"MATCH(Calc2!I$112,Trucks!$B21:$B$49,0)","v":{"$error":"#N/A"}},{"$f":"MATCH(Calc2!J$112,Trucks!$B21:$B$49,0)","v":{"$error":"#N/A"}},{"$f":"MATCH(Calc2!K$112,Trucks!$B21:$B$49,0)","v":{"$error":"#N/A"}},{"$f":"MATCH(Calc2!L$112,Trucks!$B21:$B$49,0)","v":{"$error":"#N/A"}},{"$f":"MATCH(Calc2!M$112,Trucks!$B21:$B$49,0)","v":{"$error":"#N/A"}},{"$f":"MATCH(Calc2!N$112,Trucks!$B21:$B$49,0)","v":{"$error":"#N/A"}},{"$f":"MATCH(Calc2!O$112,Trucks!$B21:$B$49,0)","v":{"$error":"#N/A"}},{"$f":"MATCH(Calc2!P$112,Trucks!$B21:$B$49,0)","v":{"$error":"#N/A"}},{"$f":"MATCH(Calc2!Q$112,Trucks!$B21:$B$49,0)","v":{"$error":"#N/A"}},{"$f":"MATCH(Calc2!R$112,Trucks!$B21:$B$49,0)","v":{"$error":"#N/A"}},{"$f":"MATCH(Calc2!S$112,Trucks!$B21:$B$49,0)","v":{"$error":"#N/A"}},{"$f":"MATCH(Calc2!T$112,Trucks!$B21:$B$49,0)","v":{"$error":"#N/A"}},{"$f":"MATCH(Calc2!U$112,Trucks!$B21:$B$49,0)","v":{"$error":"#N/A"}},{"$f":"MATCH(Calc2!V$112,Trucks!$B21:$B$49,0)","v":{"$error":"#N/A"}},{"$f":"MATCH(Calc2!W$112,Trucks!$B21:$B$49,0)","v":{"$error":"#N/A"}},{"$f":"MATCH(Calc2!X$112,Trucks!$B21:$B$49,0)","v":{"$error":"#N/A"}},{"$f":"MATCH(Calc2!Y$112,Trucks!$B21:$B$49,0)","v":{"$error":"#N/A"}},{"$f":"MATCH(Calc2!Z$112,Trucks!$B21:$B$49,0)","v":{"$error":"#N/A"}},{"$f":"MATCH(Calc2!AA$112,Trucks!$B21:$B$49,0)","v":{"$error":"#N/A"}},{"$f":"MATCH(Calc2!AB$112,Trucks!$B21:$B$49,0)","v":{"$error":"#N/A"}}]
[null,null,{"$f":"MATCH(Calc2!C$112,Trucks!$B22:$B$49,0)","v":{"$error":"#N/A"}},{"$f":"MATCH(Calc2!D$112,Trucks!$B22:$B$49,0)","v":1},{"$f":"MATCH(Calc2!E$112,Trucks!$B22:$B$49,0)","v":6},{"$f":"MATCH(Calc2!F$112,Trucks!$B22:$B$49,0)","v":13},{"$f":"MATCH(Calc2!G$112,Trucks!$B22:$B$49,0)","v":{"$error":"#N/A"}},{"$f":"MATCH(Calc2!H$112,Trucks!$B22:$B$49,0)","v":{"$error":"#N/A"}},{"$f":"MATCH(Calc2!I$112,Trucks!$B22:$B$49,0)","v":{"$error":"#N/A"}},{"$f":"MATCH(Calc2!J$112,Trucks!$B22:$B$49,0)","v":{"$error":"#N/A"}},{"$f":"MATCH(Calc2!K$112,Trucks!$B22:$B$49,0)","v":{"$error":"#N/A"}},{"$f":"MATCH(Calc2!L$112,Trucks!$B22:$B$49,0)","v":{"$error":"#N/A"}},{"$f":"MATCH(Calc2!M$112,Trucks!$B22:$B$49,0)","v":{"$error":"#N/A"}},{"$f":"MATCH(Calc2!N$112,Trucks!$B22:$B$49,0)","v":{"$error":"#N/A"}},{"$f":"MATCH(Calc2!O$112,Trucks!$B22:$B$49,0)","v":{"$error":"#N/A"}},{"$f":"MATCH(Calc2!P$112,Trucks!$B22:$B$49,0)","v":{"$error":"#N/A"}},{"$f":"MATCH(Calc2!Q$112,Trucks!$B22:$B$49,0)","v":{"$error":"#N/A"}},{"$f":"MATCH(Calc2!R$112,Trucks!$B22:$B$49,0)","v":{"$error":"#N/A"}},{"$f":"MATCH(Calc2!S$112,Trucks!$B22:$B$49,0)","v":{"$error":"#N/A"}},{"$f":"MATCH(Calc2!T$112,Trucks!$B22:$B$49,0)","v":{"$error":"#N/A"}},{"$f":"MATCH(Calc2!U$112,Trucks!$B22:$B$49,0)","v":{"$error":"#N/A"}},{"$f":"MATCH(Calc2!V$112,Trucks!$B22:$B$49,0)","v":{"$error":"#N/A"}},{"$f":"MATCH(Calc2!W$112,Trucks!$B22:$B$49,0)","v":{"$error":"#N/A"}},{"$f":"MATCH(Calc2!X$112,Trucks!$B22:$B$49,0)","v":{"$error":"#N/A"}},{"$f":"MATCH(Calc2!Y$112,Trucks!$B22:$B$49,0)","v":{"$error":"#N/A"}},{"$f":"MATCH(Calc2!Z$112,Trucks!$B22:$B$49,0)","v":{"$error":"#N/A"}},{"$f":"MATCH(Calc2!AA$112,Trucks!$B22:$B$49,0)","v":{"$error":"#N/A"}},{"$f":"MATCH(Calc2!AB$112,Trucks!$B22:$B$49,0)","v":{"$error":"#N/A"}}]
[null,null,{"$f":"MATCH(Calc2!C$112,Trucks!$B23:$B$49,0)","v":{"$error":"#N/A"}},{"$f":"MATCH(Calc2!D$112,Trucks!$B23:$B$49,0)","v":1},{"$f":"MATCH(Calc2!E$112,Trucks!$B23:$B$49,0)","v":5},{"$f":"MATCH(Calc2!F$112,Trucks!$B23:$B$49,0)","v":12},{"$f":"MATCH(Calc2!G$112,Trucks!$B23:$B$49,0)","v":{"$error":"#N/A"}},{"$f":"MATCH(Calc2!H$112,Trucks!$B23:$B$49,0)","v":{"$error":"#N/A"}},{"$f":"MATCH(Calc2!I$112,Trucks!$B23:$B$49,0)","v":{"$error":"#N/A"}},{"$f":"MATCH(Calc2!J$112,Trucks!$B23:$B$49,0)","v":{"$error":"#N/A"}},{"$f":"MATCH(Calc2!K$112,Trucks!$B23:$B$49,0)","v":{"$error":"#N/A"}},{"$f":"MATCH(Calc2!L$112,Trucks!$B23:$B$49,0)","v":{"$error":"#N/A"}},{"$f":"MATCH(Calc2!M$112,Trucks!$B23:$B$49,0)","v":{"$error":"#N/A"}},{"$f":"MATCH(Calc2!N$112,Trucks!$B23:$B$49,0)","v":{"$error":"#N/A"}},{"$f":"MATCH(Calc2!O$112,Trucks!$B23:$B$49,0)","v":{"$error":"#N/A"}},{"$f":"MATCH(Calc2!P$112,Trucks!$B23:$B$49,0)","v":{"$error":"#N/A"}},{"$f":"MATCH(Calc2!Q$112,Trucks!$B23:$B$49,0)","v":{"$error":"#N/A"}},{"$f":"MATCH(Calc2!R$112,Trucks!$B23:$B$49,0)","v":{"$error":"#N/A"}},{"$f":"MATCH(Calc2!S$112,Trucks!$B23:$B$49,0)","v":{"$error":"#N/A"}},{"$f":"MATCH(Calc2!T$112,Trucks!$B23:$B$49,0)","v":{"$error":"#N/A"}},{"$f":"MATCH(Calc2!U$112,Trucks!$B23:$B$49,0)","v":{"$error":"#N/A"}},{"$f":"MATCH(Calc2!V$112,Trucks!$B23:$B$49,0)","v":{"$error":"#N/A"}},{"$f":"MATCH(Calc2!W$112,Trucks!$B23:$B$49,0)","v":{"$error":"#N/A"}},{"$f":"MATCH(Calc2!X$112,Trucks!$B23:$B$49,0)","v":{"$error":"#N/A"}},{"$f":"MATCH(Calc2!Y$112,Trucks!$B23:$B$49,0)","v":{"$error":"#N/A"}},{"$f":"MATCH(Calc2!Z$112,Trucks!$B23:$B$49,0)","v":{"$error":"#N/A"}},{"$f":"MATCH(Calc2!AA$112,Trucks!$B23:$B$49,0)","v":{"$error":"#N/A"}},{"$f":"MATCH(Calc2!AB$112,Trucks!$B23:$B$49,0)","v":{"$error":"#N/A"}}]
[null,null,{"$f":"MATCH(Calc2!C$112,Trucks!$B24:$B$49,0)","v":{"$error":"#N/A"}},{"$f":"MATCH(Calc2!D$112,Trucks!$B24:$B$49,0)","v":1},{"$f":"MATCH(Calc2!E$112,Trucks!$B24:$B$49,0)","v":4},{"$f":"MATCH(Calc2!F$112,Trucks!$B24:$B$49,0)","v":11},{"$f":"MATCH(Calc2!G$112,Trucks!$B24:$B$49,0)","v":{"$error":"#N/A"}},{"$f":"MATCH(Calc2!H$112,Trucks!$B24:$B$49,0)","v":{"$error":"#N/A"}},{"$f":"MATCH(Calc2!I$112,Trucks!$B24:$B$49,0)","v":{"$error":"#N/A"}},{"$f":"MATCH(Calc2!J$112,Trucks!$B24:$B$49,0)","v":{"$error":"#N/A"}},{"$f":"MATCH(Calc2!K$112,Trucks!$B24:$B$49,0)","v":{"$error":"#N/A"}},{"$f":"MATCH(Calc2!L$112,Trucks!$B24:$B$49,0)","v":{"$error":"#N/A"}},{"$f":"MATCH(Calc2!M$112,Trucks!$B24:$B$49,0)","v":{"$error":"#N/A"}},{"$f":"MATCH(Calc2!N$112,Trucks!$B24:$B$49,0)","v":{"$error":"#N/A"}},{"$f":"MATCH(Calc2!O$112,Trucks!$B24:$B$49,0)","v":{"$error":"#N/A"}},{"$f":"MATCH(Calc2!P$112,Trucks!$B24:$B$49,0)","v":{"$error":"#N/A"}},{"$f":"MATCH(Calc2!Q$112,Trucks!$B24:$B$49,0)","v":{"$error":"#N/A"}},{"$f":"MATCH(Calc2!R$112,Trucks!$B24:$B$49,0)","v":{"$error":"#N/A"}},{"$f":"MATCH(Calc2!S$112,Trucks!$B24:$B$49,0)","v":{"$error":"#N/A"}},{"$f":"MATCH(Calc2!T$112,Trucks!$B24:$B$49,0)","v":{"$error":"#N/A"}},{"$f":"MATCH(Calc2!U$112,Trucks!$B24:$B$49,0)","v":{"$error":"#N/A"}},{"$f":"MATCH(Calc2!V$112,Trucks!$B24:$B$49,0)","v":{"$error":"#N/A"}},{"$f":"MATCH(Calc2!W$112,Trucks!$B24:$B$49,0)","v":{"$error":"#N/A"}},{"$f":"MATCH(Calc2!X$112,Trucks!$B24:$B$49,0)","v":{"$error":"#N/A"}},{"$f":"MATCH(Calc2!Y$112,Trucks!$B24:$B$49,0)","v":{"$error":"#N/A"}},{"$f":"MATCH(Calc2!Z$112,Trucks!$B24:$B$49,0)","v":{"$error":"#N/A"}},{"$f":"MATCH(Calc2!AA$112,Trucks!$B24:$B$49,0)","v":{"$error":"#N/A"}},{"$f":"MATCH(Calc2!AB$112,Trucks!$B24:$B$49,0)","v":{"$error":"#N/A"}}]
[null,null,{"$f":"MATCH(Calc2!C$112,Trucks!$B25:$B$49,0)","v":{"$error":"#N/A"}},{"$f":"MATCH(Calc2!D$112,Trucks!$B25:$B$49,0)","v":1},{"$f":"MATCH(Calc2!E$112,Trucks!$B25:$B$49,0)","v":3},{"$f":"MATCH(Calc2!F$112,Trucks!$B25:$B$49,0)","v":10},{"$f":"MATCH(Calc2!G$112,Trucks!$B25:$B$49,0)","v":{"$error":"#N/A"}},{"$f":"MATCH(Calc2!H$112,Trucks!$B25:$B$49,0)","v":{"$error":"#N/A"}},{"$f":"MATCH(Calc2!I$112,Trucks!$B25:$B$49,0)","v":{"$error":"#N/A"}},{"$f":"MATCH(Calc2!J$112,Trucks!$B25:$B$49,0)","v":{"$error":"#N/A"}},{"$f":"MATCH(Calc2!K$112,Trucks!$B25:$B$49,0)","v":{"$error":"#N/A"}},{"$f":"MATCH(Calc2!L$112,Trucks!$B25:$B$49,0)","v":{"$error":"#N/A"}},{"$f":"MATCH(Calc2!M$112,Trucks!$B25:$B$49,0)","v":{"$error":"#N/A"}},{"$f":"MATCH(Calc2!N$112,Trucks!$B25:$B$49,0)","v":{"$error":"#N/A"}},{"$f":"MATCH(Calc2!O$112,Trucks!$B25:$B$49,0)","v":{"$error":"#N/A"}},{"$f":"MATCH(Calc2!P$112,Trucks!$B25:$B$49,0)","v":{"$error":"#N/A"}},{"$f":"MATCH(Calc2!Q$112,Trucks!$B25:$B$49,0)","v":{"$error":"#N/A"}},{"$f":"MATCH(Calc2!R$112,Trucks!$B25:$B$49,0)","v":{"$error":"#N/A"}},{"$f":"MATCH(Calc2!S$112,Trucks!$B25:$B$49,0)","v":{"$error":"#N/A"}},{"$f":"MATCH(Calc2!T$112,Trucks!$B25:$B$49,0)","v":{"$error":"#N/A"}},{"$f":"MATCH(Calc2!U$112,Trucks!$B25:$B$49,0)","v":{"$error":"#N/A"}},{"$f":"MATCH(Calc2!V$112,Trucks!$B25:$B$49,0)","v":{"$error":"#N/A"}},{"$f":"MATCH(Calc2!W$112,Trucks!$B25:$B$49,0)","v":{"$error":"#N/A"}},{"$f":"MATCH(Calc2!X$112,Trucks!$B25:$B$49,0)","v":{"$error":"#N/A"}},{"$f":"MATCH(Calc2!Y$112,Trucks!$B25:$B$49,0)","v":{"$error":"#N/A"}},{"$f":"MATCH(Calc2!Z$112,Trucks!$B25:$B$49,0)","v":{"$error":"#N/A"}},{"$f":"MATCH(Calc2!AA$112,Trucks!$B25:$B$49,0)","v":{"$error":"#N/A"}},{"$f":"MATCH(Calc2!AB$112,Trucks!$B25:$B$49,0)","v":{"$error":"#N/A"}}]
[null,null,{"$f":"MATCH(Calc2!C$112,Trucks!$B26:$B$49,0)","v":{"$error":"#N/A"}},{"$f":"MATCH(Calc2!D$112,Trucks!$B26:$B$49,0)","v":{"$error":"#N/A"}},{"$f":"MATCH(Calc2!E$112,Trucks!$B26:$B$49,0)","v":2},{"$f":"MATCH(Calc2!F$112,Trucks!$B26:$B$49,0)","v":9},{"$f":"MATCH(Calc2!G$112,Trucks!$B26:$B$49,0)","v":{"$error":"#N/A"}},{"$f":"MATCH(Calc2!H$112,Trucks!$B26:$B$49,0)","v":{"$error":"#N/A"}},{"$f":"MATCH(Calc2!I$112,Trucks!$B26:$B$49,0)","v":{"$error":"#N/A"}},{"$f":"MATCH(Calc2!J$112,Trucks!$B26:$B$49,0)","v":{"$error":"#N/A"}},{"$f":"MATCH(Calc2!K$112,Trucks!$B26:$B$49,0)","v":{"$error":"#N/A"}},{"$f":"MATCH(Calc2!L$112,Trucks!$B26:$B$49,0)","v":{"$error":"#N/A"}},{"$f":"MATCH(Calc2!M$112,Trucks!$B26:$B$49,0)","v":{"$error":"#N/A"}},{"$f":"MATCH(Calc2!N$112,Trucks!$B26:$B$49,0)","v":{"$error":"#N/A"}},{"$f":"MATCH(Calc2!O$112,Trucks!$B26:$B$49,0)","v":{"$error":"#N/A"}},{"$f":"MATCH(Calc2!P$112,Trucks!$B26:$B$49,0)","v":{"$error":"#N/A"}},{"$f":"MATCH(Calc2!Q$112,Trucks!$B26:$B$49,0)","v":{"$error":"#N/A"}},{"$f":"MATCH(Calc2!R$112,Trucks!$B26:$B$49,0)","v":{"$error":"#N/A"}},{"$f":"MATCH(Calc2!S$112,Trucks!$B26:$B$49,0)","v":{"$error":"#N/A"}},{"$f":"MATCH(Calc2!T$112,Trucks!$B26:$B$49,0)","v":{"$error":"#N/A"}},{"$f":"MATCH(Calc2!U$112,Trucks!$B26:$B$49,0)","v":{"$error":"#N/A"}},{"$f":"MATCH(Calc2!V$112,Trucks!$B26:$B$49,0)","v":{"$error":"#N/A"}},{"$f":"MATCH(Calc2!W$112,Trucks!$B26:$B$49,0)","v":{"$error":"#N/A"}},{"$f":"MATCH(Calc2!X$112,Trucks!$B26:$B$49,0)","v":{"$error":"#N/A"}},{"$f":"MATCH(Calc2!Y$112,Trucks!$B26:$B$49,0)","v":{"$error":"#N/A"}},{"$f":"MATCH(Calc2!Z$112,Trucks!$B26:$B$49,0)","v":{"$error":"#N/A"}},{"$f":"MATCH(Calc2!AA$112,Trucks!$B26:$B$49,0)","v":{"$error":"#N/A"}},{"$f":"MATCH(Calc2!AB$112,Trucks!$B26:$B$49,0)","v":{"$error":"#N/A"}}]
[null,null,{"$f":"MATCH(Calc2!C$112,Trucks!$B27:$B$49,0)","v":{"$error":"#N/A"}},{"$f":"MATCH(Calc2!D$112,Trucks!$B27:$B$49,0)","v":{"$error":"#N/A"}},{"$f":"MATCH(Calc2!E$112,Trucks!$B27:$B$49,0)","v":1},{"$f":"MATCH(Calc2!F$112,Trucks!$B27:$B$49,0)","v":8},{"$f":"MATCH(Calc2!G$112,Trucks!$B27:$B$49,0)","v":{"$error":"#N/A"}},{"$f":"MATCH(Calc2!H$112,Trucks!$B27:$B$49,0)","v":{"$error":"#N/A"}},{"$f":"MATCH(Calc2!I$112,Trucks!$B27:$B$49,0)","v":{"$error":"#N/A"}},{"$f":"MATCH(Calc2!J$112,Trucks!$B27:$B$49,0)","v":{"$error":"#N/A"}},{"$f":"MATCH(Calc2!K$112,Trucks!$B27:$B$49,0)","v":{"$error":"#N/A"}},{"$f":"MATCH(Calc2!L$112,Trucks!$B27:$B$49,0)","v":{"$error":"#N/A"}},{"$f":"MATCH(Calc2!M$112,Trucks!$B27:$B$49,0)","v":{"$error":"#N/A"}},{"$f":"MATCH(Calc2!N$112,Trucks!$B27:$B$49,0)","v":{"$error":"#N/A"}},{"$f":"MATCH(Calc2!O$112,Trucks!$B27:$B$49,0)","v":{"$error":"#N/A"}},{"$f":"MATCH(Calc2!P$112,Trucks!$B27:$B$49,0)","v":{"$error":"#N/A"}},{"$f":"MATCH(Calc2!Q$112,Trucks!$B27:$B$49,0)","v":{"$error":"#N/A"}},{"$f":"MATCH(Calc2!R$112,Trucks!$B27:$B$49,0)","v":{"$error":"#N/A"}},{"$f":"MATCH(Calc2!S$112,Trucks!$B27:$B$49,0)","v":{"$error":"#N/A"}},{"$f":"MATCH(Calc2!T$112,Trucks!$B27:$B$49,0)","v":{"$error":"#N/A"}},{"$f":"MATCH(Calc2!U$112,Trucks!$B27:$B$49,0)","v":{"$error":"#N/A"}},{"$f":"MATCH(Calc2!V$112,Trucks!$B27:$B$49,0)","v":{"$error":"#N/A"}},{"$f":"MATCH(Calc2!W$112,Trucks!$B27:$B$49,0)","v":{"$error":"#N/A"}},{"$f":"MATCH(Calc2!X$112,Trucks!$B27:$B$49,0)","v":{"$error":"#N/A"}},{"$f":"MATCH(Calc2!Y$112,Trucks!$B27:$B$49,0)","v":{"$error":"#N/A"}},{"$f":"MATCH(Calc2!Z$112,Trucks!$B27:$B$49,0)","v":{"$error":"#N/A"}},{"$f":"MATCH(Calc2!AA$112,Trucks!$B27:$B$49,0)","v":{"$error":"#N/A"}},{"$f":"MATCH(Calc2!AB$112,Trucks!$B27:$B$49,0)","v":{"$error":"#N/A"}}]
[null,null,{"$f":"MATCH(Calc2!C$112,Trucks!$B28:$B$49,0)","v":{"$error":"#N/A"}},{"$f":"MATCH(Calc2!D$112,Trucks!$B28:$B$49,0)","v":{"$error":"#N/A"}},{"$f":"MATCH(Calc2!E$112,Trucks!$B28:$B$49,0)","v":1},{"$f":"MATCH(Calc2!F$112,Trucks!$B28:$B$49,0)","v":7},{"$f":"MATCH(Calc2!G$112,Trucks!$B28:$B$49,0)","v":{"$error":"#N/A"}},{"$f":"MATCH(Calc2!H$112,Trucks!$B28:$B$49,0)","v":{"$error":"#N/A"}},{"$f":"MATCH(Calc2!I$112,Trucks!$B28:$B$49,0)","v":{"$error":"#N/A"}},{"$f":"MATCH(Calc2!J$112,Trucks!$B28:$B$49,0)","v":{"$error":"#N/A"}},{"$f":"MATCH(Calc2!K$112,Trucks!$B28:$B$49,0)","v":{"$error":"#N/A"}},{"$f":"MATCH(Calc2!L$112,Trucks!$B28:$B$49,0)","v":{"$error":"#N/A"}},{"$f":"MATCH(Calc2!M$112,Trucks!$B28:$B$49,0)","v":{"$error":"#N/A"}},{"$f":"MATCH(Calc2!N$112,Trucks!$B28:$B$49,0)","v":{"$error":"#N/A"}},{"$f":"MATCH(Calc2!O$112,Trucks!$B28:$B$49,0)","v":{"$error":"#N/A"}},{"$f":"MATCH(Calc2!P$112,Trucks!$B28:$B$49,0)","v":{"$error":"#N/A"}},{"$f":"MATCH(Calc2!Q$112,Trucks!$B28:$B$49,0)","v":{"$error":"#N/A"}},{"$f":"MATCH(Calc2!R$112,Trucks!$B28:$B$49,0)","v":{"$error":"#N/A"}},{"$f":"MATCH(Calc2!S$112,Trucks!$B28:$B$49,0)","v":{"$error":"#N/A"}},{"$f":"MATCH(Calc2!T$112,Trucks!$B28:$B$49,0)","v":{"$error":"#N/A"}},{"$f":"MATCH(Calc2!U$112,Trucks!$B28:$B$49,0)","v":{"$error":"#N/A"}},{"$f":"MATCH(Calc2!V$112,Trucks!$B28:$B$49,0)","v":{"$error":"#N/A"}},{"$f":"MATCH(Calc2!W$112,Trucks!$B28:$B$49,0)","v":{"$error":"#N/A"}},{"$f":"MATCH(Calc2!X$112,Trucks!$B28:$B$49,0)","v":{"$error":"#N/A"}},{"$f":"MATCH(Calc2!Y$112,Trucks!$B28:$B$49,0)","v":{"$error":"#N/A"}},{"$f":"MATCH(Calc2!Z$112,Trucks!$B28:$B$49,0)","v":{"$error":"#N/A"}},{"$f":"MATCH(Calc2!AA$112,Trucks!$B28:$B$49,0)","v":{"$error":"#N/A"}},{"$f":"MATCH(Calc2!AB$112,Trucks!$B28:$B$49,0)","v":{"$error":"#N/A"}}]
[null,null,{"$f":"MATCH(Calc2!C$112,Trucks!$B29:$B$49,0)","v":{"$error":"#N/A"}},{"$f":"MATCH(Calc2!D$112,Trucks!$B29:$B$49,0)","v":{"$error":"#N/A"}},{"$f":"MATCH(Calc2!E$112,Trucks!$B29:$B$49,0)","v":1},{"$f":"MATCH(Calc2!F$112,Trucks!$B29:$B$49,0)","v":6},{"$f":"MATCH(Calc2!G$112,Trucks!$B29:$B$49,0)","v":{"$error":"#N/A"}},{"$f":"MATCH(Calc2!H$112,Trucks!$B29:$B$49,0)","v":{"$error":"#N/A"}},{"$f":"MATCH(Calc2!I$112,Trucks!$B29:$B$49,0)","v":{"$error":"#N/A"}},{"$f":"MATCH(Calc2!J$112,Trucks!$B29:$B$49,0)","v":{"$error":"#N/A"}},{"$f":"MATCH(Calc2!K$112,Trucks!$B29:$B$49,0)","v":{"$error":"#N/A"}},{"$f":"MATCH(Calc2!L$112,Trucks!$B29:$B$49,0)","v":{"$error":"#N/A"}},{"$f":"MATCH(Calc2!M$112,Trucks!$B29:$B$49,0)","v":{"$error":"#N/A"}},{"$f":"MATCH(Calc2!N$112,Trucks!$B29:$B$49,0)","v":{"$error":"#N/A"}},{"$f":"MATCH(Calc2!O$112,Trucks!$B29:$B$49,0)","v":{"$error":"#N/A"}},{"$f":"MATCH(Calc2!P$112,Trucks!$B29:$B$49,0)","v":{"$error":"#N/A"}},{"$f":"MATCH(Calc2!Q$112,Trucks!$B29:$B$49,0)","v":{"$error":"#N/A"}},{"$f":"MATCH(Calc2!R$112,Trucks!$B29:$B$49,0)","v":{"$error":"#N/A"}},{"$f":"MATCH(Calc2!S$112,Trucks!$B29:$B$49,0)","v":{"$error":"#N/A"}},{"$f":"MATCH(Calc2!T$112,Trucks!$B29:$B$49,0)","v":{"$error":"#N/A"}},{"$f":"MATCH(Calc2!U$112,Trucks!$B29:$B$49,0)","v":{"$error":"#N/A"}},{"$f":"MATCH(Calc2!V$112,Trucks!$B29:$B$49,0)","v":{"$error":"#N/A"}},{"$f":"MATCH(Calc2!W$112,Trucks!$B29:$B$49,0)","v":{"$error":"#N/A"}},{"$f":"MATCH(Calc2!X$112,Trucks!$B29:$B$49,0)","v":{"$error":"#N/A"}},{"$f":"MATCH(Calc2!Y$112,Trucks!$B29:$B$49,0)","v":{"$error":"#N/A"}},{"$f":"MATCH(Calc2!Z$112,Trucks!$B29:$B$49,0)","v":{"$error":"#N/A"}},{"$f":"MATCH(Calc2!AA$112,Trucks!$B29:$B$49,0)","v":{"$error":"#N/A"}},{"$f":"MATCH(Calc2!AB$112,Trucks!$B29:$B$49,0)","v":{"$error":"#N/A"}}]
[null,null,{"$f":"MATCH(Calc2!C$112,Trucks!$B30:$B$49,0)","v":{"$error":"#N/A"}},{"$f":"MATCH(Calc2!D$112,Trucks!$B30:$B$49,0)","v":{"$error":"#N/A"}},{"$f":"MATCH(Calc2!E$112,Trucks!$B30:$B$49,0)","v":1},{"$f":"MATCH(Calc2!F$112,Trucks!$B30:$B$49,0)","v":5},{"$f":"MATCH(Calc2!G$112,Trucks!$B30:$B$49,0)","v":{"$error":"#N/A"}},{"$f":"MATCH(Calc2!H$112,Trucks!$B30:$B$49,0)","v":{"$error":"#N/A"}},{"$f":"MATCH(Calc2!I$112,Trucks!$B30:$B$49,0)","v":{"$error":"#N/A"}},{"$f":"MATCH(Calc2!J$112,Trucks!$B30:$B$49,0)","v":{"$error":"#N/A"}},{"$f":"MATCH(Calc2!K$112,Trucks!$B30:$B$49,0)","v":{"$error":"#N/A"}},{"$f":"MATCH(Calc2!L$112,Trucks!$B30:$B$49,0)","v":{"$error":"#N/A"}},{"$f":"MATCH(Calc2!M$112,Trucks!$B30:$B$49,0)","v":{"$error":"#N/A"}},{"$f":"MATCH(Calc2!N$112,Trucks!$B30:$B$49,0)","v":{"$error":"#N/A"}},{"$f":"MATCH(Calc2!O$112,Trucks!$B30:$B$49,0)","v":{"$error":"#N/A"}},{"$f":"MATCH(Calc2!P$112,Trucks!$B30:$B$49,0)","v":{"$error":"#N/A"}},{"$f":"MATCH(Calc2!Q$112,Trucks!$B30:$B$49,0)","v":{"$error":"#N/A"}},{"$f":"MATCH(Calc2!R$112,Trucks!$B30:$B$49,0)","v":{"$error":"#N/A"}},{"$f":"MATCH(Calc2!S$112,Trucks!$B30:$B$49,0)","v":{"$error":"#N/A"}},{"$f":"MATCH(Calc2!T$112,Trucks!$B30:$B$49,0)","v":{"$error":"#N/A"}},{"$f":"MATCH(Calc2!U$112,Trucks!$B30:$B$49,0)","v":{"$error":"#N/A"}},{"$f":"MATCH(Calc2!V$112,Trucks!$B30:$B$49,0)","v":{"$error":"#N/A"}},{"$f":"MATCH(Calc2!W$112,Trucks!$B30:$B$49,0)","v":{"$error":"#N/A"}},{"$f":"MATCH(Calc2!X$112,Trucks!$B30:$B$49,0)","v":{"$error":"#N/A"}},{"$f":"MATCH(Calc2!Y$112,Trucks!$B30:$B$49,0)","v":{"$error":"#N/A"}},{"$f":"MATCH(Calc2!Z$112,Trucks!$B30:$B$49,0)","v":{"$error":"#N/A"}},{"$f":"MATCH(Calc2!AA$112,Trucks!$B30:$B$49,0)","v":{"$error":"#N/A"}},{"$f":"MATCH(Calc2!AB$112,Trucks!$B30:$B$49,0)","v":{"$error":"#N/A"}}]
[null,null,{"$f":"MATCH(Calc2!C$112,Trucks!$B31:$B$49,0)","v":{"$error":"#N/A"}},{"$f":"MATCH(Calc2!D$112,Trucks!$B31:$B$49,0)","v":{"$error":"#N/A"}},{"$f":"MATCH(Calc2!E$112,Trucks!$B31:$B$49,0)","v":1},{"$f":"MATCH(Calc2!F$112,Trucks!$B31:$B$49,0)","v":4},{"$f":"MATCH(Calc2!G$112,Trucks!$B31:$B$49,0)","v":{"$error":"#N/A"}},{"$f":"MATCH(Calc2!H$112,Trucks!$B31:$B$49,0)","v":{"$error":"#N/A"}},{"$f":"MATCH(Calc2!I$112,Trucks!$B31:$B$49,0)","v":{"$error":"#N/A"}},{"$f":"MATCH(Calc2!J$112,Trucks!$B31:$B$49,0)","v":{"$error":"#N/A"}},{"$f":"MATCH(Calc2!K$112,Trucks!$B31:$B$49,0)","v":{"$error":"#N/A"}},{"$f":"MATCH(Calc2!L$112,Trucks!$B31:$B$49,0)","v":{"$error":"#N/A"}},{"$f":"MATCH(Calc2!M$112,Trucks!$B31:$B$49,0)","v":{"$error":"#N/A"}},{"$f":"MATCH(Calc2!N$112,Trucks!$B31:$B$49,0)","v":{"$error":"#N/A"}},{"$f":"MATCH(Calc2!O$112,Trucks!$B31:$B$49,0)","v":{"$error":"#N/A"}},{"$f":"MATCH(Calc2!P$112,Trucks!$B31:$B$49,0)","v":{"$error":"#N/A"}},{"$f":"MATCH(Calc2!Q$112,Trucks!$B31:$B$49,0)","v":{"$error":"#N/A"}},{"$f":"MATCH(Calc2!R$112,Trucks!$B31:$B$49,0)","v":{"$error":"#N/A"}},{"$f":"MATCH(Calc2!S$112,Trucks!$B31:$B$49,0)","v":{"$error":"#N/A"}},{"$f":"MATCH(Calc2!T$112,Trucks!$B31:$B$49,0)","v":{"$error":"#N/A"}},{"$f":"MATCH(Calc2!U$112,Trucks!$B31:$B$49,0)","v":{"$error":"#N/A"}},{"$f":"MATCH(Calc2!V$112,Trucks!$B31:$B$49,0)","v":{"$error":"#N/A"}},{"$f":"MATCH(Calc2!W$112,Trucks!$B31:$B$49,0)","v":{"$error":"#N/A"}},{"$f":"MATCH(Calc2!X$112,Trucks!$B31:$B$49,0)","v":{"$error":"#N/A"}},{"$f":"MATCH(Calc2!Y$112,Trucks!$B31:$B$49,0)","v":{"$error":"#N/A"}},{"$f":"MATCH(Calc2!Z$112,Trucks!$B31:$B$49,0)","v":{"$error":"#N/A"}},{"$f":"MATCH(Calc2!AA$112,Trucks!$B31:$B$49,0)","v":{"$error":"#N/A"}},{"$f":"MATCH(Calc2!AB$112,Trucks!$B31:$B$49,0)","v":{"$error":"#N/A"}}]
[null,null,{"$f":"MATCH(Calc2!C$112,Trucks!$B32:$B$49,0)","v":{"$error":"#N/A"}},{"$f":"MATCH(Calc2!D$112,Trucks!$B32:$B$49,0)","v":{"$error":"#N/A"}},{"$f":"MATCH(Calc2!E$112,Trucks!$B32:$B$49,0)","v":1},{"$f":"MATCH(Calc2!F$112,Trucks!$B32:$B$49,0)","v":3},{"$f":"MATCH(Calc2!G$112,Trucks!$B32:$B$49,0)","v":{"$error":"#N/A"}},{"$f":"MATCH(Calc2!H$112,Trucks!$B32:$B$49,0)","v":{"$error":"#N/A"}},{"$f":"MATCH(Calc2!I$112,Trucks!$B32:$B$49,0)","v":{"$error":"#N/A"}},{"$f":"MATCH(Calc2!J$112,Trucks!$B32:$B$49,0)","v":{"$error":"#N/A"}},{"$f":"MATCH(Calc2!K$112,Trucks!$B32:$B$49,0)","v":{"$error":"#N/A"}},{"$f":"MATCH(Calc2!L$112,Trucks!$B32:$B$49,0)","v":{"$error":"#N/A"}},{"$f":"MATCH(Calc2!M$112,Trucks!$B32:$B$49,0)","v":{"$error":"#N/A"}},{"$f":"MATCH(Calc2!N$112,Trucks!$B32:$B$49,0)","v":{"$error":"#N/A"}},{"$f":"MATCH(Calc2!O$112,Trucks!$B32:$B$49,0)","v":{"$error":"#N/A"}},{"$f":"MATCH(Calc2!P$112,Trucks!$B32:$B$49,0)","v":{"$error":"#N/A"}},{"$f":"MATCH(Calc2!Q$112,Trucks!$B32:$B$49,0)","v":{"$error":"#N/A"}},{"$f":"MATCH(Calc2!R$112,Trucks!$B32:$B$49,0)","v":{"$error":"#N/A"}},{"$f":"MATCH(Calc2!S$112,Trucks!$B32:$B$49,0)","v":{"$error":"#N/A"}},{"$f":"MATCH(Calc2!T$112,Trucks!$B32:$B$49,0)","v":{"$error":"#N/A"}},{"$f":"MATCH(Calc2!U$112,Trucks!$B32:$B$49,0)","v":{"$error":"#N/A"}},{"$f":"MATCH(Calc2!V$112,Trucks!$B32:$B$49,0)","v":{"$error":"#N/A"}},{"$f":"MATCH(Calc2!W$112,Trucks!$B32:$B$49,0)","v":{"$error":"#N/A"}},{"$f":"MATCH(Calc2!X$112,Trucks!$B32:$B$49,0)","v":{"$error":"#N/A"}},{"$f":"MATCH(Calc2!Y$112,Trucks!$B32:$B$49,0)","v":{"$error":"#N/A"}},{"$f":"MATCH(Calc2!Z$112,Trucks!$B32:$B$49,0)","v":{"$error":"#N/A"}},{"$f":"MATCH(Calc2!AA$112,Trucks!$B32:$B$49,0)","v":{"$error":"#N/A"}},{"$f":"MATCH(Calc2!AB$112,Trucks!$B32:$B$49,0)","v":{"$error":"#N/A"}}]
[null,null,{"$f":"MATCH(Calc2!C$112,Trucks!$B33:$B$49,0)","v":{"$error":"#N/A"}},{"$f":"MATCH(Calc2!D$112,Trucks!$B33:$B$49,0)","v":{"$error":"#N/A"}},{"$f":"MATCH(Calc2!E$112,Trucks!$B33:$B$49,0)","v":{"$error":"#N/A"}},{"$f":"MATCH(Calc2!F$112,Trucks!$B33:$B$49,0)","v":2},{"$f":"MATCH(Calc2!G$112,Trucks!$B33:$B$49,0)","v":{"$error":"#N/A"}},{"$f":"MATCH(Calc2!H$112,Trucks!$B33:$B$49,0)","v":{"$error":"#N/A"}},{"$f":"MATCH(Calc2!I$112,Trucks!$B33:$B$49,0)","v":{"$error":"#N/A"}},{"$f":"MATCH(Calc2!J$112,Trucks!$B33:$B$49,0)","v":{"$error":"#N/A"}},{"$f":"MATCH(Calc2!K$112,Trucks!$B33:$B$49,0)","v":{"$error":"#N/A"}},{"$f":"MATCH(Calc2!L$112,Trucks!$B33:$B$49,0)","v":{"$error":"#N/A"}},{"$f":"MATCH(Calc2!M$112,Trucks!$B33:$B$49,0)","v":{"$error":"#N/A"}},{"$f":"MATCH(Calc2!N$112,Trucks!$B33:$B$49,0)","v":{"$error":"#N/A"}},{"$f":"MATCH(Calc2!O$112,Trucks!$B33:$B$49,0)","v":{"$error":"#N/A"}},{"$f":"MATCH(Calc2!P$112,Trucks!$B33:$B$49,0)","v":{"$error":"#N/A"}},{"$f":"MATCH(Calc2!Q$112,Trucks!$B33:$B$49,0)","v":{"$error":"#N/A"}},{"$f":"MATCH(Calc2!R$112,Trucks!$B33:$B$49,0)","v":{"$error":"#N/A"}},{"$f":"MATCH(Calc2!S$112,Trucks!$B33:$B$49,0)","v":{"$error":"#N/A"}},{"$f":"MATCH(Calc2!T$112,Trucks!$B33:$B$49,0)","v":{"$error":"#N/A"}},{"$f":"MATCH(Calc2!U$112,Trucks!$B33:$B$49,0)","v":{"$error":"#N/A"}},{"$f":"MATCH(Calc2!V$112,Trucks!$B33:$B$49,0)","v":{"$error":"#N/A"}},{"$f":"MATCH(Calc2!W$112,Trucks!$B33:$B$49,0)","v":{"$error":"#N/A"}},{"$f":"MATCH(Calc2!X$112,Trucks!$B33:$B$49,0)","v":{"$error":"#N/A"}},{"$f":"MATCH(Calc2!Y$112,Trucks!$B33:$B$49,0)","v":{"$error":"#N/A"}},{"$f":"MATCH(Calc2!Z$112,Trucks!$B33:$B$49,0)","v":{"$error":"#N/A"}},{"$f":"MATCH(Calc2!AA$112,Trucks!$B33:$B$49,0)","v":{"$error":"#N/A"}},{"$f":"MATCH(Calc2!AB$112,Trucks!$B33:$B$49,0)","v":{"$error":"#N/A"}}]
[null,null,{"$f":"MATCH(Calc2!C$112,Trucks!$B34:$B$49,0)","v":{"$error":"#N/A"}},{"$f":"MATCH(Calc2!D$112,Trucks!$B34:$B$49,0)","v":{"$error":"#N/A"}},{"$f":"MATCH(Calc2!E$112,Trucks!$B34:$B$49,0)","v":{"$error":"#N/A"}},{"$f":"MATCH(Calc2!F$112,Trucks!$B34:$B$49,0)","v":1},{"$f":"MATCH(Calc2!G$112,Trucks!$B34:$B$49,0)","v":{"$error":"#N/A"}},{"$f":"MATCH(Calc2!H$112,Trucks!$B34:$B$49,0)","v":{"$error":"#N/A"}},{"$f":"MATCH(Calc2!I$112,Trucks!$B34:$B$49,0)","v":{"$error":"#N/A"}},{"$f":"MATCH(Calc2!J$112,Trucks!$B34:$B$49,0)","v":{"$error":"#N/A"}},{"$f":"MATCH(Calc2!K$112,Trucks!$B34:$B$49,0)","v":{"$error":"#N/A"}},{"$f":"MATCH(Calc2!L$112,Trucks!$B34:$B$49,0)","v":{"$error":"#N/A"}},{"$f":"MATCH(Calc2!M$112,Trucks!$B34:$B$49,0)","v":{"$error":"#N/A"}},{"$f":"MATCH(Calc2!N$112,Trucks!$B34:$B$49,0)","v":{"$error":"#N/A"}},{"$f":"MATCH(Calc2!O$112,Trucks!$B34:$B$49,0)","v":{"$error":"#N/A"}},{"$f":"MATCH(Calc2!P$112,Trucks!$B34:$B$49,0)","v":{"$error":"#N/A"}},{"$f":"MATCH(Calc2!Q$112,Trucks!$B34:$B$49,0)","v":{"$error":"#N/A"}},{"$f":"MATCH(Calc2!R$112,Trucks!$B34:$B$49,0)","v":{"$error":"#N/A"}},{"$f":"MATCH(Calc2!S$112,Trucks!$B34:$B$49,0)","v":{"$error":"#N/A"}},{"$f":"MATCH(Calc2!T$112,Trucks!$B34:$B$49,0)","v":{"$error":"#N/A"}},{"$f":"MATCH(Calc2!U$112,Trucks!$B34:$B$49,0)","v":{"$error":"#N/A"}},{"$f":"MATCH(Calc2!V$112,Trucks!$B34:$B$49,0)","v":{"$error":"#N/A"}},{"$f":"MATCH(Calc2!W$112,Trucks!$B34:$B$49,0)","v":{"$error":"#N/A"}},{"$f":"MATCH(Calc2!X$112,Trucks!$B34:$B$49,0)","v":{"$error":"#N/A"}},{"$f":"MATCH(Calc2!Y$112,Trucks!$B34:$B$49,0)","v":{"$error":"#N/A"}},{"$f":"MATCH(Calc2!Z$112,Trucks!$B34:$B$49,0)","v":{"$error":"#N/A"}},{"$f":"MATCH(Calc2!AA$112,Trucks!$B34:$B$49,0)","v":{"$error":"#N/A"}},{"$f":"MATCH(Calc2!AB$112,Trucks!$B34:$B$49,0)","v":{"$error":"#N/A"}}]
[null,null,{"$f":"MATCH(Calc2!C$112,Trucks!$B35:$B$49,0)","v":{"$error":"#N/A"}},{"$f":"MATCH(Calc2!D$112,Trucks!$B35:$B$49,0)","v":{"$error":"#N/A"}},{"$f":"MATCH(Calc2!E$112,Trucks!$B35:$B$49,0)","v":{"$error":"#N/A"}},{"$f":"MATCH(Calc2!F$112,Trucks!$B35:$B$49,0)","v":1},{"$f":"MATCH(Calc2!G$112,Trucks!$B35:$B$49,0)","v":{"$error":"#N/A"}},{"$f":"MATCH(Calc2!H$112,Trucks!$B35:$B$49,0)","v":{"$error":"#N/A"}},{"$f":"MATCH(Calc2!I$112,Trucks!$B35:$B$49,0)","v":{"$error":"#N/A"}},{"$f":"MATCH(Calc2!J$112,Trucks!$B35:$B$49,0)","v":{"$error":"#N/A"}},{"$f":"MATCH(Calc2!K$112,Trucks!$B35:$B$49,0)","v":{"$error":"#N/A"}},{"$f":"MATCH(Calc2!L$112,Trucks!$B35:$B$49,0)","v":{"$error":"#N/A"}},{"$f":"MATCH(Calc2!M$112,Trucks!$B35:$B$49,0)","v":{"$error":"#N/A"}},{"$f":"MATCH(Calc2!N$112,Trucks!$B35:$B$49,0)","v":{"$error":"#N/A"}},{"$f":"MATCH(Calc2!O$112,Trucks!$B35:$B$49,0)","v":{"$error":"#N/A"}},{"$f":"MATCH(Calc2!P$112,Trucks!$B35:$B$49,0)","v":{"$error":"#N/A"}},{"$f":"MATCH(Calc2!Q$112,Trucks!$B35:$B$49,0)","v":{"$error":"#N/A"}},{"$f":"MATCH(Calc2!R$112,Trucks!$B35:$B$49,0)","v":{"$error":"#N/A"}},{"$f":"MATCH(Calc2!S$112,Trucks!$B35:$B$49,0)","v":{"$error":"#N/A"}},{"$f":"MATCH(Calc2!T$112,Trucks!$B35:$B$49,0)","v":{"$error":"#N/A"}},{"$f":"MATCH(Calc2!U$112,Trucks!$B35:$B$49,0)","v":{"$error":"#N/A"}},{"$f":"MATCH(Calc2!V$112,Trucks!$B35:$B$49,0)","v":{"$error":"#N/A"}},{"$f":"MATCH(Calc2!W$112,Trucks!$B35:$B$49,0)","v":{"$error":"#N/A"}},{"$f":"MATCH(Calc2!X$112,Trucks!$B35:$B$49,0)","v":{"$error":"#N/A"}},{"$f":"MATCH(Calc2!Y$112,Trucks!$B35:$B$49,0)","v":{"$error":"#N/A"}},{"$f":"MATCH(Calc2!Z$112,Trucks!$B35:$B$49,0)","v":{"$error":"#N/A"}},{"$f":"MATCH(Calc2!AA$112,Trucks!$B35:$B$49,0)","v":{"$error":"#N/A"}},{"$f":"MATCH(Calc2!AB$112,Trucks!$B35:$B$49,0)","v":{"$error":"#N/A"}}]
[null,null,{"$f":"MATCH(Calc2!C$112,Trucks!$B36:$B$49,0)","v":{"$error":"#N/A"}},{"$f":"MATCH(Calc2!D$112,Trucks!$B36:$B$49,0)","v":{"$error":"#N/A"}},{"$f":"MATCH(Calc2!E$112,Trucks!$B36:$B$49,0)","v":{"$error":"#N/A"}},{"$f":"MATCH(Calc2!F$112,Trucks!$B36:$B$49,0)","v":1},{"$f":"MATCH(Calc2!G$112,Trucks!$B36:$B$49,0)","v":{"$error":"#N/A"}},{"$f":"MATCH(Calc2!H$112,Trucks!$B36:$B$49,0)","v":{"$error":"#N/A"}},{"$f":"MATCH(Calc2!I$112,Trucks!$B36:$B$49,0)","v":{"$error":"#N/A"}},{"$f":"MATCH(Calc2!J$112,Trucks!$B36:$B$49,0)","v":{"$error":"#N/A"}},{"$f":"MATCH(Calc2!K$112,Trucks!$B36:$B$49,0)","v":{"$error":"#N/A"}},{"$f":"MATCH(Calc2!L$112,Trucks!$B36:$B$49,0)","v":{"$error":"#N/A"}},{"$f":"MATCH(Calc2!M$112,Trucks!$B36:$B$49,0)","v":{"$error":"#N/A"}},{"$f":"MATCH(Calc2!N$112,Trucks!$B36:$B$49,0)","v":{"$error":"#N/A"}},{"$f":"MATCH(Calc2!O$112,Trucks!$B36:$B$49,0)","v":{"$error":"#N/A"}},{"$f":"MATCH(Calc2!P$112,Trucks!$B36:$B$49,0)","v":{"$error":"#N/A"}},{"$f":"MATCH(Calc2!Q$112,Trucks!$B36:$B$49,0)","v":{"$error":"#N/A"}},{"$f":"MATCH(Calc2!R$112,Trucks!$B36:$B$49,0)","v":{"$error":"#N/A"}},{"$f":"MATCH(Calc2!S$112,Trucks!$B36:$B$49,0)","v":{"$error":"#N/A"}},{"$f":"MATCH(Calc2!T$112,Trucks!$B36:$B$49,0)","v":{"$error":"#N/A"}},{"$f":"MATCH(Calc2!U$112,Trucks!$B36:$B$49,0)","v":{"$error":"#N/A"}},{"$f":"MATCH(Calc2!V$112,Trucks!$B36:$B$49,0)","v":{"$error":"#N/A"}},{"$f":"MATCH(Calc2!W$112,Trucks!$B36:$B$49,0)","v":{"$error":"#N/A"}},{"$f":"MATCH(Calc2!X$112,Trucks!$B36:$B$49,0)","v":{"$error":"#N/A"}},{"$f":"MATCH(Calc2!Y$112,Trucks!$B36:$B$49,0)","v":{"$error":"#N/A"}},{"$f":"MATCH(Calc2!Z$112,Trucks!$B36:$B$49,0)","v":{"$error":"#N/A"}},{"$f":"MATCH(Calc2!AA$112,Trucks!$B36:$B$49,0)","v":{"$error":"#N/A"}},{"$f":"MATCH(Calc2!AB$112,Trucks!$B36:$B$49,0)","v":{"$error":"#N/A"}}]
[null,null,{"$f":"MATCH(Calc2!C$112,Trucks!$B37:$B$49,0)","v":{"$error":"#N/A"}},{"$f":"MATCH(Calc2!D$112,Trucks!$B37:$B$49,0)","v":{"$error":"#N/A"}},{"$f":"MATCH(Calc2!E$112,Trucks!$B37:$B$49,0)","v":{"$error":"#N/A"}},{"$f":"MATCH(Calc2!F$112,Trucks!$B37:$B$49,0)","v":1},{"$f":"MATCH(Calc2!G$112,Trucks!$B37:$B$49,0)","v":{"$error":"#N/A"}},{"$f":"MATCH(Calc2!H$112,Trucks!$B37:$B$49,0)","v":{"$error":"#N/A"}},{"$f":"MATCH(Calc2!I$112,Trucks!$B37:$B$49,0)","v":{"$error":"#N/A"}},{"$f":"MATCH(Calc2!J$112,Trucks!$B37:$B$49,0)","v":{"$error":"#N/A"}},{"$f":"MATCH(Calc2!K$112,Trucks!$B37:$B$49,0)","v":{"$error":"#N/A"}},{"$f":"MATCH(Calc2!L$112,Trucks!$B37:$B$49,0)","v":{"$error":"#N/A"}},{"$f":"MATCH(Calc2!M$112,Trucks!$B37:$B$49,0)","v":{"$error":"#N/A"}},{"$f":"MATCH(Calc2!N$112,Trucks!$B37:$B$49,0)","v":{"$error":"#N/A"}},{"$f":"MATCH(Calc2!O$112,Trucks!$B37:$B$49,0)","v":{"$error":"#N/A"}},{"$f":"MATCH(Calc2!P$112,Trucks!$B37:$B$49,0)","v":{"$error":"#N/A"}},{"$f":"MATCH(Calc2!Q$112,Trucks!$B37:$B$49,0)","v":{"$error":"#N/A"}},{"$f":"MATCH(Calc2!R$112,Trucks!$B37:$B$49,0)","v":{"$error":"#N/A"}},{"$f":"MATCH(Calc2!S$112,Trucks!$B37:$B$49,0)","v":{"$error":"#N/A"}},{"$f":"MATCH(Calc2!T$112,Trucks!$B37:$B$49,0)","v":{"$error":"#N/A"}},{"$f":"MATCH(Calc2!U$112,Trucks!$B37:$B$49,0)","v":{"$error":"#N/A"}},{"$f":"MATCH(Calc2!V$112,Trucks!$B37:$B$49,0)","v":{"$error":"#N/A"}},{"$f":"MATCH(Calc2!W$112,Trucks!$B37:$B$49,0)","v":{"$error":"#N/A"}},{"$f":"MATCH(Calc2!X$112,Trucks!$B37:$B$49,0)","v":{"$error":"#N/A"}},{"$f":"MATCH(Calc2!Y$112,Trucks!$B37:$B$49,0)","v":{"$error":"#N/A"}},{"$f":"MATCH(Calc2!Z$112,Trucks!$B37:$B$49,0)","v":{"$error":"#N/A"}},{"$f":"MATCH(Calc2!AA$112,Trucks!$B37:$B$49,0)","v":{"$error":"#N/A"}},{"$f":"MATCH(Calc2!AB$112,Trucks!$B37:$B$49,0)","v":{"$error":"#N/A"}}]
[null,null,{"$f":"MATCH(Calc2!C$112,Trucks!$B38:$B$49,0)","v":{"$error":"#N/A"}},{"$f":"MATCH(Calc2!D$112,Trucks!$B38:$B$49,0)","v":{"$error":"#N/A"}},{"$f":"MATCH(Calc2!E$112,Trucks!$B38:$B$49,0)","v":{"$error":"#N/A"}},{"$f":"MATCH(Calc2!F$112,Trucks!$B38:$B$49,0)","v":1},{"$f":"MATCH(Calc2!G$112,Trucks!$B38:$B$49,0)","v":{"$error":"#N/A"}},{"$f":"MATCH(Calc2!H$112,Trucks!$B38:$B$49,0)","v":{"$error":"#N/A"}},{"$f":"MATCH(Calc2!I$112,Trucks!$B38:$B$49,0)","v":{"$error":"#N/A"}},{"$f":"MATCH(Calc2!J$112,Trucks!$B38:$B$49,0)","v":{"$error":"#N/A"}},{"$f":"MATCH(Calc2!K$112,Trucks!$B38:$B$49,0)","v":{"$error":"#N/A"}},{"$f":"MATCH(Calc2!L$112,Trucks!$B38:$B$49,0)","v":{"$error":"#N/A"}},{"$f":"MATCH(Calc2!M$112,Trucks!$B38:$B$49,0)","v":{"$error":"#N/A"}},{"$f":"MATCH(Calc2!N$112,Trucks!$B38:$B$49,0)","v":{"$error":"#N/A"}},{"$f":"MATCH(Calc2!O$112,Trucks!$B38:$B$49,0)","v":{"$error":"#N/A"}},{"$f":"MATCH(Calc2!P$112,Trucks!$B38:$B$49,0)","v":{"$error":"#N/A"}},{"$f":"MATCH(Calc2!Q$112,Trucks!$B38:$B$49,0)","v":{"$error":"#N/A"}},{"$f":"MATCH(Calc2!R$112,Trucks!$B38:$B$49,0)","v":{"$error":"#N/A"}},{"$f":"MATCH(Calc2!S$112,Trucks!$B38:$B$49,0)","v":{"$error":"#N/A"}},{"$f":"MATCH(Calc2!T$112,Trucks!$B38:$B$49,0)","v":{"$error":"#N/A"}},{"$f":"MATCH(Calc2!U$112,Trucks!$B38:$B$49,0)","v":{"$error":"#N/A"}},{"$f":"MATCH(Calc2!V$112,Trucks!$B38:$B$49,0)","v":{"$error":"#N/A"}},{"$f":"MATCH(Calc2!W$112,Trucks!$B38:$B$49,0)","v":{"$error":"#N/A"}},{"$f":"MATCH(Calc2!X$112,Trucks!$B38:$B$49,0)","v":{"$error":"#N/A"}},{"$f":"MATCH(Calc2!Y$112,Trucks!$B38:$B$49,0)","v":{"$error":"#N/A"}},{"$f":"MATCH(Calc2!Z$112,Trucks!$B38:$B$49,0)","v":{"$error":"#N/A"}},{"$f":"MATCH(Calc2!AA$112,Trucks!$B38:$B$49,0)","v":{"$error":"#N/A"}},{"$f":"MATCH(Calc2!AB$112,Trucks!$B38:$B$49,0)","v":{"$error":"#N/A"}}]
[null,null,{"$f":"MATCH(Calc2!C$112,Trucks!$B39:$B$49,0)","v":{"$error":"#N/A"}},{"$f":"MATCH(Calc2!D$112,Trucks!$B39:$B$49,0)","v":{"$error":"#N/A"}},{"$f":"MATCH(Calc2!E$112,Trucks!$B39:$B$49,0)","v":{"$error":"#N/A"}},{"$f":"MATCH(Calc2!F$112,Trucks!$B39:$B$49,0)","v":1},{"$f":"MATCH(Calc2!G$112,Trucks!$B39:$B$49,0)","v":{"$error":"#N/A"}},{"$f":"MATCH(Calc2!H$112,Trucks!$B39:$B$49,0)","v":{"$error":"#N/A"}},{"$f":"MATCH(Calc2!I$112,Trucks!$B39:$B$49,0)","v":{"$error":"#N/A"}},{"$f":"MATCH(Calc2!J$112,Trucks!$B39:$B$49,0)","v":{"$error":"#N/A"}},{"$f":"MATCH(Calc2!K$112,Trucks!$B39:$B$49,0)","v":{"$error":"#N/A"}},{"$f":"MATCH(Calc2!L$112,Trucks!$B39:$B$49,0)","v":{"$error":"#N/A"}},{"$f":"MATCH(Calc2!M$112,Trucks!$B39:$B$49,0)","v":{"$error":"#N/A"}},{"$f":"MATCH(Calc2!N$112,Trucks!$B39:$B$49,0)","v":{"$error":"#N/A"}},{"$f":"MATCH(Calc2!O$112,Trucks!$B39:$B$49,0)","v":{"$error":"#N/A"}},{"$f":"MATCH(Calc2!P$112,Trucks!$B39:$B$49,0)","v":{"$error":"#N/A"}},{"$f":"MATCH(Calc2!Q$112,Trucks!$B39:$B$49,0)","v":{"$error":"#N/A"}},{"$f":"MATCH(Calc2!R$112,Trucks!$B39:$B$49,0)","v":{"$error":"#N/A"}},{"$f":"MATCH(Calc2!S$112,Trucks!$B39:$B$49,0)","v":{"$error":"#N/A"}},{"$f":"MATCH(Calc2!T$112,Trucks!$B39:$B$49,0)","v":{"$error":"#N/A"}},{"$f":"MATCH(Calc2!U$112,Trucks!$B39:$B$49,0)","v":{"$error":"#N/A"}},{"$f":"MATCH(Calc2!V$112,Trucks!$B39:$B$49,0)","v":{"$error":"#N/A"}},{"$f":"MATCH(Calc2!W$112,Trucks!$B39:$B$49,0)","v":{"$error":"#N/A"}},{"$f":"MATCH(Calc2!X$112,Trucks!$B39:$B$49,0)","v":{"$error":"#N/A"}},{"$f":"MATCH(Calc2!Y$112,Trucks!$B39:$B$49,0)","v":{"$error":"#N/A"}},{"$f":"MATCH(Calc2!Z$112,Trucks!$B39:$B$49,0)","v":{"$error":"#N/A"}},{"$f":"MATCH(Calc2!AA$112,Trucks!$B39:$B$49,0)","v":{"$error":"#N/A"}},{"$f":"MATCH(Calc2!AB$112,Trucks!$B39:$B$49,0)","v":{"$error":"#N/A"}}]
[null,null,{"$f":"MATCH(Calc2!C$112,Trucks!$B40:$B$49,0)","v":{"$error":"#N/A"}},{"$f":"MATCH(Calc2!D$112,Trucks!$B40:$B$49,0)","v":{"$error":"#N/A"}},{"$f":"MATCH(Calc2!E$112,Trucks!$B40:$B$49,0)","v":{"$error":"#N/A"}},{"$f":"MATCH(Calc2!F$112,Trucks!$B40:$B$49,0)","v":1},{"$f":"MATCH(Calc2!G$112,Trucks!$B40:$B$49,0)","v":{"$error":"#N/A"}},{"$f":"MATCH(Calc2!H$112,Trucks!$B40:$B$49,0)","v":{"$error":"#N/A"}},{"$f":"MATCH(Calc2!I$112,Trucks!$B40:$B$49,0)","v":{"$error":"#N/A"}},{"$f":"MATCH(Calc2!J$112,Trucks!$B40:$B$49,0)","v":{"$error":"#N/A"}},{"$f":"MATCH(Calc2!K$112,Trucks!$B40:$B$49,0)","v":{"$error":"#N/A"}},{"$f":"MATCH(Calc2!L$112,Trucks!$B40:$B$49,0)","v":{"$error":"#N/A"}},{"$f":"MATCH(Calc2!M$112,Trucks!$B40:$B$49,0)","v":{"$error":"#N/A"}},{"$f":"MATCH(Calc2!N$112,Trucks!$B40:$B$49,0)","v":{"$error":"#N/A"}},{"$f":"MATCH(Calc2!O$112,Trucks!$B40:$B$49,0)","v":{"$error":"#N/A"}},{"$f":"MATCH(Calc2!P$112,Trucks!$B40:$B$49,0)","v":{"$error":"#N/A"}},{"$f":"MATCH(Calc2!Q$112,Trucks!$B40:$B$49,0)","v":{"$error":"#N/A"}},{"$f":"MATCH(Calc2!R$112,Trucks!$B40:$B$49,0)","v":{"$error":"#N/A"}},{"$f":"MATCH(Calc2!S$112,Trucks!$B40:$B$49,0)","v":{"$error":"#N/A"}},{"$f":"MATCH(Calc2!T$112,Trucks!$B40:$B$49,0)","v":{"$error":"#N/A"}},{"$f":"MATCH(Calc2!U$112,Trucks!$B40:$B$49,0)","v":{"$error":"#N/A"}},{"$f":"MATCH(Calc2!V$112,Trucks!$B40:$B$49,0)","v":{"$error":"#N/A"}},{"$f":"MATCH(Calc2!W$112,Trucks!$B40:$B$49,0)","v":{"$error":"#N/A"}},{"$f":"MATCH(Calc2!X$112,Trucks!$B40:$B$49,0)","v":{"$error":"#N/A"}},{"$f":"MATCH(Calc2!Y$112,Trucks!$B40:$B$49,0)","v":{"$error":"#N/A"}},{"$f":"MATCH(Calc2!Z$112,Trucks!$B40:$B$49,0)","v":{"$error":"#N/A"}},{"$f":"MATCH(Calc2!AA$112,Trucks!$B40:$B$49,0)","v":{"$error":"#N/A"}},{"$f":"MATCH(Calc2!AB$112,Trucks!$B40:$B$49,0)","v":{"$error":"#N/A"}}]
[null,null,{"$f":"MATCH(Calc2!C$112,Trucks!$B41:$B$49,0)","v":{"$error":"#N/A"}},{"$f":"MATCH(Calc2!D$112,Trucks!$B41:$B$49,0)","v":{"$error":"#N/A"}},{"$f":"MATCH(Calc2!E$112,Trucks!$B41:$B$49,0)","v":{"$error":"#N/A"}},{"$f":"MATCH(Calc2!F$112,Trucks!$B41:$B$49,0)","v":1},{"$f":"MATCH(Calc2!G$112,Trucks!$B41:$B$49,0)","v":{"$error":"#N/A"}},{"$f":"MATCH(Calc2!H$112,Trucks!$B41:$B$49,0)","v":{"$error":"#N/A"}},{"$f":"MATCH(Calc2!I$112,Trucks!$B41:$B$49,0)","v":{"$error":"#N/A"}},{"$f":"MATCH(Calc2!J$112,Trucks!$B41:$B$49,0)","v":{"$error":"#N/A"}},{"$f":"MATCH(Calc2!K$112,Trucks!$B41:$B$49,0)","v":{"$error":"#N/A"}},{"$f":"MATCH(Calc2!L$112,Trucks!$B41:$B$49,0)","v":{"$error":"#N/A"}},{"$f":"MATCH(Calc2!M$112,Trucks!$B41:$B$49,0)","v":{"$error":"#N/A"}},{"$f":"MATCH(Calc2!N$112,Trucks!$B41:$B$49,0)","v":{"$error":"#N/A"}},{"$f":"MATCH(Calc2!O$112,Trucks!$B41:$B$49,0)","v":{"$error":"#N/A"}},{"$f":"MATCH(Calc2!P$112,Trucks!$B41:$B$49,0)","v":{"$error":"#N/A"}},{"$f":"MATCH(Calc2!Q$112,Trucks!$B41:$B$49,0)","v":{"$error":"#N/A"}},{"$f":"MATCH(Calc2!R$112,Trucks!$B41:$B$49,0)","v":{"$error":"#N/A"}},{"$f":"MATCH(Calc2!S$112,Trucks!$B41:$B$49,0)","v":{"$error":"#N/A"}},{"$f":"MATCH(Calc2!T$112,Trucks!$B41:$B$49,0)","v":{"$error":"#N/A"}},{"$f":"MATCH(Calc2!U$112,Trucks!$B41:$B$49,0)","v":{"$error":"#N/A"}},{"$f":"MATCH(Calc2!V$112,Trucks!$B41:$B$49,0)","v":{"$error":"#N/A"}},{"$f":"MATCH(Calc2!W$112,Trucks!$B41:$B$49,0)","v":{"$error":"#N/A"}},{"$f":"MATCH(Calc2!X$112,Trucks!$B41:$B$49,0)","v":{"$error":"#N/A"}},{"$f":"MATCH(Calc2!Y$112,Trucks!$B41:$B$49,0)","v":{"$error":"#N/A"}},{"$f":"MATCH(Calc2!Z$112,Trucks!$B41:$B$49,0)","v":{"$error":"#N/A"}},{"$f":"MATCH(Calc2!AA$112,Trucks!$B41:$B$49,0)","v":{"$error":"#N/A"}},{"$f":"MATCH(Calc2!AB$112,Trucks!$B41:$B$49,0)","v":{"$error":"#N/A"}}]
[null,null,{"$f":"MATCH(Calc2!C$112,Trucks!$B42:$B$49,0)","v":{"$error":"#N/A"}},{"$f":"MATCH(Calc2!D$112,Trucks!$B42:$B$49,0)","v":{"$error":"#N/A"}},{"$f":"MATCH(Calc2!E$112,Trucks!$B42:$B$49,0)","v":{"$error":"#N/A"}},{"$f":"MATCH(Calc2!F$112,Trucks!$B42:$B$49,0)","v":{"$error":"#N/A"}},{"$f":"MATCH(Calc2!G$112,Trucks!$B42:$B$49,0)","v":{"$error":"#N/A"}},{"$f":"MATCH(Calc2!H$112,Trucks!$B42:$B$49,0)","v":{"$error":"#N/A"}},{"$f":"MATCH(Calc2!I$112,Trucks!$B42:$B$49,0)","v":{"$error":"#N/A"}},{"$f":"MATCH(Calc2!J$112,Trucks!$B42:$B$49,0)","v":{"$error":"#N/A"}},{"$f":"MATCH(Calc2!K$112,Trucks!$B42:$B$49,0)","v":{"$error":"#N/A"}},{"$f":"MATCH(Calc2!L$112,Trucks!$B42:$B$49,0)","v":{"$error":"#N/A"}},{"$f":"MATCH(Calc2!M$112,Trucks!$B42:$B$49,0)","v":{"$error":"#N/A"}},{"$f":"MATCH(Calc2!N$112,Trucks!$B42:$B$49,0)","v":{"$error":"#N/A"}},{"$f":"MATCH(Calc2!O$112,Trucks!$B42:$B$49,0)","v":{"$error":"#N/A"}},{"$f":"MATCH(Calc2!P$112,Trucks!$B42:$B$49,0)","v":{"$error":"#N/A"}},{"$f":"MATCH(Calc2!Q$112,Trucks!$B42:$B$49,0)","v":{"$error":"#N/A"}},{"$f":"MATCH(Calc2!R$112,Trucks!$B42:$B$49,0)","v":{"$error":"#N/A"}},{"$f":"MATCH(Calc2!S$112,Trucks!$B42:$B$49,0)","v":{"$error":"#N/A"}},{"$f":"MATCH(Calc2!T$112,Trucks!$B42:$B$49,0)","v":{"$error":"#N/A"}},{"$f":"MATCH(Calc2!U$112,Trucks!$B42:$B$49,0)","v":{"$error":"#N/A"}},{"$f":"MATCH(Calc2!V$112,Trucks!$B42:$B$49,0)","v":{"$error":"#N/A"}},{"$f":"MATCH(Calc2!W$112,Trucks!$B42:$B$49,0)","v":{"$error":"#N/A"}},{"$f":"MATCH(Calc2!X$112,Trucks!$B42:$B$49,0)","v":{"$error":"#N/A"}},{"$f":"MATCH(Calc2!Y$112,Trucks!$B42:$B$49,0)","v":{"$error":"#N/A"}},{"$f":"MATCH(Calc2!Z$112,Trucks!$B42:$B$49,0)","v":{"$error":"#N/A"}},{"$f":"MATCH(Calc2!AA$112,Trucks!$B42:$B$49,0)","v":{"$error":"#N/A"}},{"$f":"MATCH(Calc2!AB$112,Trucks!$B42:$B$49,0)","v":{"$error":"#N/A"}}]
[null,null,{"$f":"MATCH(Calc2!C$112,Trucks!$B43:$B$49,0)","v":{"$error":"#N/A"}},{"$f":"MATCH(Calc2!D$112,Trucks!$B43:$B$49,0)","v":{"$error":"#N/A"}},{"$f":"MATCH(Calc2!E$112,Trucks!$B43:$B$49,0)","v":{"$error":"#N/A"}},{"$f":"MATCH(Calc2!F$112,Trucks!$B43:$B$49,0)","v":{"$error":"#N/A"}},{"$f":"MATCH(Calc2!G$112,Trucks!$B43:$B$49,0)","v":{"$error":"#N/A"}},{"$f":"MATCH(Calc2!H$112,Trucks!$B43:$B$49,0)","v":{"$error":"#N/A"}},{"$f":"MATCH(Calc2!I$112,Trucks!$B43:$B$49,0)","v":{"$error":"#N/A"}},{"$f":"MATCH(Calc2!J$112,Trucks!$B43:$B$49,0)","v":{"$error":"#N/A"}},{"$f":"MATCH(Calc2!K$112,Trucks!$B43:$B$49,0)","v":{"$error":"#N/A"}},{"$f":"MATCH(Calc2!L$112,Trucks!$B43:$B$49,0)","v":{"$error":"#N/A"}},{"$f":"MATCH(Calc2!M$112,Trucks!$B43:$B$49,0)","v":{"$error":"#N/A"}},{"$f":"MATCH(Calc2!N$112,Trucks!$B43:$B$49,0)","v":{"$error":"#N/A"}},{"$f":"MATCH(Calc2!O$112,Trucks!$B43:$B$49,0)","v":{"$error":"#N/A"}},{"$f":"MATCH(Calc2!P$112,Trucks!$B43:$B$49,0)","v":{"$error":"#N/A"}},{"$f":"MATCH(Calc2!Q$112,Trucks!$B43:$B$49,0)","v":{"$error":"#N/A"}},{"$f":"MATCH(Calc2!R$112,Trucks!$B43:$B$49,0)","v":{"$error":"#N/A"}},{"$f":"MATCH(Calc2!S$112,Trucks!$B43:$B$49,0)","v":{"$error":"#N/A"}},{"$f":"MATCH(Calc2!T$112,Trucks!$B43:$B$49,0)","v":{"$error":"#N/A"}},{"$f":"MATCH(Calc2!U$112,Trucks!$B43:$B$49,0)","v":{"$error":"#N/A"}},{"$f":"MATCH(Calc2!V$112,Trucks!$B43:$B$49,0)","v":{"$error":"#N/A"}},{"$f":"MATCH(Calc2!W$112,Trucks!$B43:$B$49,0)","v":{"$error":"#N/A"}},{"$f":"MATCH(Calc2!X$112,Trucks!$B43:$B$49,0)","v":{"$error":"#N/A"}},{"$f":"MATCH(Calc2!Y$112,Trucks!$B43:$B$49,0)","v":{"$error":"#N/A"}},{"$f":"MATCH(Calc2!Z$112,Trucks!$B43:$B$49,0)","v":{"$error":"#N/A"}},{"$f":"MATCH(Calc2!AA$112,Trucks!$B43:$B$49,0)","v":{"$error":"#N/A"}},{"$f":"MATCH(Calc2!AB$112,Trucks!$B43:$B$49,0)","v":{"$error":"#N/A"}}]
[null,null,{"$f":"MATCH(Calc2!C$112,Trucks!$B44:$B$49,0)","v":{"$error":"#N/A"}},{"$f":"MATCH(Calc2!D$112,Trucks!$B44:$B$49,0)","v":{"$error":"#N/A"}},{"$f":"MATCH(Calc2!E$112,Trucks!$B44:$B$49,0)","v":{"$error":"#N/A"}},{"$f":"MATCH(Calc2!F$112,Trucks!$B44:$B$49,0)","v":{"$error":"#N/A"}},{"$f":"MATCH(Calc2!G$112,Trucks!$B44:$B$49,0)","v":{"$error":"#N/A"}},{"$f":"MATCH(Calc2!H$112,Trucks!$B44:$B$49,0)","v":{"$error":"#N/A"}},{"$f":"MATCH(Calc2!I$112,Trucks!$B44:$B$49,0)","v":{"$error":"#N/A"}},{"$f":"MATCH(Calc2!J$112,Trucks!$B44:$B$49,0)","v":{"$error":"#N/A"}},{"$f":"MATCH(Calc2!K$112,Trucks!$B44:$B$49,0)","v":{"$error":"#N/A"}},{"$f":"MATCH(Calc2!L$112,Trucks!$B44:$B$49,0)","v":{"$error":"#N/A"}},{"$f":"MATCH(Calc2!M$112,Trucks!$B44:$B$49,0)","v":{"$error":"#N/A"}},{"$f":"MATCH(Calc2!N$112,Trucks!$B44:$B$49,0)","v":{"$error":"#N/A"}},{"$f":"MATCH(Calc2!O$112,Trucks!$B44:$B$49,0)","v":{"$error":"#N/A"}},{"$f":"MATCH(Calc2!P$112,Trucks!$B44:$B$49,0)","v":{"$error":"#N/A"}},{"$f":"MATCH(Calc2!Q$112,Trucks!$B44:$B$49,0)","v":{"$error":"#N/A"}},{"$f":"MATCH(Calc2!R$112,Trucks!$B44:$B$49,0)","v":{"$error":"#N/A"}},{"$f":"MATCH(Calc2!S$112,Trucks!$B44:$B$49,0)","v":{"$error":"#N/A"}},{"$f":"MATCH(Calc2!T$112,Trucks!$B44:$B$49,0)","v":{"$error":"#N/A"}},{"$f":"MATCH(Calc2!U$112,Trucks!$B44:$B$49,0)","v":{"$error":"#N/A"}},{"$f":"MATCH(Calc2!V$112,Trucks!$B44:$B$49,0)","v":{"$error":"#N/A"}},{"$f":"MATCH(Calc2!W$112,Trucks!$B44:$B$49,0)","v":{"$error":"#N/A"}},{"$f":"MATCH(Calc2!X$112,Trucks!$B44:$B$49,0)","v":{"$error":"#N/A"}},{"$f":"MATCH(Calc2!Y$112,Trucks!$B44:$B$49,0)","v":{"$error":"#N/A"}},{"$f":"MATCH(Calc2!Z$112,Trucks!$B44:$B$49,0)","v":{"$error":"#N/A"}},{"$f":"MATCH(Calc2!AA$112,Trucks!$B44:$B$49,0)","v":{"$error":"#N/A"}},{"$f":"MATCH(Calc2!AB$112,Trucks!$B44:$B$49,0)","v":{"$error":"#N/A"}}]
[null,null,{"$f":"MATCH(Calc2!C$112,Trucks!$B45:$B$49,0)","v":{"$error":"#N/A"}},{"$f":"MATCH(Calc2!D$112,Trucks!$B45:$B$49,0)","v":{"$error":"#N/A"}},{"$f":"MATCH(Calc2!E$112,Trucks!$B45:$B$49,0)","v":{"$error":"#N/A"}},{"$f":"MATCH(Calc2!F$112,Trucks!$B45:$B$49,0)","v":{"$error":"#N/A"}},{"$f":"MATCH(Calc2!G$112,Trucks!$B45:$B$49,0)","v":{"$error":"#N/A"}},{"$f":"MATCH(Calc2!H$112,Trucks!$B45:$B$49,0)","v":{"$error":"#N/A"}},{"$f":"MATCH(Calc2!I$112,Trucks!$B45:$B$49,0)","v":{"$error":"#N/A"}},{"$f":"MATCH(Calc2!J$112,Trucks!$B45:$B$49,0)","v":{"$error":"#N/A"}},{"$f":"MATCH(Calc2!K$112,Trucks!$B45:$B$49,0)","v":{"$error":"#N/A"}},{"$f":"MATCH(Calc2!L$112,Trucks!$B45:$B$49,0)","v":{"$error":"#N/A"}},{"$f":"MATCH(Calc2!M$112,Trucks!$B45:$B$49,0)","v":{"$error":"#N/A"}},{"$f":"MATCH(Calc2!N$112,Trucks!$B45:$B$49,0)","v":{"$error":"#N/A"}},{"$f":"MATCH(Calc2!O$112,Trucks!$B45:$B$49,0)","v":{"$error":"#N/A"}},{"$f":"MATCH(Calc2!P$112,Trucks!$B45:$B$49,0)","v":{"$error":"#N/A"}},{"$f":"MATCH(Calc2!Q$112,Trucks!$B45:$B$49,0)","v":{"$error":"#N/A"}},{"$f":"MATCH(Calc2!R$112,Trucks!$B45:$B$49,0)","v":{"$error":"#N/A"}},{"$f":"MATCH(Calc2!S$112,Trucks!$B45:$B$49,0)","v":{"$error":"#N/A"}},{"$f":"MATCH(Calc2!T$112,Trucks!$B45:$B$49,0)","v":{"$error":"#N/A"}},{"$f":"MATCH(Calc2!U$112,Trucks!$B45:$B$49,0)","v":{"$error":"#N/A"}},{"$f":"MATCH(Calc2!V$112,Trucks!$B45:$B$49,0)","v":{"$error":"#N/A"}},{"$f":"MATCH(Calc2!W$112,Trucks!$B45:$B$49,0)","v":{"$error":"#N/A"}},{"$f":"MATCH(Calc2!X$112,Trucks!$B45:$B$49,0)","v":{"$error":"#N/A"}},{"$f":"MATCH(Calc2!Y$112,Trucks!$B45:$B$49,0)","v":{"$error":"#N/A"}},{"$f":"MATCH(Calc2!Z$112,Trucks!$B45:$B$49,0)","v":{"$error":"#N/A"}},{"$f":"MATCH(Calc2!AA$112,Trucks!$B45:$B$49,0)","v":{"$error":"#N/A"}},{"$f":"MATCH(Calc2!AB$112,Trucks!$B45:$B$49,0)","v":{"$error":"#N/A"}}]
[null,null,{"$f":"MATCH(Calc2!C$112,Trucks!$B46:$B$49,0)","v":{"$error":"#N/A"}},{"$f":"MATCH(Calc2!D$112,Trucks!$B46:$B$49,0)","v":{"$error":"#N/A"}},{"$f":"MATCH(Calc2!E$112,Trucks!$B46:$B$49,0)","v":{"$error":"#N/A"}},{"$f":"MATCH(Calc2!F$112,Trucks!$B46:$B$49,0)","v":{"$error":"#N/A"}},{"$f":"MATCH(Calc2!G$112,Trucks!$B46:$B$49,0)","v":{"$error":"#N/A"}},{"$f":"MATCH(Calc2!H$112,Trucks!$B46:$B$49,0)","v":{"$error":"#N/A"}},{"$f":"MATCH(Calc2!I$112,Trucks!$B46:$B$49,0)","v":{"$error":"#N/A"}},{"$f":"MATCH(Calc2!J$112,Trucks!$B46:$B$49,0)","v":{"$error":"#N/A"}},{"$f":"MATCH(Calc2!K$112,Trucks!$B46:$B$49,0)","v":{"$error":"#N/A"}},{"$f":"MATCH(Calc2!L$112,Trucks!$B46:$B$49,0)","v":{"$error":"#N/A"}},{"$f":"MATCH(Calc2!M$112,Trucks!$B46:$B$49,0)","v":{"$error":"#N/A"}},{"$f":"MATCH(Calc2!N$112,Trucks!$B46:$B$49,0)","v":{"$error":"#N/A"}},{"$f":"MATCH(Calc2!O$112,Trucks!$B46:$B$49,0)","v":{"$error":"#N/A"}},{"$f":"MATCH(Calc2!P$112,Trucks!$B46:$B$49,0)","v":{"$error":"#N/A"}},{"$f":"MATCH(Calc2!Q$112,Trucks!$B46:$B$49,0)","v":{"$error":"#N/A"}},{"$f":"MATCH(Calc2!R$112,Trucks!$B46:$B$49,0)","v":{"$error":"#N/A"}},{"$f":"MATCH(Calc2!S$112,Trucks!$B46:$B$49,0)","v":{"$error":"#N/A"}},{"$f":"MATCH(Calc2!T$112,Trucks!$B46:$B$49,0)","v":{"$error":"#N/A"}},{"$f":"MATCH(Calc2!U$112,Trucks!$B46:$B$49,0)","v":{"$error":"#N/A"}},{"$f":"MATCH(Calc2!V$112,Trucks!$B46:$B$49,0)","v":{"$error":"#N/A"}},{"$f":"MATCH(Calc2!W$112,Trucks!$B46:$B$49,0)","v":{"$error":"#N/A"}},{"$f":"MATCH(Calc2!X$112,Trucks!$B46:$B$49,0)","v":{"$error":"#N/A"}},{"$f":"MATCH(Calc2!Y$112,Trucks!$B46:$B$49,0)","v":{"$error":"#N/A"}},{"$f":"MATCH(Calc2!Z$112,Trucks!$B46:$B$49,0)","v":{"$error":"#N/A"}},{"$f":"MATCH(Calc2!AA$112,Trucks!$B46:$B$49,0)","v":{"$error":"#N/A"}},{"$f":"MATCH(Calc2!AB$112,Trucks!$B46:$B$49,0)","v":{"$error":"#N/A"}}]
[null,null,{"$f":"MATCH(Calc2!C$112,Trucks!$B47:$B$49,0)","v":{"$error":"#N/A"}},{"$f":"MATCH(Calc2!D$112,Trucks!$B47:$B$49,0)","v":{"$error":"#N/A"}},{"$f":"MATCH(Calc2!E$112,Trucks!$B47:$B$49,0)","v":{"$error":"#N/A"}},{"$f":"MATCH(Calc2!F$112,Trucks!$B47:$B$49,0)","v":{"$error":"#N/A"}},{"$f":"MATCH(Calc2!G$112,Trucks!$B47:$B$49,0)","v":{"$error":"#N/A"}},{"$f":"MATCH(Calc2!H$112,Trucks!$B47:$B$49,0)","v":{"$error":"#N/A"}},{"$f":"MATCH(Calc2!I$112,Trucks!$B47:$B$49,0)","v":{"$error":"#N/A"}},{"$f":"MATCH(Calc2!J$112,Trucks!$B47:$B$49,0)","v":{"$error":"#N/A"}},{"$f":"MATCH(Calc2!K$112,Trucks!$B47:$B$49,0)","v":{"$error":"#N/A"}},{"$f":"MATCH(Calc2!L$112,Trucks!$B47:$B$49,0)","v":{"$error":"#N/A"}},{"$f":"MATCH(Calc2!M$112,Trucks!$B47:$B$49,0)","v":{"$error":"#N/A"}},{"$f":"MATCH(Calc2!N$112,Trucks!$B47:$B$49,0)","v":{"$error":"#N/A"}},{"$f":"MATCH(Calc2!O$112,Trucks!$B47:$B$49,0)","v":{"$error":"#N/A"}},{"$f":"MATCH(Calc2!P$112,Trucks!$B47:$B$49,0)","v":{"$error":"#N/A"}},{"$f":"MATCH(Calc2!Q$112,Trucks!$B47:$B$49,0)","v":{"$error":"#N/A"}},{"$f":"MATCH(Calc2!R$112,Trucks!$B47:$B$49,0)","v":{"$error":"#N/A"}},{"$f":"MATCH(Calc2!S$112,Trucks!$B47:$B$49,0)","v":{"$error":"#N/A"}},{"$f":"MATCH(Calc2!T$112,Trucks!$B47:$B$49,0)","v":{"$error":"#N/A"}},{"$f":"MATCH(Calc2!U$112,Trucks!$B47:$B$49,0)","v":{"$error":"#N/A"}},{"$f":"MATCH(Calc2!V$112,Trucks!$B47:$B$49,0)","v":{"$error":"#N/A"}},{"$f":"MATCH(Calc2!W$112,Trucks!$B47:$B$49,0)","v":{"$error":"#N/A"}},{"$f":"MATCH(Calc2!X$112,Trucks!$B47:$B$49,0)","v":{"$error":"#N/A"}},{"$f":"MATCH(Calc2!Y$112,Trucks!$B47:$B$49,0)","v":{"$error":"#N/A"}},{"$f":"MATCH(Calc2!Z$112,Trucks!$B47:$B$49,0)","v":{"$error":"#N/A"}},{"$f":"MATCH(Calc2!AA$112,Trucks!$B47:$B$49,0)","v":{"$error":"#N/A"}},{"$f":"MATCH(Calc2!AB$112,Trucks!$B47:$B$49,0)","v":{"$error":"#N/A"}}]
[null,null,{"$f":"MATCH(Calc2!C$112,Trucks!$B48:$B$49,0)","v":{"$error":"#N/A"}},{"$f":"MATCH(Calc2!D$112,Trucks!$B48:$B$49,0)","v":{"$error":"#N/A"}},{"$f":"MATCH(Calc2!E$112,Trucks!$B48:$B$49,0)","v":{"$error":"#N/A"}},{"$f":"MATCH(Calc2!F$112,Trucks!$B48:$B$49,0)","v":{"$error":"#N/A"}},{"$f":"MATCH(Calc2!G$112,Trucks!$B48:$B$49,0)","v":{"$error":"#N/A"}},{"$f":"MATCH(Calc2!H$112,Trucks!$B48:$B$49,0)","v":{"$error":"#N/A"}},{"$f":"MATCH(Calc2!I$112,Trucks!$B48:$B$49,0)","v":{"$error":"#N/A"}},{"$f":"MATCH(Calc2!J$112,Trucks!$B48:$B$49,0)","v":{"$error":"#N/A"}},{"$f":"MATCH(Calc2!K$112,Trucks!$B48:$B$49,0)","v":{"$error":"#N/A"}},{"$f":"MATCH(Calc2!L$112,Trucks!$B48:$B$49,0)","v":{"$error":"#N/A"}},{"$f":"MATCH(Calc2!M$112,Trucks!$B48:$B$49,0)","v":{"$error":"#N/A"}},{"$f":"MATCH(Calc2!N$112,Trucks!$B48:$B$49,0)","v":{"$error":"#N/A"}},{"$f":"MATCH(Calc2!O$112,Trucks!$B48:$B$49,0)","v":{"$error":"#N/A"}},{"$f":"MATCH(Calc2!P$112,Trucks!$B48:$B$49,0)","v":{"$error":"#N/A"}},{"$f":"MATCH(Calc2!Q$112,Trucks!$B48:$B$49,0)","v":{"$error":"#N/A"}},{"$f":"MATCH(Calc2!R$112,Trucks!$B48:$B$49,0)","v":{"$error":"#N/A"}},{"$f":"MATCH(Calc2!S$112,Trucks!$B48:$B$49,0)","v":{"$error":"#N/A"}},{"$f":"MATCH(Calc2!T$112,Trucks!$B48:$B$49,0)","v":{"$error":"#N/A"}},{"$f":"MATCH(Calc2!U$112,Trucks!$B48:$B$49,0)","v":{"$error":"#N/A"}},{"$f":"MATCH(Calc2!V$112,Trucks!$B48:$B$49,0)","v":{"$error":"#N/A"}},{"$f":"MATCH(Calc2!W$112,Trucks!$B48:$B$49,0)","v":{"$error":"#N/A"}},{"$f":"MATCH(Calc2!X$112,Trucks!$B48:$B$49,0)","v":{"$error":"#N/A"}},{"$f":"MATCH(Calc2!Y$112,Trucks!$B48:$B$49,0)","v":{"$error":"#N/A"}},{"$f":"MATCH(Calc2!Z$112,Trucks!$B48:$B$49,0)","v":{"$error":"#N/A"}},{"$f":"MATCH(Calc2!AA$112,Trucks!$B48:$B$49,0)","v":{"$error":"#N/A"}},{"$f":"MATCH(Calc2!AB$112,Trucks!$B48:$B$49,0)","v":{"$error":"#N/A"}}]
[null,null,{"$f":"MATCH(Calc2!C$112,Trucks!$B49:$B$49,0)","v":{"$error":"#N/A"}},{"$f":"MATCH(Calc2!D$112,Trucks!$B49:$B$49,0)","v":{"$error":"#N/A"}},{"$f":"MATCH(Calc2!E$112,Trucks!$B49:$B$49,0)","v":{"$error":"#N/A"}},{"$f":"MATCH(Calc2!F$112,Trucks!$B49:$B$49,0)","v":{"$error":"#N/A"}},{"$f":"MATCH(Calc2!G$112,Trucks!$B49:$B$49,0)","v":{"$error":"#N/A"}},{"$f":"MATCH(Calc2!H$112,Trucks!$B49:$B$49,0)","v":{"$error":"#N/A"}},{"$f":"MATCH(Calc2!I$112,Trucks!$B49:$B$49,0)","v":{"$error":"#N/A"}},{"$f":"MATCH(Calc2!J$112,Trucks!$B49:$B$49,0)","v":{"$error":"#N/A"}},{"$f":"MATCH(Calc2!K$112,Trucks!$B49:$B$49,0)","v":{"$error":"#N/A"}},{"$f":"MATCH(Calc2!L$112,Trucks!$B49:$B$49,0)","v":{"$error":"#N/A"}},{"$f":"MATCH(Calc2!M$112,Trucks!$B49:$B$49,0)","v":{"$error":"#N/A"}},{"$f":"MATCH(Calc2!N$112,Trucks!$B49:$B$49,0)","v":{"$error":"#N/A"}},{"$f":"MATCH(Calc2!O$112,Trucks!$B49:$B$49,0)","v":{"$error":"#N/A"}},{"$f":"MATCH(Calc2!P$112,Trucks!$B49:$B$49,0)","v":{"$error":"#N/A"}},{"$f":"MATCH(Calc2!Q$112,Trucks!$B49:$B$49,0)","v":{"$error":"#N/A"}},{"$f":"MATCH(Calc2!R$112,Trucks!$B49:$B$49,0)","v":{"$error":"#N/A"}},{"$f":"MATCH(Calc2!S$112,Trucks!$B49:$B$49,0)","v":{"$error":"#N/A"}},{"$f":"MATCH(Calc2!T$112,Trucks!$B49:$B$49,0)","v":{"$error":"#N/A"}},{"$f":"MATCH(Calc2!U$112,Trucks!$B49:$B$49,0)","v":{"$error":"#N/A"}},{"$f":"MATCH(Calc2!V$112,Trucks!$B49:$B$49,0)","v":{"$error":"#N/A"}},{"$f":"MATCH(Calc2!W$112,Trucks!$B49:$B$49,0)","v":{"$error":"#N/A"}},{"$f":"MATCH(Calc2!X$112,Trucks!$B49:$B$49,0)","v":{"$error":"#N/A"}},{"$f":"MATCH(Calc2!Y$112,Trucks!$B49:$B$49,0)","v":{"$error":"#N/A"}},{"$f":"MATCH(Calc2!Z$112,Trucks!$B49:$B$49,0)","v":{"$error":"#N/A"}},{"$f":"MATCH(Calc2!AA$112,Trucks!$B49:$B$49,0)","v":{"$error":"#N/A"}},{"$f":"MATCH(Calc2!AB$112,Trucks!$B49:$B$49,0)","v":{"$error":"#N/A"}}]
[null,null,{"$f":"MATCH(Calc2!C$112,Trucks!$B$49:$B50,0)","v":{"$error":"#N/A"}},{"$f":"MATCH(Calc2!D$112,Trucks!$B$49:$B50,0)","v":{"$error":"#N/A"}},{"$f":"MATCH(Calc2!E$112,Trucks!$B$49:$B50,0)","v":{"$error":"#N/A"}},{"$f":"MATCH(Calc2!F$112,Trucks!$B$49:$B50,0)","v":{"$error":"#N/A"}},{"$f":"MATCH(Calc2!G$112,Trucks!$B$49:$B50,0)","v":{"$error":"#N/A"}},{"$f":"MATCH(Calc2!H$112,Trucks!$B$49:$B50,0)","v":{"$error":"#N/A"}},{"$f":"MATCH(Calc2!I$112,Trucks!$B$49:$B50,0)","v":{"$error":"#N/A"}},{"$f":"MATCH(Calc2!J$112,Trucks!$B$49:$B50,0)","v":{"$error":"#N/A"}},{"$f":"MATCH(Calc2!K$112,Trucks!$B$49:$B50,0)","v":{"$error":"#N/A"}},{"$f":"MATCH(Calc2!L$112,Trucks!$B$49:$B50,0)","v":{"$error":"#N/A"}},{"$f":"MATCH(Calc2!M$112,Trucks!$B$49:$B50,0)","v":{"$error":"#N/A"}},{"$f":"MATCH(Calc2!N$112,Trucks!$B$49:$B50,0)","v":{"$error":"#N/A"}},{"$f":"MATCH(Calc2!O$112,Trucks!$B$49:$B50,0)","v":{"$error":"#N/A"}},{"$f":"MATCH(Calc2!P$112,Trucks!$B$49:$B50,0)","v":{"$error":"#N/A"}},{"$f":"MATCH(Calc2!Q$112,Trucks!$B$49:$B50,0)","v":{"$error":"#N/A"}},{"$f":"MATCH(Calc2!R$112,Trucks!$B$49:$B50,0)","v":{"$error":"#N/A"}},{"$f":"MATCH(Calc2!S$112,Trucks!$B$49:$B50,0)","v":{"$error":"#N/A"}},{"$f":"MATCH(Calc2!T$112,Trucks!$B$49:$B50,0)","v":{"$error":"#N/A"}},{"$f":"MATCH(Calc2!U$112,Trucks!$B$49:$B50,0)","v":{"$error":"#N/A"}},{"$f":"MATCH(Calc2!V$112,Trucks!$B$49:$B50,0)","v":{"$error":"#N/A"}},{"$f":"MATCH(Calc2!W$112,Trucks!$B$49:$B50,0)","v":{"$error":"#N/A"}},{"$f":"MATCH(Calc2!X$112,Trucks!$B$49:$B50,0)","v":{"$error":"#N/A"}},{"$f":"MATCH(Calc2!Y$112,Trucks!$B$49:$B50,0)","v":{"$error":"#N/A"}},{"$f":"MATCH(Calc2!Z$112,Trucks!$B$49:$B50,0)","v":{"$error":"#N/A"}},{"$f":"MATCH(Calc2!AA$112,Trucks!$B$49:$B50,0)","v":{"$error":"#N/A"}},{"$f":"MATCH(Calc2!AB$112,Trucks!$B$49:$B50,0)","v":{"$error":"#N/A"}}]
[null,null,{"$f":"MATCH(Calc2!C$112,Trucks!$B$49:$B51,0)","v":{"$error":"#N/A"}},{"$f":"MATCH(Calc2!D$112,Trucks!$B$49:$B51,0)","v":{"$error":"#N/A"}},{"$f":"MATCH(Calc2!E$112,Trucks!$B$49:$B51,0)","v":{"$error":"#N/A"}},{"$f":"MATCH(Calc2!F$112,Trucks!$B$49:$B51,0)","v":{"$error":"#N/A"}},{"$f":"MATCH(Calc2!G$112,Trucks!$B$49:$B51,0)","v":{"$error":"#N/A"}},{"$f":"MATCH(Calc2!H$112,Trucks!$B$49:$B51,0)","v":{"$error":"#N/A"}},{"$f":"MATCH(Calc2!I$112,Trucks!$B$49:$B51,0)","v":{"$error":"#N/A"}},{"$f":"MATCH(Calc2!J$112,Trucks!$B$49:$B51,0)","v":{"$error":"#N/A"}},{"$f":"MATCH(Calc2!K$112,Trucks!$B$49:$B51,0)","v":{"$error":"#N/A"}},{"$f":"MATCH(Calc2!L$112,Trucks!$B$49:$B51,0)","v":{"$error":"#N/A"}},{"$f":"MATCH(Calc2!M$112,Trucks!$B$49:$B51,0)","v":{"$error":"#N/A"}},{"$f":"MATCH(Calc2!N$112,Trucks!$B$49:$B51,0)","v":{"$error":"#N/A"}},{"$f":"MATCH(Calc2!O$112,Trucks!$B$49:$B51,0)","v":{"$error":"#N/A"}},{"$f":"MATCH(Calc2!P$112,Trucks!$B$49:$B51,0)","v":{"$error":"#N/A"}},{"$f":"MATCH(Calc2!Q$112,Trucks!$B$49:$B51,0)","v":{"$error":"#N/A"}},{"$f":"MATCH(Calc2!R$112,Trucks!$B$49:$B51,0)","v":{"$error":"#N/A"}},{"$f":"MATCH(Calc2!S$112,Trucks!$B$49:$B51,0)","v":{"$error":"#N/A"}},{"$f":"MATCH(Calc2!T$112,Trucks!$B$49:$B51,0)","v":{"$error":"#N/A"}},{"$f":"MATCH(Calc2!U$112,Trucks!$B$49:$B51,0)","v":{"$error":"#N/A"}},{"$f":"MATCH(Calc2!V$112,Trucks!$B$49:$B51,0)","v":{"$error":"#N/A"}},{"$f":"MATCH(Calc2!W$112,Trucks!$B$49:$B51,0)","v":{"$error":"#N/A"}},{"$f":"MATCH(Calc2!X$112,Trucks!$B$49:$B51,0)","v":{"$error":"#N/A"}},{"$f":"MATCH(Calc2!Y$112,Trucks!$B$49:$B51,0)","v":{"$error":"#N/A"}},{"$f":"MATCH(Calc2!Z$112,Trucks!$B$49:$B51,0)","v":{"$error":"#N/A"}},{"$f":"MATCH(Calc2!AA$112,Trucks!$B$49:$B51,0)","v":{"$error":"#N/A"}},{"$f":"MATCH(Calc2!AB$112,Trucks!$B$49:$B51,0)","v":{"$error":"#N/A"}}]
[null,null,{"$f":"MATCH(Calc2!C$112,Trucks!$B$49:$B52,0)","v":{"$error":"#N/A"}},{"$f":"MATCH(Calc2!D$112,Trucks!$B$49:$B52,0)","v":{"$error":"#N/A"}},{"$f":"MATCH(Calc2!E$112,Trucks!$B$49:$B52,0)","v":{"$error":"#N/A"}},{"$f":"MATCH(Calc2!F$112,Trucks!$B$49:$B52,0)","v":{"$error":"#N/A"}},{"$f":"MATCH(Calc2!G$112,Trucks!$B$49:$B52,0)","v":{"$error":"#N/A"}},{"$f":"MATCH(Calc2!H$112,Trucks!$B$49:$B52,0)","v":{"$error":"#N/A"}},{"$f":"MATCH(Calc2!I$112,Trucks!$B$49:$B52,0)","v":{"$error":"#N/A"}},{"$f":"MATCH(Calc2!J$112,Trucks!$B$49:$B52,0)","v":{"$error":"#N/A"}},{"$f":"MATCH(Calc2!K$112,Trucks!$B$49:$B52,0)","v":{"$error":"#N/A"}},{"$f":"MATCH(Calc2!L$112,Trucks!$B$49:$B52,0)","v":{"$error":"#N/A"}},{"$f":"MATCH(Calc2!M$112,Trucks!$B$49:$B52,0)","v":{"$error":"#N/A"}},{"$f":"MATCH(Calc2!N$112,Trucks!$B$49:$B52,0)","v":{"$error":"#N/A"}},{"$f":"MATCH(Calc2!O$112,Trucks!$B$49:$B52,0)","v":{"$error":"#N/A"}},{"$f":"MATCH(Calc2!P$112,Trucks!$B$49:$B52,0)","v":{"$error":"#N/A"}},{"$f":"MATCH(Calc2!Q$112,Trucks!$B$49:$B52,0)","v":{"$error":"#N/A"}},{"$f":"MATCH(Calc2!R$112,Trucks!$B$49:$B52,0)","v":{"$error":"#N/A"}},{"$f":"MATCH(Calc2!S$112,Trucks!$B$49:$B52,0)","v":{"$error":"#N/A"}},{"$f":"MATCH(Calc2!T$112,Trucks!$B$49:$B52,0)","v":{"$error":"#N/A"}},{"$f":"MATCH(Calc2!U$112,Trucks!$B$49:$B52,0)","v":{"$error":"#N/A"}},{"$f":"MATCH(Calc2!V$112,Trucks!$B$49:$B52,0)","v":{"$error":"#N/A"}},{"$f":"MATCH(Calc2!W$112,Trucks!$B$49:$B52,0)","v":{"$error":"#N/A"}},{"$f":"MATCH(Calc2!X$112,Trucks!$B$49:$B52,0)","v":{"$error":"#N/A"}},{"$f":"MATCH(Calc2!Y$112,Trucks!$B$49:$B52,0)","v":{"$error":"#N/A"}},{"$f":"MATCH(Calc2!Z$112,Trucks!$B$49:$B52,0)","v":{"$error":"#N/A"}},{"$f":"MATCH(Calc2!AA$112,Trucks!$B$49:$B52,0)","v":{"$error":"#N/A"}},{"$f":"MATCH(Calc2!AB$112,Trucks!$B$49:$B52,0)","v":{"$error":"#N/A"}}]
[null,null,{"$f":"MATCH(Calc2!C$112,Trucks!$B$49:$B53,0)","v":{"$error":"#N/A"}},{"$f":"MATCH(Calc2!D$112,Trucks!$B$49:$B53,0)","v":{"$error":"#N/A"}},{"$f":"MATCH(Calc2!E$112,Trucks!$B$49:$B53,0)","v":{"$error":"#N/A"}},{"$f":"MATCH(Calc2!F$112,Trucks!$B$49:$B53,0)","v":{"$error":"#N/A"}},{"$f":"MATCH(Calc2!G$112,Trucks!$B$49:$B53,0)","v":{"$error":"#N/A"}},{"$f":"MATCH(Calc2!H$112,Trucks!$B$49:$B53,0)","v":{"$error":"#N/A"}},{"$f":"MATCH(Calc2!I$112,Trucks!$B$49:$B53,0)","v":{"$error":"#N/A"}},{"$f":"MATCH(Calc2!J$112,Trucks!$B$49:$B53,0)","v":{"$error":"#N/A"}},{"$f":"MATCH(Calc2!K$112,Trucks!$B$49:$B53,0)","v":{"$error":"#N/A"}},{"$f":"MATCH(Calc2!L$112,Trucks!$B$49:$B53,0)","v":{"$error":"#N/A"}},{"$f":"MATCH(Calc2!M$112,Trucks!$B$49:$B53,0)","v":{"$error":"#N/A"}},{"$f":"MATCH(Calc2!N$112,Trucks!$B$49:$B53,0)","v":{"$error":"#N/A"}},{"$f":"MATCH(Calc2!O$112,Trucks!$B$49:$B53,0)","v":{"$error":"#N/A"}},{"$f":"MATCH(Calc2!P$112,Trucks!$B$49:$B53,0)","v":{"$error":"#N/A"}},{"$f":"MATCH(Calc2!Q$112,Trucks!$B$49:$B53,0)","v":{"$error":"#N/A"}},{"$f":"MATCH(Calc2!R$112,Trucks!$B$49:$B53,0)","v":{"$error":"#N/A"}},{"$f":"MATCH(Calc2!S$112,Trucks!$B$49:$B53,0)","v":{"$error":"#N/A"}},{"$f":"MATCH(Calc2!T$112,Trucks!$B$49:$B53,0)","v":{"$error":"#N/A"}},{"$f":"MATCH(Calc2!U$112,Trucks!$B$49:$B53,0)","v":{"$error":"#N/A"}},{"$f":"MATCH(Calc2!V$112,Trucks!$B$49:$B53,0)","v":{"$error":"#N/A"}},{"$f":"MATCH(Calc2!W$112,Trucks!$B$49:$B53,0)","v":{"$error":"#N/A"}},{"$f":"MATCH(Calc2!X$112,Trucks!$B$49:$B53,0)","v":{"$error":"#N/A"}},{"$f":"MATCH(Calc2!Y$112,Trucks!$B$49:$B53,0)","v":{"$error":"#N/A"}},{"$f":"MATCH(Calc2!Z$112,Trucks!$B$49:$B53,0)","v":{"$error":"#N/A"}},{"$f":"MATCH(Calc2!AA$112,Trucks!$B$49:$B53,0)","v":{"$error":"#N/A"}},{"$f":"MATCH(Calc2!AB$112,Trucks!$B$49:$B53,0)","v":{"$error":"#N/A"}}]
[null,null,{"$f":"MATCH(Calc2!C$112,Trucks!$B$49:$B54,0)","v":6},{"$f":"MATCH(Calc2!D$112,Trucks!$B$49:$B54,0)","v":{"$error":"#N/A"}},{"$f":"MATCH(Calc2!E$112,Trucks!$B$49:$B54,0)","v":{"$error":"#N/A"}},{"$f":"MATCH(Calc2!F$112,Trucks!$B$49:$B54,0)","v":{"$error":"#N/A"}},{"$f":"MATCH(Calc2!G$112,Trucks!$B$49:$B54,0)","v":{"$error":"#N/A"}},{"$f":"MATCH(Calc2!H$112,Trucks!$B$49:$B54,0)","v":{"$error":"#N/A"}},{"$f":"MATCH(Calc2!I$112,Trucks!$B$49:$B54,0)","v":{"$error":"#N/A"}},{"$f":"MATCH(Calc2!J$112,Trucks!$B$49:$B54,0)","v":{"$error":"#N/A"}},{"$f":"MATCH(Calc2!K$112,Trucks!$B$49:$B54,0)","v":{"$error":"#N/A"}},{"$f":"MATCH(Calc2!L$112,Trucks!$B$49:$B54,0)","v":{"$error":"#N/A"}},{"$f":"MATCH(Calc2!M$112,Trucks!$B$49:$B54,0)","v":{"$error":"#N/A"}},{"$f":"MATCH(Calc2!N$112,Trucks!$B$49:$B54,0)","v":{"$error":"#N/A"}},{"$f":"MATCH(Calc2!O$112,Trucks!$B$49:$B54,0)","v":{"$error":"#N/A"}},{"$f":"MATCH(Calc2!P$112,Trucks!$B$49:$B54,0)","v":{"$error":"#N/A"}},{"$f":"MATCH(Calc2!Q$112,Trucks!$B$49:$B54,0)","v":{"$error":"#N/A"}},{"$f":"MATCH(Calc2!R$112,Trucks!$B$49:$B54,0)","v":{"$error":"#N/A"}},{"$f":"MATCH(Calc2!S$112,Trucks!$B$49:$B54,0)","v":{"$error":"#N/A"}},{"$f":"MATCH(Calc2!T$112,Trucks!$B$49:$B54,0)","v":{"$error":"#N/A"}},{"$f":"MATCH(Calc2!U$112,Trucks!$B$49:$B54,0)","v":{"$error":"#N/A"}},{"$f":"MATCH(Calc2!V$112,Trucks!$B$49:$B54,0)","v":{"$error":"#N/A"}},{"$f":"MATCH(Calc2!W$112,Trucks!$B$49:$B54,0)","v":{"$error":"#N/A"}},{"$f":"MATCH(Calc2!X$112,Trucks!$B$49:$B54,0)","v":{"$error":"#N/A"}},{"$f":"MATCH(Calc2!Y$112,Trucks!$B$49:$B54,0)","v":{"$error":"#N/A"}},{"$f":"MATCH(Calc2!Z$112,Trucks!$B$49:$B54,0)","v":{"$error":"#N/A"}},{"$f":"MATCH(Calc2!AA$112,Trucks!$B$49:$B54,0)","v":{"$error":"#N/A"}},{"$f":"MATCH(Calc2!AB$112,Trucks!$B$49:$B54,0)","v":{"$error":"#N/A"}}]
[null,null,{"$f":"MATCH(Calc2!C$112,Trucks!$B$49:$B55,0)","v":6},{"$f":"MATCH(Calc2!D$112,Trucks!$B$49:$B55,0)","v":{"$error":"#N/A"}},{"$f":"MATCH(Calc2!E$112,Trucks!$B$49:$B55,0)","v":{"$error":"#N/A"}},{"$f":"MATCH(Calc2!F$112,Trucks!$B$49:$B55,0)","v":{"$error":"#N/A"}},{"$f":"MATCH(Calc2!G$112,Trucks!$B$49:$B55,0)","v":{"$error":"#N/A"}},{"$f":"MATCH(Calc2!H$112,Trucks!$B$49:$B55,0)","v":{"$error":"#N/A"}},{"$f":"MATCH(Calc2!I$112,Trucks!$B$49:$B55,0)","v":{"$error":"#N/A"}},{"$f":"MATCH(Calc2!J$112,Trucks!$B$49:$B55,0)","v":{"$error":"#N/A"}},{"$f":"MATCH(Calc2!K$112,Trucks!$B$49:$B55,0)","v":{"$error":"#N/A"}},{"$f":"MATCH(Calc2!L$112,Trucks!$B$49:$B55,0)","v":{"$error":"#N/A"}},{"$f":"MATCH(Calc2!M$112,Trucks!$B$49:$B55,0)","v":{"$error":"#N/A"}},{"$f":"MATCH(Calc2!N$112,Trucks!$B$49:$B55,0)","v":{"$error":"#N/A"}},{"$f":"MATCH(Calc2!O$112,Trucks!$B$49:$B55,0)","v":{"$error":"#N/A"}},{"$f":"MATCH(Calc2!P$112,Trucks!$B$49:$B55,0)","v":{"$error":"#N/A"}},{"$f":"MATCH(Calc2!Q$112,Trucks!$B$49:$B55,0)","v":{"$error":"#N/A"}},{"$f":"MATCH(Calc2!R$112,Trucks!$B$49:$B55,0)","v":{"$error":"#N/A"}},{"$f":"MATCH(Calc2!S$112,Trucks!$B$49:$B55,0)","v":{"$error":"#N/A"}},{"$f":"MATCH(Calc2!T$112,Trucks!$B$49:$B55,0)","v":{"$error":"#N/A"}},{"$f":"MATCH(Calc2!U$112,Trucks!$B$49:$B55,0)","v":{"$error":"#N/A"}},{"$f":"MATCH(Calc2!V$112,Trucks!$B$49:$B55,0)","v":{"$error":"#N/A"}},{"$f":"MATCH(Calc2!W$112,Trucks!$B$49:$B55,0)","v":{"$error":"#N/A"}},{"$f":"MATCH(Calc2!X$112,Trucks!$B$49:$B55,0)","v":{"$error":"#N/A"}},{"$f":"MATCH(Calc2!Y$112,Trucks!$B$49:$B55,0)","v":{"$error":"#N/A"}},{"$f":"MATCH(Calc2!Z$112,Trucks!$B$49:$B55,0)","v":{"$error":"#N/A"}},{"$f":"MATCH(Calc2!AA$112,Trucks!$B$49:$B55,0)","v":{"$error":"#N/A"}},{"$f":"MATCH(Calc2!AB$112,Trucks!$B$49:$B55,0)","v":{"$error":"#N/A"}}]
[null,null,{"$f":"MATCH(Calc2!C$112,Trucks!$B$49:$B56,0)","v":6},{"$f":"MATCH(Calc2!D$112,Trucks!$B$49:$B56,0)","v":{"$error":"#N/A"}},{"$f":"MATCH(Calc2!E$112,Trucks!$B$49:$B56,0)","v":{"$error":"#N/A"}},{"$f":"MATCH(Calc2!F$112,Trucks!$B$49:$B56,0)","v":{"$error":"#N/A"}},{"$f":"MATCH(Calc2!G$112,Trucks!$B$49:$B56,0)","v":{"$error":"#N/A"}},{"$f":"MATCH(Calc2!H$112,Trucks!$B$49:$B56,0)","v":{"$error":"#N/A"}},{"$f":"MATCH(Calc2!I$112,Trucks!$B$49:$B56,0)","v":{"$error":"#N/A"}},{"$f":"MATCH(Calc2!J$112,Trucks!$B$49:$B56,0)","v":{"$error":"#N/A"}},{"$f":"MATCH(Calc2!K$112,Trucks!$B$49:$B56,0)","v":{"$error":"#N/A"}},{"$f":"MATCH(Calc2!L$112,Trucks!$B$49:$B56,0)","v":{"$error":"#N/A"}},{"$f":"MATCH(Calc2!M$112,Trucks!$B$49:$B56,0)","v":{"$error":"#N/A"}},{"$f":"MATCH(Calc2!N$112,Trucks!$B$49:$B56,0)","v":{"$error":"#N/A"}},{"$f":"MATCH(Calc2!O$112,Trucks!$B$49:$B56,0)","v":{"$error":"#N/A"}},{"$f":"MATCH(Calc2!P$112,Trucks!$B$49:$B56,0)","v":{"$error":"#N/A"}},{"$f":"MATCH(Calc2!Q$112,Trucks!$B$49:$B56,0)","v":{"$error":"#N/A"}},{"$f":"MATCH(Calc2!R$112,Trucks!$B$49:$B56,0)","v":{"$error":"#N/A"}},{"$f":"MATCH(Calc2!S$112,Trucks!$B$49:$B56,0)","v":{"$error":"#N/A"}},{"$f":"MATCH(Calc2!T$112,Trucks!$B$49:$B56,0)","v":{"$error":"#N/A"}},{"$f":"MATCH(Calc2!U$112,Trucks!$B$49:$B56,0)","v":{"$error":"#N/A"}},{"$f":"MATCH(Calc2!V$112,Trucks!$B$49:$B56,0)","v":{"$error":"#N/A"}},{"$f":"MATCH(Calc2!W$112,Trucks!$B$49:$B56,0)","v":{"$error":"#N/A"}},{"$f":"MATCH(Calc2!X$112,Trucks!$B$49:$B56,0)","v":{"$error":"#N/A"}},{"$f":"MATCH(Calc2!Y$112,Trucks!$B$49:$B56,0)","v":{"$error":"#N/A"}},{"$f":"MATCH(Calc2!Z$112,Trucks!$B$49:$B56,0)","v":{"$error":"#N/A"}},{"$f":"MATCH(Calc2!AA$112,Trucks!$B$49:$B56,0)","v":{"$error":"#N/A"}},{"$f":"MATCH(Calc2!AB$112,Trucks!$B$49:$B56,0)","v":{"$error":"#N/A"}}]
[null,null,{"$f":"MATCH(Calc2!C$112,Trucks!$B$49:$B57,0)","v":6},{"$f":"MATCH(Calc2!D$112,Trucks!$B$49:$B57,0)","v":{"$error":"#N/A"}},{"$f":"MATCH(Calc2!E$112,Trucks!$B$49:$B57,0)","v":{"$error":"#N/A"}},{"$f":"MATCH(Calc2!F$112,Trucks!$B$49:$B57,0)","v":{"$error":"#N/A"}},{"$f":"MATCH(Calc2!G$112,Trucks!$B$49:$B57,0)","v":{"$error":"#N/A"}},{"$f":"MATCH(Calc2!H$112,Trucks!$B$49:$B57,0)","v":{"$error":"#N/A"}},{"$f":"MATCH(Calc2!I$112,Trucks!$B$49:$B57,0)","v":{"$error":"#N/A"}},{"$f":"MATCH(Calc2!J$112,Trucks!$B$49:$B57,0)","v":{"$error":"#N/A"}},{"$f":"MATCH(Calc2!K$112,Trucks!$B$49:$B57,0)","v":{"$error":"#N/A"}},{"$f":"MATCH(Calc2!L$112,Trucks!$B$49:$B57,0)","v":{"$error":"#N/A"}},{"$f":"MATCH(Calc2!M$112,Trucks!$B$49:$B57,0)","v":{"$error":"#N/A"}},{"$f":"MATCH(Calc2!N$112,Trucks!$B$49:$B57,0)","v":{"$error":"#N/A"}},{"$f":"MATCH(Calc2!O$112,Trucks!$B$49:$B57,0)","v":{"$error":"#N/A"}},{"$f":"MATCH(Calc2!P$112,Trucks!$B$49:$B57,0)","v":{"$error":"#N/A"}},{"$f":"MATCH(Calc2!Q$112,Trucks!$B$49:$B57,0)","v":{"$error":"#N/A"}},{"$f":"MATCH(Calc2!R$112,Trucks!$B$49:$B57,0)","v":{"$error":"#N/A"}},{"$f":"MATCH(Calc2!S$112,Trucks!$B$49:$B57,0)","v":{"$error":"#N/A"}},{"$f":"MATCH(Calc2!T$112,Trucks!$B$49:$B57,0)","v":{"$error":"#N/A"}},{"$f":"MATCH(Calc2!U$112,Trucks!$B$49:$B57,0)","v":{"$error":"#N/A"}},{"$f":"MATCH(Calc2!V$112,Trucks!$B$49:$B57,0)","v":{"$error":"#N/A"}},{"$f":"MATCH(Calc2!W$112,Trucks!$B$49:$B57,0)","v":{"$error":"#N/A"}},{"$f":"MATCH(Calc2!X$112,Trucks!$B$49:$B57,0)","v":{"$error":"#N/A"}},{"$f":"MATCH(Calc2!Y$112,Trucks!$B$49:$B57,0)","v":{"$error":"#N/A"}},{"$f":"MATCH(Calc2!Z$112,Trucks!$B$49:$B57,0)","v":{"$error":"#N/A"}},{"$f":"MATCH(Calc2!AA$112,Trucks!$B$49:$B57,0)","v":{"$error":"#N/A"}},{"$f":"MATCH(Calc2!AB$112,Trucks!$B$49:$B57,0)","v":{"$error":"#N/A"}}]
[null,null,{"$f":"MATCH(Calc2!C$112,Trucks!$B$49:$B58,0)","v":6},{"$f":"MATCH(Calc2!D$112,Trucks!$B$49:$B58,0)","v":{"$error":"#N/A"}},{"$f":"MATCH(Calc2!E$112,Trucks!$B$49:$B58,0)","v":{"$error":"#N/A"}},{"$f":"MATCH(Calc2!F$112,Trucks!$B$49:$B58,0)","v":{"$error":"#N/A"}},{"$f":"MATCH(Calc2!G$112,Trucks!$B$49:$B58,0)","v":{"$error":"#N/A"}},{"$f":"MATCH(Calc2!H$112,Trucks!$B$49:$B58,0)","v":{"$error":"#N/A"}},{"$f":"MATCH(Calc2!I$112,Trucks!$B$49:$B58,0)","v":{"$error":"#N/A"}},{"$f":"MATCH(Calc2!J$112,Trucks!$B$49:$B58,0)","v":{"$error":"#N/A"}},{"$f":"MATCH(Calc2!K$112,Trucks!$B$49:$B58,0)","v":{"$error":"#N/A"}},{"$f":"MATCH(Calc2!L$112,Trucks!$B$49:$B58,0)","v":{"$error":"#N/A"}},{"$f":"MATCH(Calc2!M$112,Trucks!$B$49:$B58,0)","v":{"$error":"#N/A"}},{"$f":"MATCH(Calc2!N$112,Trucks!$B$49:$B58,0)","v":{"$error":"#N/A"}},{"$f":"MATCH(Calc2!O$112,Trucks!$B$49:$B58,0)","v":{"$error":"#N/A"}},{"$f":"MATCH(Calc2!P$112,Trucks!$B$49:$B58,0)","v":{"$error":"#N/A"}},{"$f":"MATCH(Calc2!Q$112,Trucks!$B$49:$B58,0)","v":{"$error":"#N/A"}},{"$f":"MATCH(Calc2!R$112,Trucks!$B$49:$B58,0)","v":{"$error":"#N/A"}},{"$f":"MATCH(Calc2!S$112,Trucks!$B$49:$B58,0)","v":{"$error":"#N/A"}},{"$f":"MATCH(Calc2!T$112,Trucks!$B$49:$B58,0)","v":{"$error":"#N/A"}},{"$f":"MATCH(Calc2!U$112,Trucks!$B$49:$B58,0)","v":{"$error":"#N/A"}},{"$f":"MATCH(Calc2!V$112,Trucks!$B$49:$B58,0)","v":{"$error":"#N/A"}},{"$f":"MATCH(Calc2!W$112,Trucks!$B$49:$B58,0)","v":{"$error":"#N/A"}},{"$f":"MATCH(Calc2!X$112,Trucks!$B$49:$B58,0)","v":{"$error":"#N/A"}},{"$f":"MATCH(Calc2!Y$112,Trucks!$B$49:$B58,0)","v":{"$error":"#N/A"}},{"$f":"MATCH(Calc2!Z$112,Trucks!$B$49:$B58,0)","v":{"$error":"#N/A"}},{"$f":"MATCH(Calc2!AA$112,Trucks!$B$49:$B58,0)","v":{"$error":"#N/A"}},{"$f":"MATCH(Calc2!AB$112,Trucks!$B$49:$B58,0)","v":{"$error":"#N/A"}}]
[null,null,{"$f":"MATCH(Calc2!C$112,Trucks!$B$49:$B59,0)","v":6},{"$f":"MATCH(Calc2!D$112,Trucks!$B$49:$B59,0)","v":{"$error":"#N/A"}},{"$f":"MATCH(Calc2!E$112,Trucks!$B$49:$B59,0)","v":{"$error":"#N/A"}},{"$f":"MATCH(Calc2!F$112,Trucks!$B$49:$B59,0)","v":{"$error":"#N/A"}},{"$f":"MATCH(Calc2!G$112,Trucks!$B$49:$B59,0)","v":{"$error":"#N/A"}},{"$f":"MATCH(Calc2!H$112,Trucks!$B$49:$B59,0)","v":{"$error":"#N/A"}},{"$f":"MATCH(Calc2!I$112,Trucks!$B$49:$B59,0)","v":{"$error":"#N/A"}},{"$f":"MATCH(Calc2!J$112,Trucks!$B$49:$B59,0)","v":{"$error":"#N/A"}},{"$f":"MATCH(Calc2!K$112,Trucks!$B$49:$B59,0)","v":{"$error":"#N/A"}},{"$f":"MATCH(Calc2!L$112,Trucks!$B$49:$B59,0)","v":{"$error":"#N/A"}},{"$f":"MATCH(Calc2!M$112,Trucks!$B$49:$B59,0)","v":{"$error":"#N/A"}},{"$f":"MATCH(Calc2!N$112,Trucks!$B$49:$B59,0)","v":{"$error":"#N/A"}},{"$f":"MATCH(Calc2!O$112,Trucks!$B$49:$B59,0)","v":{"$error":"#N/A"}},{"$f":"MATCH(Calc2!P$112,Trucks!$B$49:$B59,0)","v":{"$error":"#N/A"}},{"$f":"MATCH(Calc2!Q$112,Trucks!$B$49:$B59,0)","v":{"$error":"#N/A"}},{"$f":"MATCH(Calc2!R$112,Trucks!$B$49:$B59,0)","v":{"$error":"#N/A"}},{"$f":"MATCH(Calc2!S$112,Trucks!$B$49:$B59,0)","v":{"$error":"#N/A"}},{"$f":"MATCH(Calc2!T$112,Trucks!$B$49:$B59,0)","v":{"$error":"#N/A"}},{"$f":"MATCH(Calc2!U$112,Trucks!$B$49:$B59,0)","v":{"$error":"#N/A"}},{"$f":"MATCH(Calc2!V$112,Trucks!$B$49:$B59,0)","v":{"$error":"#N/A"}},{"$f":"MATCH(Calc2!W$112,Trucks!$B$49:$B59,0)","v":{"$error":"#N/A"}},{"$f":"MATCH(Calc2!X$112,Trucks!$B$49:$B59,0)","v":{"$error":"#N/A"}},{"$f":"MATCH(Calc2!Y$112,Trucks!$B$49:$B59,0)","v":{"$error":"#N/A"}},{"$f":"MATCH(Calc2!Z$112,Trucks!$B$49:$B59,0)","v":{"$error":"#N/A"}},{"$f":"MATCH(Calc2!AA$112,Trucks!$B$49:$B59,0)","v":{"$error":"#N/A"}},{"$f":"MATCH(Calc2!AB$112,Trucks!$B$49:$B59,0)","v":{"$error":"#N/A"}}]
[null,null,{"$f":"MATCH(Calc2!C$112,Trucks!$B$49:$B60,0)","v":6},{"$f":"MATCH(Calc2!D$112,Trucks!$B$49:$B60,0)","v":{"$error":"#N/A"}},{"$f":"MATCH(Calc2!E$112,Trucks!$B$49:$B60,0)","v":{"$error":"#N/A"}},{"$f":"MATCH(Calc2!F$112,Trucks!$B$49:$B60,0)","v":{"$error":"#N/A"}},{"$f":"MATCH(Calc2!G$112,Trucks!$B$49:$B60,0)","v":{"$error":"#N/A"}},{"$f":"MATCH(Calc2!H$112,Trucks!$B$49:$B60,0)","v":{"$error":"#N/A"}},{"$f":"MATCH(Calc2!I$112,Trucks!$B$49:$B60,0)","v":{"$error":"#N/A"}},{"$f":"MATCH(Calc2!J$112,Trucks!$B$49:$B60,0)","v":{"$error":"#N/A"}},{"$f":"MATCH(Calc2!K$112,Trucks!$B$49:$B60,0)","v":{"$error":"#N/A"}},{"$f":"MATCH(Calc2!L$112,Trucks!$B$49:$B60,0)","v":{"$error":"#N/A"}},{"$f":"MATCH(Calc2!M$112,Trucks!$B$49:$B60,0)","v":{"$error":"#N/A"}},{"$f":"MATCH(Calc2!N$112,Trucks!$B$49:$B60,0)","v":{"$error":"#N/A"}},{"$f":"MATCH(Calc2!O$112,Trucks!$B$49:$B60,0)","v":{"$error":"#N/A"}},{"$f":"MATCH(Calc2!P$112,Trucks!$B$49:$B60,0)","v":{"$error":"#N/A"}},{"$f":"MATCH(Calc2!Q$112,Trucks!$B$49:$B60,0)","v":{"$error":"#N/A"}},{"$f":"MATCH(Calc2!R$112,Trucks!$B$49:$B60,0)","v":{"$error":"#N/A"}},{"$f":"MATCH(Calc2!S$112,Trucks!$B$49:$B60,0)","v":{"$error":"#N/A"}},{"$f":"MATCH(Calc2!T$112,Trucks!$B$49:$B60,0)","v":{"$error":"#N/A"}},{"$f":"MATCH(Calc2!U$112,Trucks!$B$49:$B60,0)","v":{"$error":"#N/A"}},{"$f":"MATCH(Calc2!V$112,Trucks!$B$49:$B60,0)","v":{"$error":"#N/A"}},{"$f":"MATCH(Calc2!W$112,Trucks!$B$49:$B60,0)","v":{"$error":"#N/A"}},{"$f":"MATCH(Calc2!X$112,Trucks!$B$49:$B60,0)","v":{"$error":"#N/A"}},{"$f":"MATCH(Calc2!Y$112,Trucks!$B$49:$B60,0)","v":{"$error":"#N/A"}},{"$f":"MATCH(Calc2!Z$112,Trucks!$B$49:$B60,0)","v":{"$error":"#N/A"}},{"$f":"MATCH(Calc2!AA$112,Trucks!$B$49:$B60,0)","v":{"$error":"#N/A"}},{"$f":"MATCH(Calc2!AB$112,Trucks!$B$49:$B60,0)","v":{"$error":"#N/A"}}]
[null,null,{"$f":"MATCH(Calc2!C$112,Trucks!$B$49:$B66,0)","v":6},{"$f":"MATCH(Calc2!D$112,Trucks!$B$49:$B66,0)","v":{"$error":"#N/A"}},{"$f":"MATCH(Calc2!E$112,Trucks!$B$49:$B66,0)","v":{"$error":"#N/A"}},{"$f":"MATCH(Calc2!F$112,Trucks!$B$49:$B66,0)","v":{"$error":"#N/A"}},{"$f":"MATCH(Calc2!G$112,Trucks!$B$49:$B66,0)","v":{"$error":"#N/A"}},{"$f":"MATCH(Calc2!H$112,Trucks!$B$49:$B66,0)","v":{"$error":"#N/A"}},{"$f":"MATCH(Calc2!I$112,Trucks!$B$49:$B66,0)","v":{"$error":"#N/A"}},{"$f":"MATCH(Calc2!J$112,Trucks!$B$49:$B66,0)","v":{"$error":"#N/A"}},{"$f":"MATCH(Calc2!K$112,Trucks!$B$49:$B66,0)","v":{"$error":"#N/A"}},{"$f":"MATCH(Calc2!L$112,Trucks!$B$49:$B66,0)","v":{"$error":"#N/A"}},{"$f":"MATCH(Calc2!M$112,Trucks!$B$49:$B66,0)","v":{"$error":"#N/A"}},{"$f":"MATCH(Calc2!N$112,Trucks!$B$49:$B66,0)","v":{"$error":"#N/A"}},{"$f":"MATCH(Calc2!O$112,Trucks!$B$49:$B66,0)","v":{"$error":"#N/A"}},{"$f":"MATCH(Calc2!P$112,Trucks!$B$49:$B66,0)","v":{"$error":"#N/A"}},{"$f":"MATCH(Calc2!Q$112,Trucks!$B$49:$B66,0)","v":{"$error":"#N/A"}},{"$f":"MATCH(Calc2!R$112,Trucks!$B$49:$B66,0)","v":{"$error":"#N/A"}},{"$f":"MATCH(Calc2!S$112,Trucks!$B$49:$B66,0)","v":{"$error":"#N/A"}},{"$f":"MATCH(Calc2!T$112,Trucks!$B$49:$B66,0)","v":{"$error":"#N/A"}},{"$f":"MATCH(Calc2!U$112,Trucks!$B$49:$B66,0)","v":{"$error":"#N/A"}},{"$f":"MATCH(Calc2!V$112,Trucks!$B$49:$B66,0)","v":{"$error":"#N/A"}},{"$f":"MATCH(Calc2!W$112,Trucks!$B$49:$B66,0)","v":{"$error":"#N/A"}},{"$f":"MATCH(Calc2!X$112,Trucks!$B$49:$B66,0)","v":{"$error":"#N/A"}},{"$f":"MATCH(Calc2!Y$112,Trucks!$B$49:$B66,0)","v":{"$error":"#N/A"}},{"$f":"MATCH(Calc2!Z$112,Trucks!$B$49:$B66,0)","v":{"$error":"#N/A"}},{"$f":"MATCH(Calc2!AA$112,Trucks!$B$49:$B66,0)","v":{"$error":"#N/A"}},{"$f":"MATCH(Calc2!AB$112,Trucks!$B$49:$B66,0)","v":{"$error":"#N/A"}}]
[null,null,{"$f":"MATCH(Calc2!C$112,Trucks!$B$49:$B67,0)","v":6},{"$f":"MATCH(Calc2!D$112,Trucks!$B$49:$B67,0)","v":{"$error":"#N/A"}},{"$f":"MATCH(Calc2!E$112,Trucks!$B$49:$B67,0)","v":{"$error":"#N/A"}},{"$f":"MATCH(Calc2!F$112,Trucks!$B$49:$B67,0)","v":{"$error":"#N/A"}},{"$f":"MATCH(Calc2!G$112,Trucks!$B$49:$B67,0)","v":{"$error":"#N/A"}},{"$f":"MATCH(Calc2!H$112,Trucks!$B$49:$B67,0)","v":{"$error":"#N/A"}},{"$f":"MATCH(Calc2!I$112,Trucks!$B$49:$B67,0)","v":{"$error":"#N/A"}},{"$f":"MATCH(Calc2!J$112,Trucks!$B$49:$B67,0)","v":{"$error":"#N/A"}},{"$f":"MATCH(Calc2!K$112,Trucks!$B$49:$B67,0)","v":{"$error":"#N/A"}},{"$f":"MATCH(Calc2!L$112,Trucks!$B$49:$B67,0)","v":{"$error":"#N/A"}},{"$f":"MATCH(Calc2!M$112,Trucks!$B$49:$B67,0)","v":{"$error":"#N/A"}},{"$f":"MATCH(Calc2!N$112,Trucks!$B$49:$B67,0)","v":{"$error":"#N/A"}},{"$f":"MATCH(Calc2!O$112,Trucks!$B$49:$B67,0)","v":{"$error":"#N/A"}},{"$f":"MATCH(Calc2!P$112,Trucks!$B$49:$B67,0)","v":{"$error":"#N/A"}},{"$f":"MATCH(Calc2!Q$112,Trucks!$B$49:$B67,0)","v":{"$error":"#N/A"}},{"$f":"MATCH(Calc2!R$112,Trucks!$B$49:$B67,0)","v":{"$error":"#N/A"}},{"$f":"MATCH(Calc2!S$112,Trucks!$B$49:$B67,0)","v":{"$error":"#N/A"}},{"$f":"MATCH(Calc2!T$112,Trucks!$B$49:$B67,0)","v":{"$error":"#N/A"}},{"$f":"MATCH(Calc2!U$112,Trucks!$B$49:$B67,0)","v":{"$error":"#N/A"}},{"$f":"MATCH(Calc2!V$112,Trucks!$B$49:$B67,0)","v":{"$error":"#N/A"}},{"$f":"MATCH(Calc2!W$112,Trucks!$B$49:$B67,0)","v":{"$error":"#N/A"}},{"$f":"MATCH(Calc2!X$112,Trucks!$B$49:$B67,0)","v":{"$error":"#N/A"}},{"$f":"MATCH(Calc2!Y$112,Trucks!$B$49:$B67,0)","v":{"$error":"#N/A"}},{"$f":"MATCH(Calc2!Z$112,Trucks!$B$49:$B67,0)","v":{"$error":"#N/A"}},{"$f":"MATCH(Calc2!AA$112,Trucks!$B$49:$B67,0)","v":{"$error":"#N/A"}},{"$f":"MATCH(Calc2!AB$112,Trucks!$B$49:$B67,0)","v":{"$error":"#N/A"}}]
[null,null,{"$f":"MATCH(Calc2!C$112,Trucks!$B$49:$B68,0)","v":6},{"$f":"MATCH(Calc2!D$112,Trucks!$B$49:$B68,0)","v":{"$error":"#N/A"}},{"$f":"MATCH(Calc2!E$112,Trucks!$B$49:$B68,0)","v":{"$error":"#N/A"}},{"$f":"MATCH(Calc2!F$112,Trucks!$B$49:$B68,0)","v":{"$error":"#N/A"}},{"$f":"MATCH(Calc2!G$112,Trucks!$B$49:$B68,0)","v":{"$error":"#N/A"}},{"$f":"MATCH(Calc2!H$112,Trucks!$B$49:$B68,0)","v":{"$error":"#N/A"}},{"$f":"MATCH(Calc2!I$112,Trucks!$B$49:$B68,0)","v":{"$error":"#N/A"}},{"$f":"MATCH(Calc2!J$112,Trucks!$B$49:$B68,0)","v":{"$error":"#N/A"}},{"$f":"MATCH(Calc2!K$112,Trucks!$B$49:$B68,0)","v":{"$error":"#N/A"}},{"$f":"MATCH(Calc2!L$112,Trucks!$B$49:$B68,0)","v":{"$error":"#N/A"}},{"$f":"MATCH(Calc2!M$112,Trucks!$B$49:$B68,0)","v":{"$error":"#N/A"}},{"$f":"MATCH(Calc2!N$112,Trucks!$B$49:$B68,0)","v":{"$error":"#N/A"}},{"$f":"MATCH(Calc2!O$112,Trucks!$B$49:$B68,0)","v":{"$error":"#N/A"}},{"$f":"MATCH(Calc2!P$112,Trucks!$B$49:$B68,0)","v":{"$error":"#N/A"}},{"$f":"MATCH(Calc2!Q$112,Trucks!$B$49:$B68,0)","v":{"$error":"#N/A"}},{"$f":"MATCH(Calc2!R$112,Trucks!$B$49:$B68,0)","v":{"$error":"#N/A"}},{"$f":"MATCH(Calc2!S$112,Trucks!$B$49:$B68,0)","v":{"$error":"#N/A"}},{"$f":"MATCH(Calc2!T$112,Trucks!$B$49:$B68,0)","v":{"$error":"#N/A"}},{"$f":"MATCH(Calc2!U$112,Trucks!$B$49:$B68,0)","v":{"$error":"#N/A"}},{"$f":"MATCH(Calc2!V$112,Trucks!$B$49:$B68,0)","v":{"$error":"#N/A"}},{"$f":"MATCH(Calc2!W$112,Trucks!$B$49:$B68,0)","v":{"$error":"#N/A"}},{"$f":"MATCH(Calc2!X$112,Trucks!$B$49:$B68,0)","v":{"$error":"#N/A"}},{"$f":"MATCH(Calc2!Y$112,Trucks!$B$49:$B68,0)","v":{"$error":"#N/A"}},{"$f":"MATCH(Calc2!Z$112,Trucks!$B$49:$B68,0)","v":{"$error":"#N/A"}},{"$f":"MATCH(Calc2!AA$112,Trucks!$B$49:$B68,0)","v":{"$error":"#N/A"}},{"$f":"MATCH(Calc2!AB$112,Trucks!$B$49:$B68,0)","v":{"$error":"#N/A"}}]
[null,null,{"$f":"MATCH(Calc2!C$112,Trucks!$B$49:$B69,0)","v":6},{"$f":"MATCH(Calc2!D$112,Trucks!$B$49:$B69,0)","v":{"$error":"#N/A"}},{"$f":"MATCH(Calc2!E$112,Trucks!$B$49:$B69,0)","v":{"$error":"#N/A"}},{"$f":"MATCH(Calc2!F$112,Trucks!$B$49:$B69,0)","v":{"$error":"#N/A"}},{"$f":"MATCH(Calc2!G$112,Trucks!$B$49:$B69,0)","v":{"$error":"#N/A"}},{"$f":"MATCH(Calc2!H$112,Trucks!$B$49:$B69,0)","v":{"$error":"#N/A"}},{"$f":"MATCH(Calc2!I$112,Trucks!$B$49:$B69,0)","v":{"$error":"#N/A"}},{"$f":"MATCH(Calc2!J$112,Trucks!$B$49:$B69,0)","v":{"$error":"#N/A"}},{"$f":"MATCH(Calc2!K$112,Trucks!$B$49:$B69,0)","v":{"$error":"#N/A"}},{"$f":"MATCH(Calc2!L$112,Trucks!$B$49:$B69,0)","v":{"$error":"#N/A"}},{"$f":"MATCH(Calc2!M$112,Trucks!$B$49:$B69,0)","v":{"$error":"#N/A"}},{"$f":"MATCH(Calc2!N$112,Trucks!$B$49:$B69,0)","v":{"$error":"#N/A"}},{"$f":"MATCH(Calc2!O$112,Trucks!$B$49:$B69,0)","v":{"$error":"#N/A"}},{"$f":"MATCH(Calc2!P$112,Trucks!$B$49:$B69,0)","v":{"$error":"#N/A"}},{"$f":"MATCH(Calc2!Q$112,Trucks!$B$49:$B69,0)","v":{"$error":"#N/A"}},{"$f":"MATCH(Calc2!R$112,Trucks!$B$49:$B69,0)","v":{"$error":"#N/A"}},{"$f":"MATCH(Calc2!S$112,Trucks!$B$49:$B69,0)","v":{"$error":"#N/A"}},{"$f":"MATCH(Calc2!T$112,Trucks!$B$49:$B69,0)","v":{"$error":"#N/A"}},{"$f":"MATCH(Calc2!U$112,Trucks!$B$49:$B69,0)","v":{"$error":"#N/A"}},{"$f":"MATCH(Calc2!V$112,Trucks!$B$49:$B69,0)","v":{"$error":"#N/A"}},{"$f":"MATCH(Calc2!W$112,Trucks!$B$49:$B69,0)","v":{"$error":"#N/A"}},{"$f":"MATCH(Calc2!X$112,Trucks!$B$49:$B69,0)","v":{"$error":"#N/A"}},{"$f":"MATCH(Calc2!Y$112,Trucks!$B$49:$B69,0)","v":{"$error":"#N/A"}},{"$f":"MATCH(Calc2!Z$112,Trucks!$B$49:$B69,0)","v":{"$error":"#N/A"}},{"$f":"MATCH(Calc2!AA$112,Trucks!$B$49:$B69,0)","v":{"$error":"#N/A"}},{"$f":"MATCH(Calc2!AB$112,Trucks!$B$49:$B69,0)","v":{"$error":"#N/A"}}]
[null,null,{"$f":"MATCH(Calc2!C$112,Trucks!$B$49:$B70,0)","v":6},{"$f":"MATCH(Calc2!D$112,Trucks!$B$49:$B70,0)","v":{"$error":"#N/A"}},{"$f":"MATCH(Calc2!E$112,Trucks!$B$49:$B70,0)","v":{"$error":"#N/A"}},{"$f":"MATCH(Calc2!F$112,Trucks!$B$49:$B70,0)","v":{"$error":"#N/A"}},{"$f":"MATCH(Calc2!G$112,Trucks!$B$49:$B70,0)","v":{"$error":"#N/A"}},{"$f":"MATCH(Calc2!H$112,Trucks!$B$49:$B70,0)","v":{"$error":"#N/A"}},{"$f":"MATCH(Calc2!I$112,Trucks!$B$49:$B70,0)","v":{"$error":"#N/A"}},{"$f":"MATCH(Calc2!J$112,Trucks!$B$49:$B70,0)","v":{"$error":"#N/A"}},{"$f":"MATCH(Calc2!K$112,Trucks!$B$49:$B70,0)","v":{"$error":"#N/A"}},{"$f":"MATCH(Calc2!L$112,Trucks!$B$49:$B70,0)","v":{"$error":"#N/A"}},{"$f":"MATCH(Calc2!M$112,Trucks!$B$49:$B70,0)","v":{"$error":"#N/A"}},{"$f":"MATCH(Calc2!N$112,Trucks!$B$49:$B70,0)","v":{"$error":"#N/A"}},{"$f":"MATCH(Calc2!O$112,Trucks!$B$49:$B70,0)","v":{"$error":"#N/A"}},{"$f":"MATCH(Calc2!P$112,Trucks!$B$49:$B70,0)","v":{"$error":"#N/A"}},{"$f":"MATCH(Calc2!Q$112,Trucks!$B$49:$B70,0)","v":{"$error":"#N/A"}},{"$f":"MATCH(Calc2!R$112,Trucks!$B$49:$B70,0)","v":{"$error":"#N/A"}},{"$f":"MATCH(Calc2!S$112,Trucks!$B$49:$B70,0)","v":{"$error":"#N/A"}},{"$f":"MATCH(Calc2!T$112,Trucks!$B$49:$B70,0)","v":{"$error":"#N/A"}},{"$f":"MATCH(Calc2!U$112,Trucks!$B$49:$B70,0)","v":{"$error":"#N/A"}},{"$f":"MATCH(Calc2!V$112,Trucks!$B$49:$B70,0)","v":{"$error":"#N/A"}},{"$f":"MATCH(Calc2!W$112,Trucks!$B$49:$B70,0)","v":{"$error":"#N/A"}},{"$f":"MATCH(Calc2!X$112,Trucks!$B$49:$B70,0)","v":{"$error":"#N/A"}},{"$f":"MATCH(Calc2!Y$112,Trucks!$B$49:$B70,0)","v":{"$error":"#N/A"}},{"$f":"MATCH(Calc2!Z$112,Trucks!$B$49:$B70,0)","v":{"$error":"#N/A"}},{"$f":"MATCH(Calc2!AA$112,Trucks!$B$49:$B70,0)","v":{"$error":"#N/A"}},{"$f":"MATCH(Calc2!AB$112,Trucks!$B$49:$B70,0)","v":{"$error":"#N/A"}}]
[null,null,{"$f":"MATCH(Calc2!C$112,Trucks!$B$49:$B71,0)","v":6},{"$f":"MATCH(Calc2!D$112,Trucks!$B$49:$B71,0)","v":{"$error":"#N/A"}},{"$f":"MATCH(Calc2!E$112,Trucks!$B$49:$B71,0)","v":{"$error":"#N/A"}},{"$f":"MATCH(Calc2!F$112,Trucks!$B$49:$B71,0)","v":{"$error":"#N/A"}},{"$f":"MATCH(Calc2!G$112,Trucks!$B$49:$B71,0)","v":{"$error":"#N/A"}},{"$f":"MATCH(Calc2!H$112,Trucks!$B$49:$B71,0)","v":{"$error":"#N/A"}},{"$f":"MATCH(Calc2!I$112,Trucks!$B$49:$B71,0)","v":{"$error":"#N/A"}},{"$f":"MATCH(Calc2!J$112,Trucks!$B$49:$B71,0)","v":{"$error":"#N/A"}},{"$f":"MATCH(Calc2!K$112,Trucks!$B$49:$B71,0)","v":{"$error":"#N/A"}},{"$f":"MATCH(Calc2!L$112,Trucks!$B$49:$B71,0)","v":{"$error":"#N/A"}},{"$f":"MATCH(Calc2!M$112,Trucks!$B$49:$B71,0)","v":{"$error":"#N/A"}},{"$f":"MATCH(Calc2!N$112,Trucks!$B$49:$B71,0)","v":{"$error":"#N/A"}},{"$f":"MATCH(Calc2!O$112,Trucks!$B$49:$B71,0)","v":{"$error":"#N/A"}},{"$f":"MATCH(Calc2!P$112,Trucks!$B$49:$B71,0)","v":{"$error":"#N/A"}},{"$f":"MATCH(Calc2!Q$112,Trucks!$B$49:$B71,0)","v":{"$error":"#N/A"}},{"$f":"MATCH(Calc2!R$112,Trucks!$B$49:$B71,0)","v":{"$error":"#N/A"}},{"$f":"MATCH(Calc2!S$112,Trucks!$B$49:$B71,0)","v":{"$error":"#N/A"}},{"$f":"MATCH(Calc2!T$112,Trucks!$B$49:$B71,0)","v":{"$error":"#N/A"}},{"$f":"MATCH(Calc2!U$112,Trucks!$B$49:$B71,0)","v":{"$error":"#N/A"}},{"$f":"MATCH(Calc2!V$112,Trucks!$B$49:$B71,0)","v":{"$error":"#N/A"}},{"$f":"MATCH(Calc2!W$112,Trucks!$B$49:$B71,0)","v":{"$error":"#N/A"}},{"$f":"MATCH(Calc2!X$112,Trucks!$B$49:$B71,0)","v":{"$error":"#N/A"}},{"$f":"MATCH(Calc2!Y$112,Trucks!$B$49:$B71,0)","v":{"$error":"#N/A"}},{"$f":"MATCH(Calc2!Z$112,Trucks!$B$49:$B71,0)","v":{"$error":"#N/A"}},{"$f":"MATCH(Calc2!AA$112,Trucks!$B$49:$B71,0)","v":{"$error":"#N/A"}},{"$f":"MATCH(Calc2!AB$112,Trucks!$B$49:$B71,0)","v":{"$error":"#N/A"}}]
[null,null,{"$f":"MATCH(Calc2!C$112,Trucks!$B$49:$B72,0)","v":6},{"$f":"MATCH(Calc2!D$112,Trucks!$B$49:$B72,0)","v":{"$error":"#N/A"}},{"$f":"MATCH(Calc2!E$112,Trucks!$B$49:$B72,0)","v":{"$error":"#N/A"}},{"$f":"MATCH(Calc2!F$112,Trucks!$B$49:$B72,0)","v":{"$error":"#N/A"}},{"$f":"MATCH(Calc2!G$112,Trucks!$B$49:$B72,0)","v":{"$error":"#N/A"}},{"$f":"MATCH(Calc2!H$112,Trucks!$B$49:$B72,0)","v":{"$error":"#N/A"}},{"$f":"MATCH(Calc2!I$112,Trucks!$B$49:$B72,0)","v":{"$error":"#N/A"}},{"$f":"MATCH(Calc2!J$112,Trucks!$B$49:$B72,0)","v":{"$error":"#N/A"}},{"$f":"MATCH(Calc2!K$112,Trucks!$B$49:$B72,0)","v":{"$error":"#N/A"}},{"$f":"MATCH(Calc2!L$112,Trucks!$B$49:$B72,0)","v":{"$error":"#N/A"}},{"$f":"MATCH(Calc2!M$112,Trucks!$B$49:$B72,0)","v":{"$error":"#N/A"}},{"$f":"MATCH(Calc2!N$112,Trucks!$B$49:$B72,0)","v":{"$error":"#N/A"}},{"$f":"MATCH(Calc2!O$112,Trucks!$B$49:$B72,0)","v":{"$error":"#N/A"}},{"$f":"MATCH(Calc2!P$112,Trucks!$B$49:$B72,0)","v":{"$error":"#N/A"}},{"$f":"MATCH(Calc2!Q$112,Trucks!$B$49:$B72,0)","v":{"$error":"#N/A"}},{"$f":"MATCH(Calc2!R$112,Trucks!$B$49:$B72,0)","v":{"$error":"#N/A"}},{"$f":"MATCH(Calc2!S$112,Trucks!$B$49:$B72,0)","v":{"$error":"#N/A"}},{"$f":"MATCH(Calc2!T$112,Trucks!$B$49:$B72,0)","v":{"$error":"#N/A"}},{"$f":"MATCH(Calc2!U$112,Trucks!$B$49:$B72,0)","v":{"$error":"#N/A"}},{"$f":"MATCH(Calc2!V$112,Trucks!$B$49:$B72,0)","v":{"$error":"#N/A"}},{"$f":"MATCH(Calc2!W$112,Trucks!$B$49:$B72,0)","v":{"$error":"#N/A"}},{"$f":"MATCH(Calc2!X$112,Trucks!$B$49:$B72,0)","v":{"$error":"#N/A"}},{"$f":"MATCH(Calc2!Y$112,Trucks!$B$49:$B72,0)","v":{"$error":"#N/A"}},{"$f":"MATCH(Calc2!Z$112,Trucks!$B$49:$B72,0)","v":{"$error":"#N/A"}},{"$f":"MATCH(Calc2!AA$112,Trucks!$B$49:$B72,0)","v":{"$error":"#N/A"}},{"$f":"MATCH(Calc2!AB$112,Trucks!$B$49:$B72,0)","v":{"$error":"#N/A"}}]
[null,null,{"$f":"MATCH(Calc2!C$112,Trucks!$B$49:$B73,0)","v":6},{"$f":"MATCH(Calc2!D$112,Trucks!$B$49:$B73,0)","v":{"$error":"#N/A"}},{"$f":"MATCH(Calc2!E$112,Trucks!$B$49:$B73,0)","v":{"$error":"#N/A"}},{"$f":"MATCH(Calc2!F$112,Trucks!$B$49:$B73,0)","v":{"$error":"#N/A"}},{"$f":"MATCH(Calc2!G$112,Trucks!$B$49:$B73,0)","v":{"$error":"#N/A"}},{"$f":"MATCH(Calc2!H$112,Trucks!$B$49:$B73,0)","v":{"$error":"#N/A"}},{"$f":"MATCH(Calc2!I$112,Trucks!$B$49:$B73,0)","v":{"$error":"#N/A"}},{"$f":"MATCH(Calc2!J$112,Trucks!$B$49:$B73,0)","v":{"$error":"#N/A"}},{"$f":"MATCH(Calc2!K$112,Trucks!$B$49:$B73,0)","v":{"$error":"#N/A"}},{"$f":"MATCH(Calc2!L$112,Trucks!$B$49:$B73,0)","v":{"$error":"#N/A"}},{"$f":"MATCH(Calc2!M$112,Trucks!$B$49:$B73,0)","v":{"$error":"#N/A"}},{"$f":"MATCH(Calc2!N$112,Trucks!$B$49:$B73,0)","v":{"$error":"#N/A"}},{"$f":"MATCH(Calc2!O$112,Trucks!$B$49:$B73,0)","v":{"$error":"#N/A"}},{"$f":"MATCH(Calc2!P$112,Trucks!$B$49:$B73,0)","v":{"$error":"#N/A"}},{"$f":"MATCH(Calc2!Q$112,Trucks!$B$49:$B73,0)","v":{"$error":"#N/A"}},{"$f":"MATCH(Calc2!R$112,Trucks!$B$49:$B73,0)","v":{"$error":"#N/A"}},{"$f":"MATCH(Calc2!S$112,Trucks!$B$49:$B73,0)","v":{"$error":"#N/A"}},{"$f":"MATCH(Calc2!T$112,Trucks!$B$49:$B73,0)","v":{"$error":"#N/A"}},{"$f":"MATCH(Calc2!U$112,Trucks!$B$49:$B73,0)","v":{"$error":"#N/A"}},{"$f":"MATCH(Calc2!V$112,Trucks!$B$49:$B73,0)","v":{"$error":"#N/A"}},{"$f":"MATCH(Calc2!W$112,Trucks!$B$49:$B73,0)","v":{"$error":"#N/A"}},{"$f":"MATCH(Calc2!X$112,Trucks!$B$49:$B73,0)","v":{"$error":"#N/A"}},{"$f":"MATCH(Calc2!Y$112,Trucks!$B$49:$B73,0)","v":{"$error":"#N/A"}},{"$f":"MATCH(Calc2!Z$112,Trucks!$B$49:$B73,0)","v":{"$error":"#N/A"}},{"$f":"MATCH(Calc2!AA$112,Trucks!$B$49:$B73,0)","v":{"$error":"#N/A"}},{"$f":"MATCH(Calc2!AB$112,Trucks!$B$49:$B73,0)","v":{"$error":"#N/A"}}]
[null,null,{"$f":"MATCH(Calc2!C$112,Trucks!$B$49:$B82,0)","v":6},{"$f":"MATCH(Calc2!D$112,Trucks!$B$49:$B82,0)","v":{"$error":"#N/A"}},{"$f":"MATCH(Calc2!E$112,Trucks!$B$49:$B82,0)","v":{"$error":"#N/A"}},{"$f":"MATCH(Calc2!F$112,Trucks!$B$49:$B82,0)","v":{"$error":"#N/A"}},{"$f":"MATCH(Calc2!G$112,Trucks!$B$49:$B82,0)","v":{"$error":"#N/A"}},{"$f":"MATCH(Calc2!H$112,Trucks!$B$49:$B82,0)","v":{"$error":"#N/A"}},{"$f":"MATCH(Calc2!I$112,Trucks!$B$49:$B82,0)","v":{"$error":"#N/A"}},{"$f":"MATCH(Calc2!J$112,Trucks!$B$49:$B82,0)","v":{"$error":"#N/A"}},{"$f":"MATCH(Calc2!K$112,Trucks!$B$49:$B82,0)","v":{"$error":"#N/A"}},{"$f":"MATCH(Calc2!L$112,Trucks!$B$49:$B82,0)","v":{"$error":"#N/A"}},{"$f":"MATCH(Calc2!M$112,Trucks!$B$49:$B82,0)","v":{"$error":"#N/A"}},{"$f":"MATCH(Calc2!N$112,Trucks!$B$49:$B82,0)","v":{"$error":"#N/A"}},{"$f":"MATCH(Calc2!O$112,Trucks!$B$49:$B82,0)","v":{"$error":"#N/A"}},{"$f":"MATCH(Calc2!P$112,Trucks!$B$49:$B82,0)","v":{"$error":"#N/A"}},{"$f":"MATCH(Calc2!Q$112,Trucks!$B$49:$B82,0)","v":{"$error":"#N/A"}},{"$f":"MATCH(Calc2!R$112,Trucks!$B$49:$B82,0)","v":{"$error":"#N/A"}},{"$f":"MATCH(Calc2!S$112,Trucks!$B$49:$B82,0)","v":{"$error":"#N/A"}},{"$f":"MATCH(Calc2!T$112,Trucks!$B$49:$B82,0)","v":{"$error":"#N/A"}},{"$f":"MATCH(Calc2!U$112,Trucks!$B$49:$B82,0)","v":{"$error":"#N/A"}},{"$f":"MATCH(Calc2!V$112,Trucks!$B$49:$B82,0)","v":{"$error":"#N/A"}},{"$f":"MATCH(Calc2!W$112,Trucks!$B$49:$B82,0)","v":{"$error":"#N/A"}},{"$f":"MATCH(Calc2!X$112,Trucks!$B$49:$B82,0)","v":{"$error":"#N/A"}},{"$f":"MATCH(Calc2!Y$112,Trucks!$B$49:$B82,0)","v":{"$error":"#N/A"}},{"$f":"MATCH(Calc2!Z$112,Trucks!$B$49:$B82,0)","v":{"$error":"#N/A"}},{"$f":"MATCH(Calc2!AA$112,Trucks!$B$49:$B82,0)","v":{"$error":"#N/A"}},{"$f":"MATCH(Calc2!AB$112,Trucks!$B$49:$B82,0)","v":{"$error":"#N/A"}}]
[null,null,{"$f":"MATCH(Calc2!C$112,Trucks!$B$49:$B83,0)","v":6},{"$f":"MATCH(Calc2!D$112,Trucks!$B$49:$B83,0)","v":{"$error":"#N/A"}},{"$f":"MATCH(Calc2!E$112,Trucks!$B$49:$B83,0)","v":{"$error":"#N/A"}},{"$f":"MATCH(Calc2!F$112,Trucks!$B$49:$B83,0)","v":{"$error":"#N/A"}},{"$f":"MATCH(Calc2!G$112,Trucks!$B$49:$B83,0)","v":{"$error":"#N/A"}},{"$f":"MATCH(Calc2!H$112,Trucks!$B$49:$B83,0)","v":{"$error":"#N/A"}},{"$f":"MATCH(Calc2!I$112,Trucks!$B$49:$B83,0)","v":{"$error":"#N/A"}},{"$f":"MATCH(Calc2!J$112,Trucks!$B$49:$B83,0)","v":{"$error":"#N/A"}},{"$f":"MATCH(Calc2!K$112,Trucks!$B$49:$B83,0)","v":{"$error":"#N/A"}},{"$f":"MATCH(Calc2!L$112,Trucks!$B$49:$B83,0)","v":{"$error":"#N/A"}},{"$f":"MATCH(Calc2!M$112,Trucks!$B$49:$B83,0)","v":{"$error":"#N/A"}},{"$f":"MATCH(Calc2!N$112,Trucks!$B$49:$B83,0)","v":{"$error":"#N/A"}},{"$f":"MATCH(Calc2!O$112,Trucks!$B$49:$B83,0)","v":{"$error":"#N/A"}},{"$f":"MATCH(Calc2!P$112,Trucks!$B$49:$B83,0)","v":{"$error":"#N/A"}},{"$f":"MATCH(Calc2!Q$112,Trucks!$B$49:$B83,0)","v":{"$error":"#N/A"}},{"$f":"MATCH(Calc2!R$112,Trucks!$B$49:$B83,0)","v":{"$error":"#N/A"}},{"$f":"MATCH(Calc2!S$112,Trucks!$B$49:$B83,0)","v":{"$error":"#N/A"}},{"$f":"MATCH(Calc2!T$112,Trucks!$B$49:$B83,0)","v":{"$error":"#N/A"}},{"$f":"MATCH(Calc2!U$112,Trucks!$B$49:$B83,0)","v":{"$error":"#N/A"}},{"$f":"MATCH(Calc2!V$112,Trucks!$B$49:$B83,0)","v":{"$error":"#N/A"}},{"$f":"MATCH(Calc2!W$112,Trucks!$B$49:$B83,0)","v":{"$error":"#N/A"}},{"$f":"MATCH(Calc2!X$112,Trucks!$B$49:$B83,0)","v":{"$error":"#N/A"}},{"$f":"MATCH(Calc2!Y$112,Trucks!$B$49:$B83,0)","v":{"$error":"#N/A"}},{"$f":"MATCH(Calc2!Z$112,Trucks!$B$49:$B83,0)","v":{"$error":"#N/A"}},{"$f":"MATCH(Calc2!AA$112,Trucks!$B$49:$B83,0)","v":{"$error":"#N/A"}},{"$f":"MATCH(Calc2!AB$112,Trucks!$B$49:$B83,0)","v":{"$error":"#N/A"}}]
[null,null,{"$f":"MATCH(Calc2!C$112,Trucks!$B$49:$B84,0)","v":6},{"$f":"MATCH(Calc2!D$112,Trucks!$B$49:$B84,0)","v":{"$error":"#N/A"}},{"$f":"MATCH(Calc2!E$112,Trucks!$B$49:$B84,0)","v":{"$error":"#N/A"}},{"$f":"MATCH(Calc2!F$112,Trucks!$B$49:$B84,0)","v":{"$error":"#N/A"}},{"$f":"MATCH(Calc2!G$112,Trucks!$B$49:$B84,0)","v":{"$error":"#N/A"}},{"$f":"MATCH(Calc2!H$112,Trucks!$B$49:$B84,0)","v":{"$error":"#N/A"}},{"$f":"MATCH(Calc2!I$112,Trucks!$B$49:$B84,0)","v":{"$error":"#N/A"}},{"$f":"MATCH(Calc2!J$112,Trucks!$B$49:$B84,0)","v":{"$error":"#N/A"}},{"$f":"MATCH(Calc2!K$112,Trucks!$B$49:$B84,0)","v":{"$error":"#N/A"}},{"$f":"MATCH(Calc2!L$112,Trucks!$B$49:$B84,0)","v":{"$error":"#N/A"}},{"$f":"MATCH(Calc2!M$112,Trucks!$B$49:$B84,0)","v":{"$error":"#N/A"}},{"$f":"MATCH(Calc2!N$112,Trucks!$B$49:$B84,0)","v":{"$error":"#N/A"}},{"$f":"MATCH(Calc2!O$112,Trucks!$B$49:$B84,0)","v":{"$error":"#N/A"}},{"$f":"MATCH(Calc2!P$112,Trucks!$B$49:$B84,0)","v":{"$error":"#N/A"}},{"$f":"MATCH(Calc2!Q$112,Trucks!$B$49:$B84,0)","v":{"$error":"#N/A"}},{"$f":"MATCH(Calc2!R$112,Trucks!$B$49:$B84,0)","v":{"$error":"#N/A"}},{"$f":"MATCH(Calc2!S$112,Trucks!$B$49:$B84,0)","v":{"$error":"#N/A"}},{"$f":"MATCH(Calc2!T$112,Trucks!$B$49:$B84,0)","v":{"$error":"#N/A"}},{"$f":"MATCH(Calc2!U$112,Trucks!$B$49:$B84,0)","v":{"$error":"#N/A"}},{"$f":"MATCH(Calc2!V$112,Trucks!$B$49:$B84,0)","v":{"$error":"#N/A"}},{"$f":"MATCH(Calc2!W$112,Trucks!$B$49:$B84,0)","v":{"$error":"#N/A"}},{"$f":"MATCH(Calc2!X$112,Trucks!$B$49:$B84,0)","v":{"$error":"#N/A"}},{"$f":"MATCH(Calc2!Y$112,Trucks!$B$49:$B84,0)","v":{"$error":"#N/A"}},{"$f":"MATCH(Calc2!Z$112,Trucks!$B$49:$B84,0)","v":{"$error":"#N/A"}},{"$f":"MATCH(Calc2!AA$112,Trucks!$B$49:$B84,0)","v":{"$error":"#N/A"}},{"$f":"MATCH(Calc2!AB$112,Trucks!$B$49:$B84,0)","v":{"$error":"#N/A"}}]
[null,null,{"$f":"MATCH(Calc2!C$112,Trucks!$B$49:$B89,0)","v":6},{"$f":"MATCH(Calc2!D$112,Trucks!$B$49:$B89,0)","v":{"$error":"#N/A"}},{"$f":"MATCH(Calc2!E$112,Trucks!$B$49:$B89,0)","v":{"$error":"#N/A"}},{"$f":"MATCH(Calc2!F$112,Trucks!$B$49:$B89,0)","v":{"$error":"#N/A"}},{"$f":"MATCH(Calc2!G$112,Trucks!$B$49:$B89,0)","v":{"$error":"#N/A"}},{"$f":"MATCH(Calc2!H$112,Trucks!$B$49:$B89,0)","v":{"$error":"#N/A"}},{"$f":"MATCH(Calc2!I$112,Trucks!$B$49:$B89,0)","v":{"$error":"#N/A"}},{"$f":"MATCH(Calc2!J$112,Trucks!$B$49:$B89,0)","v":{"$error":"#N/A"}},{"$f":"MATCH(Calc2!K$112,Trucks!$B$49:$B89,0)","v":{"$error":"#N/A"}},{"$f":"MATCH(Calc2!L$112,Trucks!$B$49:$B89,0)","v":{"$error":"#N/A"}},{"$f":"MATCH(Calc2!M$112,Trucks!$B$49:$B89,0)","v":{"$error":"#N/A"}},{"$f":"MATCH(Calc2!N$112,Trucks!$B$49:$B89,0)","v":{"$error":"#N/A"}},{"$f":"MATCH(Calc2!O$112,Trucks!$B$49:$B89,0)","v":{"$error":"#N/A"}},{"$f":"MATCH(Calc2!P$112,Trucks!$B$49:$B89,0)","v":{"$error":"#N/A"}},{"$f":"MATCH(Calc2!Q$112,Trucks!$B$49:$B89,0)","v":{"$error":"#N/A"}},{"$f":"MATCH(Calc2!R$112,Trucks!$B$49:$B89,0)","v":{"$error":"#N/A"}},{"$f":"MATCH(Calc2!S$112,Trucks!$B$49:$B89,0)","v":{"$error":"#N/A"}},{"$f":"MATCH(Calc2!T$112,Trucks!$B$49:$B89,0)","v":{"$error":"#N/A"}},{"$f":"MATCH(Calc2!U$112,Trucks!$B$49:$B89,0)","v":{"$error":"#N/A"}},{"$f":"MATCH(Calc2!V$112,Trucks!$B$49:$B89,0)","v":{"$error":"#N/A"}},{"$f":"MATCH(Calc2!W$112,Trucks!$B$49:$B89,0)","v":{"$error":"#N/A"}},{"$f":"MATCH(Calc2!X$112,Trucks!$B$49:$B89,0)","v":{"$error":"#N/A"}},{"$f":"MATCH(Calc2!Y$112,Trucks!$B$49:$B89,0)","v":{"$error":"#N/A"}},{"$f":"MATCH(Calc2!Z$112,Trucks!$B$49:$B89,0)","v":{"$error":"#N/A"}},{"$f":"MATCH(Calc2!AA$112,Trucks!$B$49:$B89,0)","v":{"$error":"#N/A"}},{"$f":"MATCH(Calc2!AB$112,Trucks!$B$49:$B89,0)","v":{"$error":"#N/A"}}]
[null,null,{"$f":"MATCH(Calc2!C$112,Trucks!$B$49:$B90,0)","v":6},{"$f":"MATCH(Calc2!D$112,Trucks!$B$49:$B90,0)","v":{"$error":"#N/A"}},{"$f":"MATCH(Calc2!E$112,Trucks!$B$49:$B90,0)","v":{"$error":"#N/A"}},{"$f":"MATCH(Calc2!F$112,Trucks!$B$49:$B90,0)","v":{"$error":"#N/A"}},{"$f":"MATCH(Calc2!G$112,Trucks!$B$49:$B90,0)","v":42},{"$f":"MATCH(Calc2!H$112,Trucks!$B$49:$B90,0)","v":42},{"$f":"MATCH(Calc2!I$112,Trucks!$B$49:$B90,0)","v":42},{"$f":"MATCH(Calc2!J$112,Trucks!$B$49:$B90,0)","v":42},{"$f":"MATCH(Calc2!K$112,Trucks!$B$49:$B90,0)","v":42},{"$f":"MATCH(Calc2!L$112,Trucks!$B$49:$B90,0)","v":42},{"$f":"MATCH(Calc2!M$112,Trucks!$B$49:$B90,0)","v":42},{"$f":"MATCH(Calc2!N$112,Trucks!$B$49:$B90,0)","v":42},{"$f":"MATCH(Calc2!O$112,Trucks!$B$49:$B90,0)","v":42},{"$f":"MATCH(Calc2!P$112,Trucks!$B$49:$B90,0)","v":42},{"$f":"MATCH(Calc2!Q$112,Trucks!$B$49:$B90,0)","v":42},{"$f":"MATCH(Calc2!R$112,Trucks!$B$49:$B90,0)","v":42},{"$f":"MATCH(Calc2!S$112,Trucks!$B$49:$B90,0)","v":42},{"$f":"MATCH(Calc2!T$112,Trucks!$B$49:$B90,0)","v":42},{"$f":"MATCH(Calc2!U$112,Trucks!$B$49:$B90,0)","v":42},{"$f":"MATCH(Calc2!V$112,Trucks!$B$49:$B90,0)","v":42},{"$f":"MATCH(Calc2!W$112,Trucks!$B$49:$B90,0)","v":42},{"$f":"MATCH(Calc2!X$112,Trucks!$B$49:$B90,0)","v":42},{"$f":"MATCH(Calc2!Y$112,Trucks!$B$49:$B90,0)","v":42},{"$f":"MATCH(Calc2!Z$112,Trucks!$B$49:$B90,0)","v":42},{"$f":"MATCH(Calc2!AA$112,Trucks!$B$49:$B90,0)","v":42},{"$f":"MATCH(Calc2!AB$112,Trucks!$B$49:$B90,0)","v":42}]
[null,null,{"$f":"MATCH(Calc2!C$112,Trucks!$B$49:$B91,0)","v":6},{"$f":"MATCH(Calc2!D$112,Trucks!$B$49:$B91,0)","v":{"$error":"#N/A"}},{"$f":"MATCH(Calc2!E$112,Trucks!$B$49:$B91,0)","v":{"$error":"#N/A"}},{"$f":"MATCH(Calc2!F$112,Trucks!$B$49:$B91,0)","v":{"$error":"#N/A"}},{"$f":"MATCH(Calc2!G$112,Trucks!$B$49:$B91,0)","v":42},{"$f":"MATCH(Calc2!H$112,Trucks!$B$49:$B91,0)","v":42},{"$f":"MATCH(Calc2!I$112,Trucks!$B$49:$B91,0)","v":42},{"$f":"MATCH(Calc2!J$112,Trucks!$B$49:$B91,0)","v":42},{"$f":"MATCH(Calc2!K$112,Trucks!$B$49:$B91,0)","v":42},{"$f":"MATCH(Calc2!L$112,Trucks!$B$49:$B91,0)","v":42},{"$f":"MATCH(Calc2!M$112,Trucks!$B$49:$B91,0)","v":42},{"$f":"MATCH(Calc2!N$112,Trucks!$B$49:$B91,0)","v":42},{"$f":"MATCH(Calc2!O$112,Trucks!$B$49:$B91,0)","v":42},{"$f":"MATCH(Calc2!P$112,Trucks!$B$49:$B91,0)","v":42},{"$f":"MATCH(Calc2!Q$112,Trucks!$B$49:$B91,0)","v":42},{"$f":"MATCH(Calc2!R$112,Trucks!$B$49:$B91,0)","v":42},{"$f":"MATCH(Calc2!S$112,Trucks!$B$49:$B91,0)","v":42},{"$f":"MATCH(Calc2!T$112,Trucks!$B$49:$B91,0)","v":42},{"$f":"MATCH(Calc2!U$112,Trucks!$B$49:$B91,0)","v":42},{"$f":"MATCH(Calc2!V$112,Trucks!$B$49:$B91,0)","v":42},{"$f":"MATCH(Calc2!W$112,Trucks!$B$49:$B91,0)","v":42},{"$f":"MATCH(Calc2!X$112,Trucks!$B$49:$B91,0)","v":42},{"$f":"MATCH(Calc2!Y$112,Trucks!$B$49:$B91,0)","v":42},{"$f":"MATCH(Calc2!Z$112,Trucks!$B$49:$B91,0)","v":42},{"$f":"MATCH(Calc2!AA$112,Trucks!$B$49:$B91,0)","v":42},{"$f":"MATCH(Calc2!AB$112,Trucks!$B$49:$B91,0)","v":42}]
[null,null,{"$f":"MATCH(Calc2!C$112,Trucks!$B$49:$B92,0)","v":6},{"$f":"MATCH(Calc2!D$112,Trucks!$B$49:$B92,0)","v":{"$error":"#N/A"}},{"$f":"MATCH(Calc2!E$112,Trucks!$B$49:$B92,0)","v":{"$error":"#N/A"}},{"$f":"MATCH(Calc2!F$112,Trucks!$B$49:$B92,0)","v":{"$error":"#N/A"}},{"$f":"MATCH(Calc2!G$112,Trucks!$B$49:$B92,0)","v":42},{"$f":"MATCH(Calc2!H$112,Trucks!$B$49:$B92,0)","v":42},{"$f":"MATCH(Calc2!I$112,Trucks!$B$49:$B92,0)","v":42},{"$f":"MATCH(Calc2!J$112,Trucks!$B$49:$B92,0)","v":42},{"$f":"MATCH(Calc2!K$112,Trucks!$B$49:$B92,0)","v":42},{"$f":"MATCH(Calc2!L$112,Trucks!$B$49:$B92,0)","v":42},{"$f":"MATCH(Calc2!M$112,Trucks!$B$49:$B92,0)","v":42},{"$f":"MATCH(Calc2!N$112,Trucks!$B$49:$B92,0)","v":42},{"$f":"MATCH(Calc2!O$112,Trucks!$B$49:$B92,0)","v":42},{"$f":"MATCH(Calc2!P$112,Trucks!$B$49:$B92,0)","v":42},{"$f":"MATCH(Calc2!Q$112,Trucks!$B$49:$B92,0)","v":42},{"$f":"MATCH(Calc2!R$112,Trucks!$B$49:$B92,0)","v":42},{"$f":"MATCH(Calc2!S$112,Trucks!$B$49:$B92,0)","v":42},{"$f":"MATCH(Calc2!T$112,Trucks!$B$49:$B92,0)","v":42},{"$f":"MATCH(Calc2!U$112,Trucks!$B$49:$B92,0)","v":42},{"$f":"MATCH(Calc2!V$112,Trucks!$B$49:$B92,0)","v":42},{"$f":"MATCH(Calc2!W$112,Trucks!$B$49:$B92,0)","v":42},{"$f":"MATCH(Calc2!X$112,Trucks!$B$49:$B92,0)","v":42},{"$f":"MATCH(Calc2!Y$112,Trucks!$B$49:$B92,0)","v":42},{"$f":"MATCH(Calc2!Z$112,Trucks!$B$49:$B92,0)","v":42},{"$f":"MATCH(Calc2!AA$112,Trucks!$B$49:$B92,0)","v":42},{"$f":"MATCH(Calc2!AB$112,Trucks!$B$49:$B92,0)","v":42}]
[null,null,{"$f":"MATCH(Calc2!C$112,Trucks!$B$49:$B93,0)","v":6},{"$f":"MATCH(Calc2!D$112,Trucks!$B$49:$B93,0)","v":{"$error":"#N/A"}},{"$f":"MATCH(Calc2!E$112,Trucks!$B$49:$B93,0)","v":{"$error":"#N/A"}},{"$f":"MATCH(Calc2!F$112,Trucks!$B$49:$B93,0)","v":{"$error":"#N/A"}},{"$f":"MATCH(Calc2!G$112,Trucks!$B$49:$B93,0)","v":42},{"$f":"MATCH(Calc2!H$112,Trucks!$B$49:$B93,0)","v":42},{"$f":"MATCH(Calc2!I$112,Trucks!$B$49:$B93,0)","v":42},{"$f":"MATCH(Calc2!J$112,Trucks!$B$49:$B93,0)","v":42},{"$f":"MATCH(Calc2!K$112,Trucks!$B$49:$B93,0)","v":42},{"$f":"MATCH(Calc2!L$112,Trucks!$B$49:$B93,0)","v":42},{"$f":"MATCH(Calc2!M$112,Trucks!$B$49:$B93,0)","v":42},{"$f":"MATCH(Calc2!N$112,Trucks!$B$49:$B93,0)","v":42},{"$f":"MATCH(Calc2!O$112,Trucks!$B$49:$B93,0)","v":42},{"$f":"MATCH(Calc2!P$112,Trucks!$B$49:$B93,0)","v":42},{"$f":"MATCH(Calc2!Q$112,Trucks!$B$49:$B93,0)","v":42},{"$f":"MATCH(Calc2!R$112,Trucks!$B$49:$B93,0)","v":42},{"$f":"MATCH(Calc2!S$112,Trucks!$B$49:$B93,0)","v":42},{"$f":"MATCH(Calc2!T$112,Trucks!$B$49:$B93,0)","v":42},{"$f":"MATCH(Calc2!U$112,Trucks!$B$49:$B93,0)","v":42},{"$f":"MATCH(Calc2!V$112,Trucks!$B$49:$B93,0)","v":42},{"$f":"MATCH(Calc2!W$112,Trucks!$B$49:$B93,0)","v":42},{"$f":"MATCH(Calc2!X$112,Trucks!$B$49:$B93,0)","v":42},{"$f":"MATCH(Calc2!Y$112,Trucks!$B$49:$B93,0)","v":42},{"$f":"MATCH(Calc2!Z$112,Trucks!$B$49:$B93,0)","v":42},{"$f":"MATCH(Calc2!AA$112,Trucks!$B$49:$B93,0)","v":42},{"$f":"MATCH(Calc2!AB$112,Trucks!$B$49:$B93,0)","v":42}]
[null,null,{"$f":"MATCH(Calc2!C$112,Trucks!$B$49:$B94,0)","v":6},{"$f":"MATCH(Calc2!D$112,Trucks!$B$49:$B94,0)","v":{"$error":"#N/A"}},{"$f":"MATCH(Calc2!E$112,Trucks!$B$49:$B94,0)","v":{"$error":"#N/A"}},{"$f":"MATCH(Calc2!F$112,Trucks!$B$49:$B94,0)","v":{"$error":"#N/A"}},{"$f":"MATCH(Calc2!G$112,Trucks!$B$49:$B94,0)","v":42},{"$f":"MATCH(Calc2!H$112,Trucks!$B$49:$B94,0)","v":42},{"$f":"MATCH(Calc2!I$112,Trucks!$B$49:$B94,0)","v":42},{"$f":"MATCH(Calc2!J$112,Trucks!$B$49:$B94,0)","v":42},{"$f":"MATCH(Calc2!K$112,Trucks!$B$49:$B94,0)","v":42},{"$f":"MATCH(Calc2!L$112,Trucks!$B$49:$B94,0)","v":42},{"$f":"MATCH(Calc2!M$112,Trucks!$B$49:$B94,0)","v":42},{"$f":"MATCH(Calc2!N$112,Trucks!$B$49:$B94,0)","v":42},{"$f":"MATCH(Calc2!O$112,Trucks!$B$49:$B94,0)","v":42},{"$f":"MATCH(Calc2!P$112,Trucks!$B$49:$B94,0)","v":42},{"$f":"MATCH(Calc2!Q$112,Trucks!$B$49:$B94,0)","v":42},{"$f":"MATCH(Calc2!R$112,Trucks!$B$49:$B94,0)","v":42},{"$f":"MATCH(Calc2!S$112,Trucks!$B$49:$B94,0)","v":42},{"$f":"MATCH(Calc2!T$112,Trucks!$B$49:$B94,0)","v":42},{"$f":"MATCH(Calc2!U$112,Trucks!$B$49:$B94,0)","v":42},{"$f":"MATCH(Calc2!V$112,Trucks!$B$49:$B94,0)","v":42},{"$f":"MATCH(Calc2!W$112,Trucks!$B$49:$B94,0)","v":42},{"$f":"MATCH(Calc2!X$112,Trucks!$B$49:$B94,0)","v":42},{"$f":"MATCH(Calc2!Y$112,Trucks!$B$49:$B94,0)","v":42},{"$f":"MATCH(Calc2!Z$112,Trucks!$B$49:$B94,0)","v":42},{"$f":"MATCH(Calc2!AA$112,Trucks!$B$49:$B94,0)","v":42},{"$f":"MATCH(Calc2!AB$112,Trucks!$B$49:$B94,0)","v":42}]
[null,null,{"$f":"MATCH(Calc2!C$112,Trucks!$B$49:$B95,0)","v":6},{"$f":"MATCH(Calc2!D$112,Trucks!$B$49:$B95,0)","v":{"$error":"#N/A"}},{"$f":"MATCH(Calc2!E$112,Trucks!$B$49:$B95,0)","v":{"$error":"#N/A"}},{"$f":"MATCH(Calc2!F$112,Trucks!$B$49:$B95,0)","v":{"$error":"#N/A"}},{"$f":"MATCH(Calc2!G$112,Trucks!$B$49:$B95,0)","v":42},{"$f":"MATCH(Calc2!H$112,Trucks!$B$49:$B95,0)","v":42},{"$f":"MATCH(Calc2!I$112,Trucks!$B$49:$B95,0)","v":42},{"$f":"MATCH(Calc2!J$112,Trucks!$B$49:$B95,0)","v":42},{"$f":"MATCH(Calc2!K$112,Trucks!$B$49:$B95,0)","v":42},{"$f":"MATCH(Calc2!L$112,Trucks!$B$49:$B95,0)","v":42},{"$f":"MATCH(Calc2!M$112,Trucks!$B$49:$B95,0)","v":42},{"$f":"MATCH(Calc2!N$112,Trucks!$B$49:$B95,0)","v":42},{"$f":"MATCH(Calc2!O$112,Trucks!$B$49:$B95,0)","v":42},{"$f":"MATCH(Calc2!P$112,Trucks!$B$49:$B95,0)","v":42},{"$f":"MATCH(Calc2!Q$112,Trucks!$B$49:$B95,0)","v":42},{"$f":"MATCH(Calc2!R$112,Trucks!$B$49:$B95,0)","v":42},{"$f":"MATCH(Calc2!S$112,Trucks!$B$49:$B95,0)","v":42},{"$f":"MATCH(Calc2!T$112,Trucks!$B$49:$B95,0)","v":42},{"$f":"MATCH(Calc2!U$112,Trucks!$B$49:$B95,0)","v":42},{"$f":"MATCH(Calc2!V$112,Trucks!$B$49:$B95,0)","v":42},{"$f":"MATCH(Calc2!W$112,Trucks!$B$49:$B95,0)","v":42},{"$f":"MATCH(Calc2!X$112,Trucks!$B$49:$B95,0)","v":42},{"$f":"MATCH(Calc2!Y$112,Trucks!$B$49:$B95,0)","v":42},{"$f":"MATCH(Calc2!Z$112,Trucks!$B$49:$B95,0)","v":42},{"$f":"MATCH(Calc2!AA$112,Trucks!$B$49:$B95,0)","v":42},{"$f":"MATCH(Calc2!AB$112,Trucks!$B$49:$B95,0)","v":42}]
[null,null,{"$f":"MATCH(Calc2!C$112,Trucks!$B$49:$B96,0)","v":6},{"$f":"MATCH(Calc2!D$112,Trucks!$B$49:$B96,0)","v":{"$error":"#N/A"}},{"$f":"MATCH(Calc2!E$112,Trucks!$B$49:$B96,0)","v":{"$error":"#N/A"}},{"$f":"MATCH(Calc2!F$112,Trucks!$B$49:$B96,0)","v":{"$error":"#N/A"}},{"$f":"MATCH(Calc2!G$112,Trucks!$B$49:$B96,0)","v":42},{"$f":"MATCH(Calc2!H$112,Trucks!$B$49:$B96,0)","v":42},{"$f":"MATCH(Calc2!I$112,Trucks!$B$49:$B96,0)","v":42},{"$f":"MATCH(Calc2!J$112,Trucks!$B$49:$B96,0)","v":42},{"$f":"MATCH(Calc2!K$112,Trucks!$B$49:$B96,0)","v":42},{"$f":"MATCH(Calc2!L$112,Trucks!$B$49:$B96,0)","v":42},{"$f":"MATCH(Calc2!M$112,Trucks!$B$49:$B96,0)","v":42},{"$f":"MATCH(Calc2!N$112,Trucks!$B$49:$B96,0)","v":42},{"$f":"MATCH(Calc2!O$112,Trucks!$B$49:$B96,0)","v":42},{"$f":"MATCH(Calc2!P$112,Trucks!$B$49:$B96,0)","v":42},{"$f":"MATCH(Calc2!Q$112,Trucks!$B$49:$B96,0)","v":42},{"$f":"MATCH(Calc2!R$112,Trucks!$B$49:$B96,0)","v":42},{"$f":"MATCH(Calc2!S$112,Trucks!$B$49:$B96,0)","v":42},{"$f":"MATCH(Calc2!T$112,Trucks!$B$49:$B96,0)","v":42},{"$f":"MATCH(Calc2!U$112,Trucks!$B$49:$B96,0)","v":42},{"$f":"MATCH(Calc2!V$112,Trucks!$B$49:$B96,0)","v":42},{"$f":"MATCH(Calc2!W$112,Trucks!$B$49:$B96,0)","v":42},{"$f":"MATCH(Calc2!X$112,Trucks!$B$49:$B96,0)","v":42},{"$f":"MATCH(Calc2!Y$112,Trucks!$B$49:$B96,0)","v":42},{"$f":"MATCH(Calc2!Z$112,Trucks!$B$49:$B96,0)","v":42},{"$f":"MATCH(Calc2!AA$112,Trucks!$B$49:$B96,0)","v":42},{"$f":"MATCH(Calc2!AB$112,Trucks!$B$49:$B96,0)","v":42}]
[null,null,{"$f":"MATCH(Calc2!C$112,Trucks!$B$49:$B97,0)","v":6},{"$f":"MATCH(Calc2!D$112,Trucks!$B$49:$B97,0)","v":{"$error":"#N/A"}},{"$f":"MATCH(Calc2!E$112,Trucks!$B$49:$B97,0)","v":{"$error":"#N/A"}},{"$f":"MATCH(Calc2!F$112,Trucks!$B$49:$B97,0)","v":{"$error":"#N/A"}},{"$f":"MATCH(Calc2!G$112,Trucks!$B$49:$B97,0)","v":42},{"$f":"MATCH(Calc2!H$112,Trucks!$B$49:$B97,0)","v":42},{"$f":"MATCH(Calc2!I$112,Trucks!$B$49:$B97,0)","v":42},{"$f":"MATCH(Calc2!J$112,Trucks!$B$49:$B97,0)","v":42},{"$f":"MATCH(Calc2!K$112,Trucks!$B$49:$B97,0)","v":42},{"$f":"MATCH(Calc2!L$112,Trucks!$B$49:$B97,0)","v":42},{"$f":"MATCH(Calc2!M$112,Trucks!$B$49:$B97,0)","v":42},{"$f":"MATCH(Calc2!N$112,Trucks!$B$49:$B97,0)","v":42},{"$f":"MATCH(Calc2!O$112,Trucks!$B$49:$B97,0)","v":42},{"$f":"MATCH(Calc2!P$112,Trucks!$B$49:$B97,0)","v":42},{"$f":"MATCH(Calc2!Q$112,Trucks!$B$49:$B97,0)","v":42},{"$f":"MATCH(Calc2!R$112,Trucks!$B$49:$B97,0)","v":42},{"$f":"MATCH(Calc2!S$112,Trucks!$B$49:$B97,0)","v":42},{"$f":"MATCH(Calc2!T$112,Trucks!$B$49:$B97,0)","v":42},{"$f":"MATCH(Calc2!U$112,Trucks!$B$49:$B97,0)","v":42},{"$f":"MATCH(Calc2!V$112,Trucks!$B$49:$B97,0)","v":42},{"$f":"MATCH(Calc2!W$112,Trucks!$B$49:$B97,0)","v":42},{"$f":"MATCH(Calc2!X$112,Trucks!$B$49:$B97,0)","v":42},{"$f":"MATCH(Calc2!Y$112,Trucks!$B$49:$B97,0)","v":42},{"$f":"MATCH(Calc2!Z$112,Trucks!$B$49:$B97,0)","v":42},{"$f":"MATCH(Calc2!AA$112,Trucks!$B$49:$B97,0)","v":42},{"$f":"MATCH(Calc2!AB$112,Trucks!$B$49:$B97,0)","v":42}]
[null,null,{"$f":"MATCH(Calc2!C$112,Trucks!$B$49:$B98,0)","v":6},{"$f":"MATCH(Calc2!D$112,Trucks!$B$49:$B98,0)","v":{"$error":"#N/A"}},{"$f":"MATCH(Calc2!E$112,Trucks!$B$49:$B98,0)","v":{"$error":"#N/A"}},{"$f":"MATCH(Calc2!F$112,Trucks!$B$49:$B98,0)","v":{"$error":"#N/A"}},{"$f":"MATCH(Calc2!G$112,Trucks!$B$49:$B98,0)","v":42},{"$f":"MATCH(Calc2!H$112,Trucks!$B$49:$B98,0)","v":42},{"$f":"MATCH(Calc2!I$112,Trucks!$B$49:$B98,0)","v":42},{"$f":"MATCH(Calc2!J$112,Trucks!$B$49:$B98,0)","v":42},{"$f":"MATCH(Calc2!K$112,Trucks!$B$49:$B98,0)","v":42},{"$f":"MATCH(Calc2!L$112,Trucks!$B$49:$B98,0)","v":42},{"$f":"MATCH(Calc2!M$112,Trucks!$B$49:$B98,0)","v":42},{"$f":"MATCH(Calc2!N$112,Trucks!$B$49:$B98,0)","v":42},{"$f":"MATCH(Calc2!O$112,Trucks!$B$49:$B98,0)","v":42},{"$f":"MATCH(Calc2!P$112,Trucks!$B$49:$B98,0)","v":42},{"$f":"MATCH(Calc2!Q$112,Trucks!$B$49:$B98,0)","v":42},{"$f":"MATCH(Calc2!R$112,Trucks!$B$49:$B98,0)","v":42},{"$f":"MATCH(Calc2!S$112,Trucks!$B$49:$B98,0)","v":42},{"$f":"MATCH(Calc2!T$112,Trucks!$B$49:$B98,0)","v":42},{"$f":"MATCH(Calc2!U$112,Trucks!$B$49:$B98,0)","v":42},{"$f":"MATCH(Calc2!V$112,Trucks!$B$49:$B98,0)","v":42},{"$f":"MATCH(Calc2!W$112,Trucks!$B$49:$B98,0)","v":42},{"$f":"MATCH(Calc2!X$112,Trucks!$B$49:$B98,0)","v":42},{"$f":"MATCH(Calc2!Y$112,Trucks!$B$49:$B98,0)","v":42},{"$f":"MATCH(Calc2!Z$112,Trucks!$B$49:$B98,0)","v":42},{"$f":"MATCH(Calc2!AA$112,Trucks!$B$49:$B98,0)","v":42},{"$f":"MATCH(Calc2!AB$112,Trucks!$B$49:$B98,0)","v":42}]
[null,null,{"$f":"MATCH(Calc2!C$112,Trucks!$B$49:$B99,0)","v":6},{"$f":"MATCH(Calc2!D$112,Trucks!$B$49:$B99,0)","v":{"$error":"#N/A"}},{"$f":"MATCH(Calc2!E$112,Trucks!$B$49:$B99,0)","v":{"$error":"#N/A"}},{"$f":"MATCH(Calc2!F$112,Trucks!$B$49:$B99,0)","v":{"$error":"#N/A"}},{"$f":"MATCH(Calc2!G$112,Trucks!$B$49:$B99,0)","v":42},{"$f":"MATCH(Calc2!H$112,Trucks!$B$49:$B99,0)","v":42},{"$f":"MATCH(Calc2!I$112,Trucks!$B$49:$B99,0)","v":42},{"$f":"MATCH(Calc2!J$112,Trucks!$B$49:$B99,0)","v":42},{"$f":"MATCH(Calc2!K$112,Trucks!$B$49:$B99,0)","v":42},{"$f":"MATCH(Calc2!L$112,Trucks!$B$49:$B99,0)","v":42},{"$f":"MATCH(Calc2!M$112,Trucks!$B$49:$B99,0)","v":42},{"$f":"MATCH(Calc2!N$112,Trucks!$B$49:$B99,0)","v":42},{"$f":"MATCH(Calc2!O$112,Trucks!$B$49:$B99,0)","v":42},{"$f":"MATCH(Calc2!P$112,Trucks!$B$49:$B99,0)","v":42},{"$f":"MATCH(Calc2!Q$112,Trucks!$B$49:$B99,0)","v":42},{"$f":"MATCH(Calc2!R$112,Trucks!$B$49:$B99,0)","v":42},{"$f":"MATCH(Calc2!S$112,Trucks!$B$49:$B99,0)","v":42},{"$f":"MATCH(Calc2!T$112,Trucks!$B$49:$B99,0)","v":42},{"$f":"MATCH(Calc2!U$112,Trucks!$B$49:$B99,0)","v":42},{"$f":"MATCH(Calc2!V$112,Trucks!$B$49:$B99,0)","v":42},{"$f":"MATCH(Calc2!W$112,Trucks!$B$49:$B99,0)","v":42},{"$f":"MATCH(Calc2!X$112,Trucks!$B$49:$B99,0)","v":42},{"$f":"MATCH(Calc2!Y$112,Trucks!$B$49:$B99,0)","v":42},{"$f":"MATCH(Calc2!Z$112,Trucks!$B$49:$B99,0)","v":42},{"$f":"MATCH(Calc2!AA$112,Trucks!$B$49:$B99,0)","v":42},{"$f":"MATCH(Calc2!AB$112,Trucks!$B$49:$B99,0)","v":42}]
[null,null,{"$f":"MATCH(Calc2!C$112,Trucks!$B$49:$B100,0)","v":6},{"$f":"MATCH(Calc2!D$112,Trucks!$B$49:$B100,0)","v":{"$error":"#N/A"}},{"$f":"MATCH(Calc2!E$112,Trucks!$B$49:$B100,0)","v":{"$error":"#N/A"}},{"$f":"MATCH(Calc2!F$112,Trucks!$B$49:$B100,0)","v":{"$error":"#N/A"}},{"$f":"MATCH(Calc2!G$112,Trucks!$B$49:$B100,0)","v":42},{"$f":"MATCH(Calc2!H$112,Trucks!$B$49:$B100,0)","v":42},{"$f":"MATCH(Calc2!I$112,Trucks!$B$49:$B100,0)","v":42},{"$f":"MATCH(Calc2!J$112,Trucks!$B$49:$B100,0)","v":42},{"$f":"MATCH(Calc2!K$112,Trucks!$B$49:$B100,0)","v":42},{"$f":"MATCH(Calc2!L$112,Trucks!$B$49:$B100,0)","v":42},{"$f":"MATCH(Calc2!M$112,Trucks!$B$49:$B100,0)","v":42},{"$f":"MATCH(Calc2!N$112,Trucks!$B$49:$B100,0)","v":42},{"$f":"MATCH(Calc2!O$112,Trucks!$B$49:$B100,0)","v":42},{"$f":"MATCH(Calc2!P$112,Trucks!$B$49:$B100,0)","v":42},{"$f":"MATCH(Calc2!Q$112,Trucks!$B$49:$B100,0)","v":42},{"$f":"MATCH(Calc2!R$112,Trucks!$B$49:$B100,0)","v":42},{"$f":"MATCH(Calc2!S$112,Trucks!$B$49:$B100,0)","v":42},{"$f":"MATCH(Calc2!T$112,Trucks!$B$49:$B100,0)","v":42},{"$f":"MATCH(Calc2!U$112,Trucks!$B$49:$B100,0)","v":42},{"$f":"MATCH(Calc2!V$112,Trucks!$B$49:$B100,0)","v":42},{"$f":"MATCH(Calc2!W$112,Trucks!$B$49:$B100,0)","v":42},{"$f":"MATCH(Calc2!X$112,Trucks!$B$49:$B100,0)","v":42},{"$f":"MATCH(Calc2!Y$112,Trucks!$B$49:$B100,0)","v":42},{"$f":"MATCH(Calc2!Z$112,Trucks!$B$49:$B100,0)","v":42},{"$f":"MATCH(Calc2!AA$112,Trucks!$B$49:$B100,0)","v":42},{"$f":"MATCH(Calc2!AB$112,Trucks!$B$49:$B100,0)","v":42}]
[null,null,{"$f":"MATCH(Calc2!C$112,Trucks!$B$49:$B101,0)","v":6},{"$f":"MATCH(Calc2!D$112,Trucks!$B$49:$B101,0)","v":{"$error":"#N/A"}},{"$f":"MATCH(Calc2!E$112,Trucks!$B$49:$B101,0)","v":{"$error":"#N/A"}},{"$f":"MATCH(Calc2!F$112,Trucks!$B$49:$B101,0)","v":{"$error":"#N/A"}},{"$f":"MATCH(Calc2!G$112,Trucks!$B$49:$B101,0)","v":42},{"$f":"MATCH(Calc2!H$112,Trucks!$B$49:$B101,0)","v":42},{"$f":"MATCH(Calc2!I$112,Trucks!$B$49:$B101,0)","v":42},{"$f":"MATCH(Calc2!J$112,Trucks!$B$49:$B101,0)","v":42},{"$f":"MATCH(Calc2!K$112,Trucks!$B$49:$B101,0)","v":42},{"$f":"MATCH(Calc2!L$112,Trucks!$B$49:$B101,0)","v":42},{"$f":"MATCH(Calc2!M$112,Trucks!$B$49:$B101,0)","v":42},{"$f":"MATCH(Calc2!N$112,Trucks!$B$49:$B101,0)","v":42},{"$f":"MATCH(Calc2!O$112,Trucks!$B$49:$B101,0)","v":42},{"$f":"MATCH(Calc2!P$112,Trucks!$B$49:$B101,0)","v":42},{"$f":"MATCH(Calc2!Q$112,Trucks!$B$49:$B101,0)","v":42},{"$f":"MATCH(Calc2!R$112,Trucks!$B$49:$B101,0)","v":42},{"$f":"MATCH(Calc2!S$112,Trucks!$B$49:$B101,0)","v":42},{"$f":"MATCH(Calc2!T$112,Trucks!$B$49:$B101,0)","v":42},{"$f":"MATCH(Calc2!U$112,Trucks!$B$49:$B101,0)","v":42},{"$f":"MATCH(Calc2!V$112,Trucks!$B$49:$B101,0)","v":42},{"$f":"MATCH(Calc2!W$112,Trucks!$B$49:$B101,0)","v":42},{"$f":"MATCH(Calc2!X$112,Trucks!$B$49:$B101,0)","v":42},{"$f":"MATCH(Calc2!Y$112,Trucks!$B$49:$B101,0)","v":42},{"$f":"MATCH(Calc2!Z$112,Trucks!$B$49:$B101,0)","v":42},{"$f":"MATCH(Calc2!AA$112,Trucks!$B$49:$B101,0)","v":42},{"$f":"MATCH(Calc2!AB$112,Trucks!$B$49:$B101,0)","v":42}]
[null,null,{"$f":"MATCH(Calc2!C$112,Trucks!$B$49:$B102,0)","v":6},{"$f":"MATCH(Calc2!D$112,Trucks!$B$49:$B102,0)","v":{"$error":"#N/A"}},{"$f":"MATCH(Calc2!E$112,Trucks!$B$49:$B102,0)","v":{"$error":"#N/A"}},{"$f":"MATCH(Calc2!F$112,Trucks!$B$49:$B102,0)","v":{"$error":"#N/A"}},{"$f":"MATCH(Calc2!G$112,Trucks!$B$49:$B102,0)","v":42},{"$f":"MATCH(Calc2!H$112,Trucks!$B$49:$B102,0)","v":42},{"$f":"MATCH(Calc2!I$112,Trucks!$B$49:$B102,0)","v":42},{"$f":"MATCH(Calc2!J$112,Trucks!$B$49:$B102,0)","v":42},{"$f":"MATCH(Calc2!K$112,Trucks!$B$49:$B102,0)","v":42},{"$f":"MATCH(Calc2!L$112,Trucks!$B$49:$B102,0)","v":42},{"$f":"MATCH(Calc2!M$112,Trucks!$B$49:$B102,0)","v":42},{"$f":"MATCH(Calc2!N$112,Trucks!$B$49:$B102,0)","v":42},{"$f":"MATCH(Calc2!O$112,Trucks!$B$49:$B102,0)","v":42},{"$f":"MATCH(Calc2!P$112,Trucks!$B$49:$B102,0)","v":42},{"$f":"MATCH(Calc2!Q$112,Trucks!$B$49:$B102,0)","v":42},{"$f":"MATCH(Calc2!R$112,Trucks!$B$49:$B102,0)","v":42},{"$f":"MATCH(Calc2!S$112,Trucks!$B$49:$B102,0)","v":42},{"$f":"MATCH(Calc2!T$112,Trucks!$B$49:$B102,0)","v":42},{"$f":"MATCH(Calc2!U$112,Trucks!$B$49:$B102,0)","v":42},{"$f":"MATCH(Calc2!V$112,Trucks!$B$49:$B102,0)","v":42},{"$f":"MATCH(Calc2!W$112,Trucks!$B$49:$B102,0)","v":42},{"$f":"MATCH(Calc2!X$112,Trucks!$B$49:$B102,0)","v":42},{"$f":"MATCH(Calc2!Y$112,Trucks!$B$49:$B102,0)","v":42},{"$f":"MATCH(Calc2!Z$112,Trucks!$B$49:$B102,0)","v":42},{"$f":"MATCH(Calc2!AA$112,Trucks!$B$49:$B102,0)","v":42},{"$f":"MATCH(Calc2!AB$112,Trucks!$B$49:$B102,0)","v":42}]
[null,null,{"$f":"MATCH(Calc2!C$112,Trucks!$B$49:$B103,0)","v":6},{"$f":"MATCH(Calc2!D$112,Trucks!$B$49:$B103,0)","v":{"$error":"#N/A"}},{"$f":"MATCH(Calc2!E$112,Trucks!$B$49:$B103,0)","v":{"$error":"#N/A"}},{"$f":"MATCH(Calc2!F$112,Trucks!$B$49:$B103,0)","v":{"$error":"#N/A"}},{"$f":"MATCH(Calc2!G$112,Trucks!$B$49:$B103,0)","v":42},{"$f":"MATCH(Calc2!H$112,Trucks!$B$49:$B103,0)","v":42},{"$f":"MATCH(Calc2!I$112,Trucks!$B$49:$B103,0)","v":42},{"$f":"MATCH(Calc2!J$112,Trucks!$B$49:$B103,0)","v":42},{"$f":"MATCH(Calc2!K$112,Trucks!$B$49:$B103,0)","v":42},{"$f":"MATCH(Calc2!L$112,Trucks!$B$49:$B103,0)","v":42},{"$f":"MATCH(Calc2!M$112,Trucks!$B$49:$B103,0)","v":42},{"$f":"MATCH(Calc2!N$112,Trucks!$B$49:$B103,0)","v":42},{"$f":"MATCH(Calc2!O$112,Trucks!$B$49:$B103,0)","v":42},{"$f":"MATCH(Calc2!P$112,Trucks!$B$49:$B103,0)","v":42},{"$f":"MATCH(Calc2!Q$112,Trucks!$B$49:$B103,0)","v":42},{"$f":"MATCH(Calc2!R$112,Trucks!$B$49:$B103,0)","v":42},{"$f":"MATCH(Calc2!S$112,Trucks!$B$49:$B103,0)","v":42},{"$f":"MATCH(Calc2!T$112,Trucks!$B$49:$B103,0)","v":42},{"$f":"MATCH(Calc2!U$112,Trucks!$B$49:$B103,0)","v":42},{"$f":"MATCH(Calc2!V$112,Trucks!$B$49:$B103,0)","v":42},{"$f":"MATCH(Calc2!W$112,Trucks!$B$49:$B103,0)","v":42},{"$f":"MATCH(Calc2!X$112,Trucks!$B$49:$B103,0)","v":42},{"$f":"MATCH(Calc2!Y$112,Trucks!$B$49:$B103,0)","v":42},{"$f":"MATCH(Calc2!Z$112,Trucks!$B$49:$B103,0)","v":42},{"$f":"MATCH(Calc2!AA$112,Trucks!$B$49:$B103,0)","v":42},{"$f":"MATCH(Calc2!AB$112,Trucks!$B$49:$B103,0)","v":42}]
[null,null,{"$f":"MATCH(Calc2!C$112,Trucks!$B$49:$B104,0)","v":6},{"$f":"MATCH(Calc2!D$112,Trucks!$B$49:$B104,0)","v":{"$error":"#N/A"}},{"$f":"MATCH(Calc2!E$112,Trucks!$B$49:$B104,0)","v":{"$error":"#N/A"}},{"$f":"MATCH(Calc2!F$112,Trucks!$B$49:$B104,0)","v":{"$error":"#N/A"}},{"$f":"MATCH(Calc2!G$112,Trucks!$B$49:$B104,0)","v":42},{"$f":"MATCH(Calc2!H$112,Trucks!$B$49:$B104,0)","v":42},{"$f":"MATCH(Calc2!I$112,Trucks!$B$49:$B104,0)","v":42},{"$f":"MATCH(Calc2!J$112,Trucks!$B$49:$B104,0)","v":42},{"$f":"MATCH(Calc2!K$112,Trucks!$B$49:$B104,0)","v":42},{"$f":"MATCH(Calc2!L$112,Trucks!$B$49:$B104,0)","v":42},{"$f":"MATCH(Calc2!M$112,Trucks!$B$49:$B104,0)","v":42},{"$f":"MATCH(Calc2!N$112,Trucks!$B$49:$B104,0)","v":42},{"$f":"MATCH(Calc2!O$112,Trucks!$B$49:$B104,0)","v":42},{"$f":"MATCH(Calc2!P$112,Trucks!$B$49:$B104,0)","v":42},{"$f":"MATCH(Calc2!Q$112,Trucks!$B$49:$B104,0)","v":42},{"$f":"MATCH(Calc2!R$112,Trucks!$B$49:$B104,0)","v":42},{"$f":"MATCH(Calc2!S$112,Trucks!$B$49:$B104,0)","v":42},{"$f":"MATCH(Calc2!T$112,Trucks!$B$49:$B104,0)","v":42},{"$f":"MATCH(Calc2!U$112,Trucks!$B$49:$B104,0)","v":42},{"$f":"MATCH(Calc2!V$112,Trucks!$B$49:$B104,0)","v":42},{"$f":"MATCH(Calc2!W$112,Trucks!$B$49:$B104,0)","v":42},{"$f":"MATCH(Calc2!X$112,Trucks!$B$49:$B104,0)","v":42},{"$f":"MATCH(Calc2!Y$112,Trucks!$B$49:$B104,0)","v":42},{"$f":"MATCH(Calc2!Z$112,Trucks!$B$49:$B104,0)","v":42},{"$f":"MATCH(Calc2!AA$112,Trucks!$B$49:$B104,0)","v":42},{"$f":"MATCH(Calc2!AB$112,Trucks!$B$49:$B104,0)","v":42}]
[null,null,{"$f":"MATCH(Calc2!C$112,Trucks!$B$49:$B105,0)","v":6},{"$f":"MATCH(Calc2!D$112,Trucks!$B$49:$B105,0)","v":{"$error":"#N/A"}},{"$f":"MATCH(Calc2!E$112,Trucks!$B$49:$B105,0)","v":{"$error":"#N/A"}},{"$f":"MATCH(Calc2!F$112,Trucks!$B$49:$B105,0)","v":{"$error":"#N/A"}},{"$f":"MATCH(Calc2!G$112,Trucks!$B$49:$B105,0)","v":42},{"$f":"MATCH(Calc2!H$112,Trucks!$B$49:$B105,0)","v":42},{"$f":"MATCH(Calc2!I$112,Trucks!$B$49:$B105,0)","v":42},{"$f":"MATCH(Calc2!J$112,Trucks!$B$49:$B105,0)","v":42},{"$f":"MATCH(Calc2!K$112,Trucks!$B$49:$B105,0)","v":42},{"$f":"MATCH(Calc2!L$112,Trucks!$B$49:$B105,0)","v":42},{"$f":"MATCH(Calc2!M$112,Trucks!$B$49:$B105,0)","v":42},{"$f":"MATCH(Calc2!N$112,Trucks!$B$49:$B105,0)","v":42},{"$f":"MATCH(Calc2!O$112,Trucks!$B$49:$B105,0)","v":42},{"$f":"MATCH(Calc2!P$112,Trucks!$B$49:$B105,0)","v":42},{"$f":"MATCH(Calc2!Q$112,Trucks!$B$49:$B105,0)","v":42},{"$f":"MATCH(Calc2!R$112,Trucks!$B$49:$B105,0)","v":42},{"$f":"MATCH(Calc2!S$112,Trucks!$B$49:$B105,0)","v":42},{"$f":"MATCH(Calc2!T$112,Trucks!$B$49:$B105,0)","v":42},{"$f":"MATCH(Calc2!U$112,Trucks!$B$49:$B105,0)","v":42},{"$f":"MATCH(Calc2!V$112,Trucks!$B$49:$B105,0)","v":42},{"$f":"MATCH(Calc2!W$112,Trucks!$B$49:$B105,0)","v":42},{"$f":"MATCH(Calc2!X$112,Trucks!$B$49:$B105,0)","v":42},{"$f":"MATCH(Calc2!Y$112,Trucks!$B$49:$B105,0)","v":42},{"$f":"MATCH(Calc2!Z$112,Trucks!$B$49:$B105,0)","v":42},{"$f":"MATCH(Calc2!AA$112,Trucks!$B$49:$B105,0)","v":42},{"$f":"MATCH(Calc2!AB$112,Trucks!$B$49:$B105,0)","v":42}]
[null,null,{"$f":"MATCH(Calc2!C$112,Trucks!$B$49:$B114,0)","v":6},{"$f":"MATCH(Calc2!D$112,Trucks!$B$49:$B114,0)","v":{"$error":"#N/A"}},{"$f":"MATCH(Calc2!E$112,Trucks!$B$49:$B114,0)","v":{"$error":"#N/A"}},{"$f":"MATCH(Calc2!F$112,Trucks!$B$49:$B114,0)","v":{"$error":"#N/A"}},{"$f":"MATCH(Calc2!G$112,Trucks!$B$49:$B114,0)","v":42},{"$f":"MATCH(Calc2!H$112,Trucks!$B$49:$B114,0)","v":42},{"$f":"MATCH(Calc2!I$112,Trucks!$B$49:$B114,0)","v":42},{"$f":"MATCH(Calc2!J$112,Trucks!$B$49:$B114,0)","v":42},{"$f":"MATCH(Calc2!K$112,Trucks!$B$49:$B114,0)","v":42},{"$f":"MATCH(Calc2!L$112,Trucks!$B$49:$B114,0)","v":42},{"$f":"MATCH(Calc2!M$112,Trucks!$B$49:$B114,0)","v":42},{"$f":"MATCH(Calc2!N$112,Trucks!$B$49:$B114,0)","v":42},{"$f":"MATCH(Calc2!O$112,Trucks!$B$49:$B114,0)","v":42},{"$f":"MATCH(Calc2!P$112,Trucks!$B$49:$B114,0)","v":42},{"$f":"MATCH(Calc2!Q$112,Trucks!$B$49:$B114,0)","v":42},{"$f":"MATCH(Calc2!R$112,Trucks!$B$49:$B114,0)","v":42},{"$f":"MATCH(Calc2!S$112,Trucks!$B$49:$B114,0)","v":42},{"$f":"MATCH(Calc2!T$112,Trucks!$B$49:$B114,0)","v":42},{"$f":"MATCH(Calc2!U$112,Trucks!$B$49:$B114,0)","v":42},{"$f":"MATCH(Calc2!V$112,Trucks!$B$49:$B114,0)","v":42},{"$f":"MATCH(Calc2!W$112,Trucks!$B$49:$B114,0)","v":42},{"$f":"MATCH(Calc2!X$112,Trucks!$B$49:$B114,0)","v":42},{"$f":"MATCH(Calc2!Y$112,Trucks!$B$49:$B114,0)","v":42},{"$f":"MATCH(Calc2!Z$112,Trucks!$B$49:$B114,0)","v":42},{"$f":"MATCH(Calc2!AA$112,Trucks!$B$49:$B114,0)","v":42},{"$f":"MATCH(Calc2!AB$112,Trucks!$B$49:$B114,0)","v":42}]
[null,null,{"$f":"MATCH(Calc2!C$112,Trucks!$B$49:$B117,0)","v":6},{"$f":"MATCH(Calc2!D$112,Trucks!$B$49:$B117,0)","v":{"$error":"#N/A"}},{"$f":"MATCH(Calc2!E$112,Trucks!$B$49:$B117,0)","v":{"$error":"#N/A"}},{"$f":"MATCH(Calc2!F$112,Trucks!$B$49:$B117,0)","v":{"$error":"#N/A"}},{"$f":"MATCH(Calc2!G$112,Trucks!$B$49:$B117,0)","v":42},{"$f":"MATCH(Calc2!H$112,Trucks!$B$49:$B117,0)","v":42},{"$f":"MATCH(Calc2!I$112,Trucks!$B$49:$B117,0)","v":42},{"$f":"MATCH(Calc2!J$112,Trucks!$B$49:$B117,0)","v":42},{"$f":"MATCH(Calc2!K$112,Trucks!$B$49:$B117,0)","v":42},{"$f":"MATCH(Calc2!L$112,Trucks!$B$49:$B117,0)","v":42},{"$f":"MATCH(Calc2!M$112,Trucks!$B$49:$B117,0)","v":42},{"$f":"MATCH(Calc2!N$112,Trucks!$B$49:$B117,0)","v":42},{"$f":"MATCH(Calc2!O$112,Trucks!$B$49:$B117,0)","v":42},{"$f":"MATCH(Calc2!P$112,Trucks!$B$49:$B117,0)","v":42},{"$f":"MATCH(Calc2!Q$112,Trucks!$B$49:$B117,0)","v":42},{"$f":"MATCH(Calc2!R$112,Trucks!$B$49:$B117,0)","v":42},{"$f":"MATCH(Calc2!S$112,Trucks!$B$49:$B117,0)","v":42},{"$f":"MATCH(Calc2!T$112,Trucks!$B$49:$B117,0)","v":42},{"$f":"MATCH(Calc2!U$112,Trucks!$B$49:$B117,0)","v":42},{"$f":"MATCH(Calc2!V$112,Trucks!$B$49:$B117,0)","v":42},{"$f":"MATCH(Calc2!W$112,Trucks!$B$49:$B117,0)","v":42},{"$f":"MATCH(Calc2!X$112,Trucks!$B$49:$B117,0)","v":42},{"$f":"MATCH(Calc2!Y$112,Trucks!$B$49:$B117,0)","v":42},{"$f":"MATCH(Calc2!Z$112,Trucks!$B$49:$B117,0)","v":42},{"$f":"MATCH(Calc2!AA$112,Trucks!$B$49:$B117,0)","v":42},{"$f":"MATCH(Calc2!AB$112,Trucks!$B$49:$B117,0)","v":42}]
[null,null,{"$f":"MATCH(Calc2!C$112,Trucks!$B$49:$B117,0)","v":6},{"$f":"MATCH(Calc2!D$112,Trucks!$B$49:$B117,0)","v":{"$error":"#N/A"}},{"$f":"MATCH(Calc2!E$112,Trucks!$B$49:$B117,0)","v":{"$error":"#N/A"}},{"$f":"MATCH(Calc2!F$112,Trucks!$B$49:$B117,0)","v":{"$error":"#N/A"}},{"$f":"MATCH(Calc2!G$112,Trucks!$B$49:$B117,0)","v":42},{"$f":"MATCH(Calc2!H$112,Trucks!$B$49:$B117,0)","v":42},{"$f":"MATCH(Calc2!I$112,Trucks!$B$49:$B117,0)","v":42},{"$f":"MATCH(Calc2!J$112,Trucks!$B$49:$B117,0)","v":42},{"$f":"MATCH(Calc2!K$112,Trucks!$B$49:$B117,0)","v":42},{"$f":"MATCH(Calc2!L$112,Trucks!$B$49:$B117,0)","v":42},{"$f":"MATCH(Calc2!M$112,Trucks!$B$49:$B117,0)","v":42},{"$f":"MATCH(Calc2!N$112,Trucks!$B$49:$B117,0)","v":42},{"$f":"MATCH(Calc2!O$112,Trucks!$B$49:$B117,0)","v":42},{"$f":"MATCH(Calc2!P$112,Trucks!$B$49:$B117,0)","v":42},{"$f":"MATCH(Calc2!Q$112,Trucks!$B$49:$B117,0)","v":42},{"$f":"MATCH(Calc2!R$112,Trucks!$B$49:$B117,0)","v":42},{"$f":"MATCH(Calc2!S$112,Trucks!$B$49:$B117,0)","v":42},{"$f":"MATCH(Calc2!T$112,Trucks!$B$49:$B117,0)","v":42},{"$f":"MATCH(Calc2!U$112,Trucks!$B$49:$B117,0)","v":42},{"$f":"MATCH(Calc2!V$112,Trucks!$B$49:$B117,0)","v":42},{"$f":"MATCH(Calc2!W$112,Trucks!$B$49:$B117,0)","v":42},{"$f":"MATCH(Calc2!X$112,Trucks!$B$49:$B117,0)","v":42},{"$f":"MATCH(Calc2!Y$112,Trucks!$B$49:$B117,0)","v":42},{"$f":"MATCH(Calc2!Z$112,Trucks!$B$49:$B117,0)","v":42},{"$f":"MATCH(Calc2!AA$112,Trucks!$B$49:$B117,0)","v":42},{"$f":"MATCH(Calc2!AB$112,Trucks!$B$49:$B117,0)","v":42}]
[null,null,{"$f":"MATCH(Calc2!C$112,Trucks!$B$49:$B122,0)","v":6},{"$f":"MATCH(Calc2!D$112,Trucks!$B$49:$B122,0)","v":{"$error":"#N/A"}},{"$f":"MATCH(Calc2!E$112,Trucks!$B$49:$B122,0)","v":{"$error":"#N/A"}},{"$f":"MATCH(Calc2!F$112,Trucks!$B$49:$B122,0)","v":{"$error":"#N/A"}},{"$f":"MATCH(Calc2!G$112,Trucks!$B$49:$B122,0)","v":42},{"$f":"MATCH(Calc2!H$112,Trucks!$B$49:$B122,0)","v":42},{"$f":"MATCH(Calc2!I$112,Trucks!$B$49:$B122,0)","v":42},{"$f":"MATCH(Calc2!J$112,Trucks!$B$49:$B122,0)","v":42},{"$f":"MATCH(Calc2!K$112,Trucks!$B$49:$B122,0)","v":42},{"$f":"MATCH(Calc2!L$112,Trucks!$B$49:$B122,0)","v":42},{"$f":"MATCH(Calc2!M$112,Trucks!$B$49:$B122,0)","v":42},{"$f":"MATCH(Calc2!N$112,Trucks!$B$49:$B122,0)","v":42},{"$f":"MATCH(Calc2!O$112,Trucks!$B$49:$B122,0)","v":42},{"$f":"MATCH(Calc2!P$112,Trucks!$B$49:$B122,0)","v":42},{"$f":"MATCH(Calc2!Q$112,Trucks!$B$49:$B122,0)","v":42},{"$f":"MATCH(Calc2!R$112,Trucks!$B$49:$B122,0)","v":42},{"$f":"MATCH(Calc2!S$112,Trucks!$B$49:$B122,0)","v":42},{"$f":"MATCH(Calc2!T$112,Trucks!$B$49:$B122,0)","v":42},{"$f":"MATCH(Calc2!U$112,Trucks!$B$49:$B122,0)","v":42},{"$f":"MATCH(Calc2!V$112,Trucks!$B$49:$B122,0)","v":42},{"$f":"MATCH(Calc2!W$112,Trucks!$B$49:$B122,0)","v":42},{"$f":"MATCH(Calc2!X$112,Trucks!$B$49:$B122,0)","v":42},{"$f":"MATCH(Calc2!Y$112,Trucks!$B$49:$B122,0)","v":42},{"$f":"MATCH(Calc2!Z$112,Trucks!$B$49:$B122,0)","v":42},{"$f":"MATCH(Calc2!AA$112,Trucks!$B$49:$B122,0)","v":42},{"$f":"MATCH(Calc2!AB$112,Trucks!$B$49:$B122,0)","v":42}]
[null,null,{"$f":"MATCH(Calc2!C$112,Trucks!$B$49:$B123,0)","v":6},{"$f":"MATCH(Calc2!D$112,Trucks!$B$49:$B123,0)","v":{"$error":"#N/A"}},{"$f":"MATCH(Calc2!E$112,Trucks!$B$49:$B123,0)","v":{"$error":"#N/A"}},{"$f":"MATCH(Calc2!F$112,Trucks!$B$49:$B123,0)","v":{"$error":"#N/A"}},{"$f":"MATCH(Calc2!G$112,Trucks!$B$49:$B123,0)","v":42},{"$f":"MATCH(Calc2!H$112,Trucks!$B$49:$B123,0)","v":42},{"$f":"MATCH(Calc2!I$112,Trucks!$B$49:$B123,0)","v":42},{"$f":"MATCH(Calc2!J$112,Trucks!$B$49:$B123,0)","v":42},{"$f":"MATCH(Calc2!K$112,Trucks!$B$49:$B123,0)","v":42},{"$f":"MATCH(Calc2!L$112,Trucks!$B$49:$B123,0)","v":42},{"$f":"MATCH(Calc2!M$112,Trucks!$B$49:$B123,0)","v":42},{"$f":"MATCH(Calc2!N$112,Trucks!$B$49:$B123,0)","v":42},{"$f":"MATCH(Calc2!O$112,Trucks!$B$49:$B123,0)","v":42},{"$f":"MATCH(Calc2!P$112,Trucks!$B$49:$B123,0)","v":42},{"$f":"MATCH(Calc2!Q$112,Trucks!$B$49:$B123,0)","v":42},{"$f":"MATCH(Calc2!R$112,Trucks!$B$49:$B123,0)","v":42},{"$f":"MATCH(Calc2!S$112,Trucks!$B$49:$B123,0)","v":42},{"$f":"MATCH(Calc2!T$112,Trucks!$B$49:$B123,0)","v":42},{"$f":"MATCH(Calc2!U$112,Trucks!$B$49:$B123,0)","v":42},{"$f":"MATCH(Calc2!V$112,Trucks!$B$49:$B123,0)","v":42},{"$f":"MATCH(Calc2!W$112,Trucks!$B$49:$B123,0)","v":42},{"$f":"MATCH(Calc2!X$112,Trucks!$B$49:$B123,0)","v":42},{"$f":"MATCH(Calc2!Y$112,Trucks!$B$49:$B123,0)","v":42},{"$f":"MATCH(Calc2!Z$112,Trucks!$B$49:$B123,0)","v":42},{"$f":"MATCH(Calc2!AA$112,Trucks!$B$49:$B123,0)","v":42},{"$f":"MATCH(Calc2!AB$112,Trucks!$B$49:$B123,0)","v":42}]
[null,null,{"$f":"MATCH(Calc2!C$112,Trucks!$B$49:$B124,0)","v":6},{"$f":"MATCH(Calc2!D$112,Trucks!$B$49:$B124,0)","v":{"$error":"#N/A"}},{"$f":"MATCH(Calc2!E$112,Trucks!$B$49:$B124,0)","v":{"$error":"#N/A"}},{"$f":"MATCH(Calc2!F$112,Trucks!$B$49:$B124,0)","v":{"$error":"#N/A"}},{"$f":"MATCH(Calc2!G$112,Trucks!$B$49:$B124,0)","v":42},{"$f":"MATCH(Calc2!H$112,Trucks!$B$49:$B124,0)","v":42},{"$f":"MATCH(Calc2!I$112,Trucks!$B$49:$B124,0)","v":42},{"$f":"MATCH(Calc2!J$112,Trucks!$B$49:$B124,0)","v":42},{"$f":"MATCH(Calc2!K$112,Trucks!$B$49:$B124,0)","v":42},{"$f":"MATCH(Calc2!L$112,Trucks!$B$49:$B124,0)","v":42},{"$f":"MATCH(Calc2!M$112,Trucks!$B$49:$B124,0)","v":42},{"$f":"MATCH(Calc2!N$112,Trucks!$B$49:$B124,0)","v":42},{"$f":"MATCH(Calc2!O$112,Trucks!$B$49:$B124,0)","v":42},{"$f":"MATCH(Calc2!P$112,Trucks!$B$49:$B124,0)","v":42},{"$f":"MATCH(Calc2!Q$112,Trucks!$B$49:$B124,0)","v":42},{"$f":"MATCH(Calc2!R$112,Trucks!$B$49:$B124,0)","v":42},{"$f":"MATCH(Calc2!S$112,Trucks!$B$49:$B124,0)","v":42},{"$f":"MATCH(Calc2!T$112,Trucks!$B$49:$B124,0)","v":42},{"$f":"MATCH(Calc2!U$112,Trucks!$B$49:$B124,0)","v":42},{"$f":"MATCH(Calc2!V$112,Trucks!$B$49:$B124,0)","v":42},{"$f":"MATCH(Calc2!W$112,Trucks!$B$49:$B124,0)","v":42},{"$f":"MATCH(Calc2!X$112,Trucks!$B$49:$B124,0)","v":42},{"$f":"MATCH(Calc2!Y$112,Trucks!$B$49:$B124,0)","v":42},{"$f":"MATCH(Calc2!Z$112,Trucks!$B$49:$B124,0)","v":42},{"$f":"MATCH(Calc2!AA$112,Trucks!$B$49:$B124,0)","v":42},{"$f":"MATCH(Calc2!AB$112,Trucks!$B$49:$B124,0)","v":42}]
[null,null,{"$f":"MATCH(Calc2!C$112,Trucks!$B$49:$B126,0)","v":6},{"$f":"MATCH(Calc2!D$112,Trucks!$B$49:$B126,0)","v":{"$error":"#N/A"}},{"$f":"MATCH(Calc2!E$112,Trucks!$B$49:$B126,0)","v":{"$error":"#N/A"}},{"$f":"MATCH(Calc2!F$112,Trucks!$B$49:$B126,0)","v":{"$error":"#N/A"}},{"$f":"MATCH(Calc2!G$112,Trucks!$B$49:$B126,0)","v":42},{"$f":"MATCH(Calc2!H$112,Trucks!$B$49:$B126,0)","v":42},{"$f":"MATCH(Calc2!I$112,Trucks!$B$49:$B126,0)","v":42},{"$f":"MATCH(Calc2!J$112,Trucks!$B$49:$B126,0)","v":42},{"$f":"MATCH(Calc2!K$112,Trucks!$B$49:$B126,0)","v":42},{"$f":"MATCH(Calc2!L$112,Trucks!$B$49:$B126,0)","v":42},{"$f":"MATCH(Calc2!M$112,Trucks!$B$49:$B126,0)","v":42},{"$f":"MATCH(Calc2!N$112,Trucks!$B$49:$B126,0)","v":42},{"$f":"MATCH(Calc2!O$112,Trucks!$B$49:$B126,0)","v":42},{"$f":"MATCH(Calc2!P$112,Trucks!$B$49:$B126,0)","v":42},{"$f":"MATCH(Calc2!Q$112,Trucks!$B$49:$B126,0)","v":42},{"$f":"MATCH(Calc2!R$112,Trucks!$B$49:$B126,0)","v":42},{"$f":"MATCH(Calc2!S$112,Trucks!$B$49:$B126,0)","v":42},{"$f":"MATCH(Calc2!T$112,Trucks!$B$49:$B126,0)","v":42},{"$f":"MATCH(Calc2!U$112,Trucks!$B$49:$B126,0)","v":42},{"$f":"MATCH(Calc2!V$112,Trucks!$B$49:$B126,0)","v":42},{"$f":"MATCH(Calc2!W$112,Trucks!$B$49:$B126,0)","v":42},{"$f":"MATCH(Calc2!X$112,Trucks!$B$49:$B126,0)","v":42},{"$f":"MATCH(Calc2!Y$112,Trucks!$B$49:$B126,0)","v":42},{"$f":"MATCH(Calc2!Z$112,Trucks!$B$49:$B126,0)","v":42},{"$f":"MATCH(Calc2!AA$112,Trucks!$B$49:$B126,0)","v":42},{"$f":"MATCH(Calc2!AB$112,Trucks!$B$49:$B126,0)","v":42}]
[null,null,{"$f":"MATCH(Calc2!C$112,Trucks!$B$49:$B127,0)","v":6},{"$f":"MATCH(Calc2!D$112,Trucks!$B$49:$B127,0)","v":{"$error":"#N/A"}},{"$f":"MATCH(Calc2!E$112,Trucks!$B$49:$B127,0)","v":{"$error":"#N/A"}},{"$f":"MATCH(Calc2!F$112,Trucks!$B$49:$B127,0)","v":{"$error":"#N/A"}},{"$f":"MATCH(Calc2!G$112,Trucks!$B$49:$B127,0)","v":42},{"$f":"MATCH(Calc2!H$112,Trucks!$B$49:$B127,0)","v":42},{"$f":"MATCH(Calc2!I$112,Trucks!$B$49:$B127,0)","v":42},{"$f":"MATCH(Calc2!J$112,Trucks!$B$49:$B127,0)","v":42},{"$f":"MATCH(Calc2!K$112,Trucks!$B$49:$B127,0)","v":42},{"$f":"MATCH(Calc2!L$112,Trucks!$B$49:$B127,0)","v":42},{"$f":"MATCH(Calc2!M$112,Trucks!$B$49:$B127,0)","v":42},{"$f":"MATCH(Calc2!N$112,Trucks!$B$49:$B127,0)","v":42},{"$f":"MATCH(Calc2!O$112,Trucks!$B$49:$B127,0)","v":42},{"$f":"MATCH(Calc2!P$112,Trucks!$B$49:$B127,0)","v":42},{"$f":"MATCH(Calc2!Q$112,Trucks!$B$49:$B127,0)","v":42},{"$f":"MATCH(Calc2!R$112,Trucks!$B$49:$B127,0)","v":42},{"$f":"MATCH(Calc2!S$112,Trucks!$B$49:$B127,0)","v":42},{"$f":"MATCH(Calc2!T$112,Trucks!$B$49:$B127,0)","v":42},{"$f":"MATCH(Calc2!U$112,Trucks!$B$49:$B127,0)","v":42},{"$f":"MATCH(Calc2!V$112,Trucks!$B$49:$B127,0)","v":42},{"$f":"MATCH(Calc2!W$112,Trucks!$B$49:$B127,0)","v":42},{"$f":"MATCH(Calc2!X$112,Trucks!$B$49:$B127,0)","v":42},{"$f":"MATCH(Calc2!Y$112,Trucks!$B$49:$B127,0)","v":42},{"$f":"MATCH(Calc2!Z$112,Trucks!$B$49:$B127,0)","v":42},{"$f":"MATCH(Calc2!AA$112,Trucks!$B$49:$B127,0)","v":42},{"$f":"MATCH(Calc2!AB$112,Trucks!$B$49:$B127,0)","v":42}]
[null,null,{"$f":"MATCH(Calc2!C$112,Trucks!$B$49:$B128,0)","v":6},{"$f":"MATCH(Calc2!D$112,Trucks!$B$49:$B128,0)","v":{"$error":"#N/A"}},{"$f":"MATCH(Calc2!E$112,Trucks!$B$49:$B128,0)","v":{"$error":"#N/A"}},{"$f":"MATCH(Calc2!F$112,Trucks!$B$49:$B128,0)","v":{"$error":"#N/A"}},{"$f":"MATCH(Calc2!G$112,Trucks!$B$49:$B128,0)","v":42},{"$f":"MATCH(Calc2!H$112,Trucks!$B$49:$B128,0)","v":42},{"$f":"MATCH(Calc2!I$112,Trucks!$B$49:$B128,0)","v":42},{"$f":"MATCH(Calc2!J$112,Trucks!$B$49:$B128,0)","v":42},{"$f":"MATCH(Calc2!K$112,Trucks!$B$49:$B128,0)","v":42},{"$f":"MATCH(Calc2!L$112,Trucks!$B$49:$B128,0)","v":42},{"$f":"MATCH(Calc2!M$112,Trucks!$B$49:$B128,0)","v":42},{"$f":"MATCH(Calc2!N$112,Trucks!$B$49:$B128,0)","v":42},{"$f":"MATCH(Calc2!O$112,Trucks!$B$49:$B128,0)","v":42},{"$f":"MATCH(Calc2!P$112,Trucks!$B$49:$B128,0)","v":42},{"$f":"MATCH(Calc2!Q$112,Trucks!$B$49:$B128,0)","v":42},{"$f":"MATCH(Calc2!R$112,Trucks!$B$49:$B128,0)","v":42},{"$f":"MATCH(Calc2!S$112,Trucks!$B$49:$B128,0)","v":42},{"$f":"MATCH(Calc2!T$112,Trucks!$B$49:$B128,0)","v":42},{"$f":"MATCH(Calc2!U$112,Trucks!$B$49:$B128,0)","v":42},{"$f":"MATCH(Calc2!V$112,Trucks!$B$49:$B128,0)","v":42},{"$f":"MATCH(Calc2!W$112,Trucks!$B$49:$B128,0)","v":42},{"$f":"MATCH(Calc2!X$112,Trucks!$B$49:$B128,0)","v":42},{"$f":"MATCH(Calc2!Y$112,Trucks!$B$49:$B128,0)","v":42},{"$f":"MATCH(Calc2!Z$112,Trucks!$B$49:$B128,0)","v":42},{"$f":"MATCH(Calc2!AA$112,Trucks!$B$49:$B128,0)","v":42},{"$f":"MATCH(Calc2!AB$112,Trucks!$B$49:$B128,0)","v":42}]
[null,null,{"$f":"MATCH(Calc2!C$112,Trucks!$B$49:$B130,0)","v":6},{"$f":"MATCH(Calc2!D$112,Trucks!$B$49:$B130,0)","v":{"$error":"#N/A"}},{"$f":"MATCH(Calc2!E$112,Trucks!$B$49:$B130,0)","v":{"$error":"#N/A"}},{"$f":"MATCH(Calc2!F$112,Trucks!$B$49:$B130,0)","v":{"$error":"#N/A"}},{"$f":"MATCH(Calc2!G$112,Trucks!$B$49:$B130,0)","v":42},{"$f":"MATCH(Calc2!H$112,Trucks!$B$49:$B130,0)","v":42},{"$f":"MATCH(Calc2!I$112,Trucks!$B$49:$B130,0)","v":42},{"$f":"MATCH(Calc2!J$112,Trucks!$B$49:$B130,0)","v":42},{"$f":"MATCH(Calc2!K$112,Trucks!$B$49:$B130,0)","v":42},{"$f":"MATCH(Calc2!L$112,Trucks!$B$49:$B130,0)","v":42},{"$f":"MATCH(Calc2!M$112,Trucks!$B$49:$B130,0)","v":42},{"$f":"MATCH(Calc2!N$112,Trucks!$B$49:$B130,0)","v":42},{"$f":"MATCH(Calc2!O$112,Trucks!$B$49:$B130,0)","v":42},{"$f":"MATCH(Calc2!P$112,Trucks!$B$49:$B130,0)","v":42},{"$f":"MATCH(Calc2!Q$112,Trucks!$B$49:$B130,0)","v":42},{"$f":"MATCH(Calc2!R$112,Trucks!$B$49:$B130,0)","v":42},{"$f":"MATCH(Calc2!S$112,Trucks!$B$49:$B130,0)","v":42},{"$f":"MATCH(Calc2!T$112,Trucks!$B$49:$B130,0)","v":42},{"$f":"MATCH(Calc2!U$112,Trucks!$B$49:$B130,0)","v":42},{"$f":"MATCH(Calc2!V$112,Trucks!$B$49:$B130,0)","v":42},{"$f":"MATCH(Calc2!W$112,Trucks!$B$49:$B130,0)","v":42},{"$f":"MATCH(Calc2!X$112,Trucks!$B$49:$B130,0)","v":42},{"$f":"MATCH(Calc2!Y$112,Trucks!$B$49:$B130,0)","v":42},{"$f":"MATCH(Calc2!Z$112,Trucks!$B$49:$B130,0)","v":42},{"$f":"MATCH(Calc2!AA$112,Trucks!$B$49:$B130,0)","v":42},{"$f":"MATCH(Calc2!AB$112,Trucks!$B$49:$B130,0)","v":42}]
[null,null,{"$f":"MATCH(Calc2!C$112,Trucks!$B$49:$B131,0)","v":6},{"$f":"MATCH(Calc2!D$112,Trucks!$B$49:$B131,0)","v":{"$error":"#N/A"}},{"$f":"MATCH(Calc2!E$112,Trucks!$B$49:$B131,0)","v":{"$error":"#N/A"}},{"$f":"MATCH(Calc2!F$112,Trucks!$B$49:$B131,0)","v":{"$error":"#N/A"}},{"$f":"MATCH(Calc2!G$112,Trucks!$B$49:$B131,0)","v":42},{"$f":"MATCH(Calc2!H$112,Trucks!$B$49:$B131,0)","v":42},{"$f":"MATCH(Calc2!I$112,Trucks!$B$49:$B131,0)","v":42},{"$f":"MATCH(Calc2!J$112,Trucks!$B$49:$B131,0)","v":42},{"$f":"MATCH(Calc2!K$112,Trucks!$B$49:$B131,0)","v":42},{"$f":"MATCH(Calc2!L$112,Trucks!$B$49:$B131,0)","v":42},{"$f":"MATCH(Calc2!M$112,Trucks!$B$49:$B131,0)","v":42},{"$f":"MATCH(Calc2!N$112,Trucks!$B$49:$B131,0)","v":42},{"$f":"MATCH(Calc2!O$112,Trucks!$B$49:$B131,0)","v":42},{"$f":"MATCH(Calc2!P$112,Trucks!$B$49:$B131,0)","v":42},{"$f":"MATCH(Calc2!Q$112,Trucks!$B$49:$B131,0)","v":42},{"$f":"MATCH(Calc2!R$112,Trucks!$B$49:$B131,0)","v":42},{"$f":"MATCH(Calc2!S$112,Trucks!$B$49:$B131,0)","v":42},{"$f":"MATCH(Calc2!T$112,Trucks!$B$49:$B131,0)","v":42},{"$f":"MATCH(Calc2!U$112,Trucks!$B$49:$B131,0)","v":42},{"$f":"MATCH(Calc2!V$112,Trucks!$B$49:$B131,0)","v":42},{"$f":"MATCH(Calc2!W$112,Trucks!$B$49:$B131,0)","v":42},{"$f":"MATCH(Calc2!X$112,Trucks!$B$49:$B131,0)","v":42},{"$f":"MATCH(Calc2!Y$112,Trucks!$B$49:$B131,0)","v":42},{"$f":"MATCH(Calc2!Z$112,Trucks!$B$49:$B131,0)","v":42},{"$f":"MATCH(Calc2!AA$112,Trucks!$B$49:$B131,0)","v":42},{"$f":"MATCH(Calc2!AB$112,Trucks!$B$49:$B131,0)","v":42}]
[null,null,{"$f":"MATCH(Calc2!C$112,Trucks!$B$49:$B132,0)","v":6},{"$f":"MATCH(Calc2!D$112,Trucks!$B$49:$B132,0)","v":{"$error":"#N/A"}},{"$f":"MATCH(Calc2!E$112,Trucks!$B$49:$B132,0)","v":{"$error":"#N/A"}},{"$f":"MATCH(Calc2!F$112,Trucks!$B$49:$B132,0)","v":{"$error":"#N/A"}},{"$f":"MATCH(Calc2!G$112,Trucks!$B$49:$B132,0)","v":42},{"$f":"MATCH(Calc2!H$112,Trucks!$B$49:$B132,0)","v":42},{"$f":"MATCH(Calc2!I$112,Trucks!$B$49:$B132,0)","v":42},{"$f":"MATCH(Calc2!J$112,Trucks!$B$49:$B132,0)","v":42},{"$f":"MATCH(Calc2!K$112,Trucks!$B$49:$B132,0)","v":42},{"$f":"MATCH(Calc2!L$112,Trucks!$B$49:$B132,0)","v":42},{"$f":"MATCH(Calc2!M$112,Trucks!$B$49:$B132,0)","v":42},{"$f":"MATCH(Calc2!N$112,Trucks!$B$49:$B132,0)","v":42},{"$f":"MATCH(Calc2!O$112,Trucks!$B$49:$B132,0)","v":42},{"$f":"MATCH(Calc2!P$112,Trucks!$B$49:$B132,0)","v":42},{"$f":"MATCH(Calc2!Q$112,Trucks!$B$49:$B132,0)","v":42},{"$f":"MATCH(Calc2!R$112,Trucks!$B$49:$B132,0)","v":42},{"$f":"MATCH(Calc2!S$112,Trucks!$B$49:$B132,0)","v":42},{"$f":"MATCH(Calc2!T$112,Trucks!$B$49:$B132,0)","v":42},{"$f":"MATCH(Calc2!U$112,Trucks!$B$49:$B132,0)","v":42},{"$f":"MATCH(Calc2!V$112,Trucks!$B$49:$B132,0)","v":42},{"$f":"MATCH(Calc2!W$112,Trucks!$B$49:$B132,0)","v":42},{"$f":"MATCH(Calc2!X$112,Trucks!$B$49:$B132,0)","v":42},{"$f":"MATCH(Calc2!Y$112,Trucks!$B$49:$B132,0)","v":42},{"$f":"MATCH(Calc2!Z$112,Trucks!$B$49:$B132,0)","v":42},{"$f":"MATCH(Calc2!AA$112,Trucks!$B$49:$B132,0)","v":42},{"$f":"MATCH(Calc2!AB$112,Trucks!$B$49:$B132,0)","v":42}]
[null,null,{"$f":"MATCH(Calc2!C$112,Trucks!$B$49:$B133,0)","v":6},{"$f":"MATCH(Calc2!D$112,Trucks!$B$49:$B133,0)","v":{"$error":"#N/A"}},{"$f":"MATCH(Calc2!E$112,Trucks!$B$49:$B133,0)","v":{"$error":"#N/A"}},{"$f":"MATCH(Calc2!F$112,Trucks!$B$49:$B133,0)","v":{"$error":"#N/A"}},{"$f":"MATCH(Calc2!G$112,Trucks!$B$49:$B133,0)","v":42},{"$f":"MATCH(Calc2!H$112,Trucks!$B$49:$B133,0)","v":42},{"$f":"MATCH(Calc2!I$112,Trucks!$B$49:$B133,0)","v":42},{"$f":"MATCH(Calc2!J$112,Trucks!$B$49:$B133,0)","v":42},{"$f":"MATCH(Calc2!K$112,Trucks!$B$49:$B133,0)","v":42},{"$f":"MATCH(Calc2!L$112,Trucks!$B$49:$B133,0)","v":42},{"$f":"MATCH(Calc2!M$112,Trucks!$B$49:$B133,0)","v":42},{"$f":"MATCH(Calc2!N$112,Trucks!$B$49:$B133,0)","v":42},{"$f":"MATCH(Calc2!O$112,Trucks!$B$49:$B133,0)","v":42},{"$f":"MATCH(Calc2!P$112,Trucks!$B$49:$B133,0)","v":42},{"$f":"MATCH(Calc2!Q$112,Trucks!$B$49:$B133,0)","v":42},{"$f":"MATCH(Calc2!R$112,Trucks!$B$49:$B133,0)","v":42},{"$f":"MATCH(Calc2!S$112,Trucks!$B$49:$B133,0)","v":42},{"$f":"MATCH(Calc2!T$112,Trucks!$B$49:$B133,0)","v":42},{"$f":"MATCH(Calc2!U$112,Trucks!$B$49:$B133,0)","v":42},{"$f":"MATCH(Calc2!V$112,Trucks!$B$49:$B133,0)","v":42},{"$f":"MATCH(Calc2!W$112,Trucks!$B$49:$B133,0)","v":42},{"$f":"MATCH(Calc2!X$112,Trucks!$B$49:$B133,0)","v":42},{"$f":"MATCH(Calc2!Y$112,Trucks!$B$49:$B133,0)","v":42},{"$f":"MATCH(Calc2!Z$112,Trucks!$B$49:$B133,0)","v":42},{"$f":"MATCH(Calc2!AA$112,Trucks!$B$49:$B133,0)","v":42},{"$f":"MATCH(Calc2!AB$112,Trucks!$B$49:$B133,0)","v":42}]
[null,null,{"$f":"MATCH(Calc2!C$112,Trucks!$B$49:$B134,0)","v":6},{"$f":"MATCH(Calc2!D$112,Trucks!$B$49:$B134,0)","v":{"$error":"#N/A"}},{"$f":"MATCH(Calc2!E$112,Trucks!$B$49:$B134,0)","v":{"$error":"#N/A"}},{"$f":"MATCH(Calc2!F$112,Trucks!$B$49:$B134,0)","v":{"$error":"#N/A"}},{"$f":"MATCH(Calc2!G$112,Trucks!$B$49:$B134,0)","v":42},{"$f":"MATCH(Calc2!H$112,Trucks!$B$49:$B134,0)","v":42},{"$f":"MATCH(Calc2!I$112,Trucks!$B$49:$B134,0)","v":42},{"$f":"MATCH(Calc2!J$112,Trucks!$B$49:$B134,0)","v":42},{"$f":"MATCH(Calc2!K$112,Trucks!$B$49:$B134,0)","v":42},{"$f":"MATCH(Calc2!L$112,Trucks!$B$49:$B134,0)","v":42},{"$f":"MATCH(Calc2!M$112,Trucks!$B$49:$B134,0)","v":42},{"$f":"MATCH(Calc2!N$112,Trucks!$B$49:$B134,0)","v":42},{"$f":"MATCH(Calc2!O$112,Trucks!$B$49:$B134,0)","v":42},{"$f":"MATCH(Calc2!P$112,Trucks!$B$49:$B134,0)","v":42},{"$f":"MATCH(Calc2!Q$112,Trucks!$B$49:$B134,0)","v":42},{"$f":"MATCH(Calc2!R$112,Trucks!$B$49:$B134,0)","v":42},{"$f":"MATCH(Calc2!S$112,Trucks!$B$49:$B134,0)","v":42},{"$f":"MATCH(Calc2!T$112,Trucks!$B$49:$B134,0)","v":42},{"$f":"MATCH(Calc2!U$112,Trucks!$B$49:$B134,0)","v":42},{"$f":"MATCH(Calc2!V$112,Trucks!$B$49:$B134,0)","v":42},{"$f":"MATCH(Calc2!W$112,Trucks!$B$49:$B134,0)","v":42},{"$f":"MATCH(Calc2!X$112,Trucks!$B$49:$B134,0)","v":42},{"$f":"MATCH(Calc2!Y$112,Trucks!$B$49:$B134,0)","v":42},{"$f":"MATCH(Calc2!Z$112,Trucks!$B$49:$B134,0)","v":42},{"$f":"MATCH(Calc2!AA$112,Trucks!$B$49:$B134,0)","v":42},{"$f":"MATCH(Calc2!AB$112,Trucks!$B$49:$B134,0)","v":42}]
[null,null,{"$f":"MATCH(Calc2!C$112,Trucks!$B$49:$B135,0)","v":6},{"$f":"MATCH(Calc2!D$112,Trucks!$B$49:$B135,0)","v":{"$error":"#N/A"}},{"$f":"MATCH(Calc2!E$112,Trucks!$B$49:$B135,0)","v":{"$error":"#N/A"}},{"$f":"MATCH(Calc2!F$112,Trucks!$B$49:$B135,0)","v":{"$error":"#N/A"}},{"$f":"MATCH(Calc2!G$112,Trucks!$B$49:$B135,0)","v":42},{"$f":"MATCH(Calc2!H$112,Trucks!$B$49:$B135,0)","v":42},{"$f":"MATCH(Calc2!I$112,Trucks!$B$49:$B135,0)","v":42},{"$f":"MATCH(Calc2!J$112,Trucks!$B$49:$B135,0)","v":42},{"$f":"MATCH(Calc2!K$112,Trucks!$B$49:$B135,0)","v":42},{"$f":"MATCH(Calc2!L$112,Trucks!$B$49:$B135,0)","v":42},{"$f":"MATCH(Calc2!M$112,Trucks!$B$49:$B135,0)","v":42},{"$f":"MATCH(Calc2!N$112,Trucks!$B$49:$B135,0)","v":42},{"$f":"MATCH(Calc2!O$112,Trucks!$B$49:$B135,0)","v":42},{"$f":"MATCH(Calc2!P$112,Trucks!$B$49:$B135,0)","v":42},{"$f":"MATCH(Calc2!Q$112,Trucks!$B$49:$B135,0)","v":42},{"$f":"MATCH(Calc2!R$112,Trucks!$B$49:$B135,0)","v":42},{"$f":"MATCH(Calc2!S$112,Trucks!$B$49:$B135,0)","v":42},{"$f":"MATCH(Calc2!T$112,Trucks!$B$49:$B135,0)","v":42},{"$f":"MATCH(Calc2!U$112,Trucks!$B$49:$B135,0)","v":42},{"$f":"MATCH(Calc2!V$112,Trucks!$B$49:$B135,0)","v":42},{"$f":"MATCH(Calc2!W$112,Trucks!$B$49:$B135,0)","v":42},{"$f":"MATCH(Calc2!X$112,Trucks!$B$49:$B135,0)","v":42},{"$f":"MATCH(Calc2!Y$112,Trucks!$B$49:$B135,0)","v":42},{"$f":"MATCH(Calc2!Z$112,Trucks!$B$49:$B135,0)","v":42},{"$f":"MATCH(Calc2!AA$112,Trucks!$B$49:$B135,0)","v":42},{"$f":"MATCH(Calc2!AB$112,Trucks!$B$49:$B135,0)","v":42}]
[null,null,{"$f":"MATCH(Calc2!C$112,Trucks!$B$49:$B136,0)","v":6},{"$f":"MATCH(Calc2!D$112,Trucks!$B$49:$B136,0)","v":{"$error":"#N/A"}},{"$f":"MATCH(Calc2!E$112,Trucks!$B$49:$B136,0)","v":{"$error":"#N/A"}},{"$f":"MATCH(Calc2!F$112,Trucks!$B$49:$B136,0)","v":{"$error":"#N/A"}},{"$f":"MATCH(Calc2!G$112,Trucks!$B$49:$B136,0)","v":42},{"$f":"MATCH(Calc2!H$112,Trucks!$B$49:$B136,0)","v":42},{"$f":"MATCH(Calc2!I$112,Trucks!$B$49:$B136,0)","v":42},{"$f":"MATCH(Calc2!J$112,Trucks!$B$49:$B136,0)","v":42},{"$f":"MATCH(Calc2!K$112,Trucks!$B$49:$B136,0)","v":42},{"$f":"MATCH(Calc2!L$112,Trucks!$B$49:$B136,0)","v":42},{"$f":"MATCH(Calc2!M$112,Trucks!$B$49:$B136,0)","v":42},{"$f":"MATCH(Calc2!N$112,Trucks!$B$49:$B136,0)","v":42},{"$f":"MATCH(Calc2!O$112,Trucks!$B$49:$B136,0)","v":42},{"$f":"MATCH(Calc2!P$112,Trucks!$B$49:$B136,0)","v":42},{"$f":"MATCH(Calc2!Q$112,Trucks!$B$49:$B136,0)","v":42},{"$f":"MATCH(Calc2!R$112,Trucks!$B$49:$B136,0)","v":42},{"$f":"MATCH(Calc2!S$112,Trucks!$B$49:$B136,0)","v":42},{"$f":"MATCH(Calc2!T$112,Trucks!$B$49:$B136,0)","v":42},{"$f":"MATCH(Calc2!U$112,Trucks!$B$49:$B136,0)","v":42},{"$f":"MATCH(Calc2!V$112,Trucks!$B$49:$B136,0)","v":42},{"$f":"MATCH(Calc2!W$112,Trucks!$B$49:$B136,0)","v":42},{"$f":"MATCH(Calc2!X$112,Trucks!$B$49:$B136,0)","v":42},{"$f":"MATCH(Calc2!Y$112,Trucks!$B$49:$B136,0)","v":42},{"$f":"MATCH(Calc2!Z$112,Trucks!$B$49:$B136,0)","v":42},{"$f":"MATCH(Calc2!AA$112,Trucks!$B$49:$B136,0)","v":42},{"$f":"MATCH(Calc2!AB$112,Trucks!$B$49:$B136,0)","v":42}]
[null,null,{"$f":"MATCH(Calc2!C$112,Trucks!$B$49:$B137,0)","v":6},{"$f":"MATCH(Calc2!D$112,Trucks!$B$49:$B137,0)","v":{"$error":"#N/A"}},{"$f":"MATCH(Calc2!E$112,Trucks!$B$49:$B137,0)","v":{"$error":"#N/A"}},{"$f":"MATCH(Calc2!F$112,Trucks!$B$49:$B137,0)","v":{"$error":"#N/A"}},{"$f":"MATCH(Calc2!G$112,Trucks!$B$49:$B137,0)","v":42},{"$f":"MATCH(Calc2!H$112,Trucks!$B$49:$B137,0)","v":42},{"$f":"MATCH(Calc2!I$112,Trucks!$B$49:$B137,0)","v":42},{"$f":"MATCH(Calc2!J$112,Trucks!$B$49:$B137,0)","v":42},{"$f":"MATCH(Calc2!K$112,Trucks!$B$49:$B137,0)","v":42},{"$f":"MATCH(Calc2!L$112,Trucks!$B$49:$B137,0)","v":42},{"$f":"MATCH(Calc2!M$112,Trucks!$B$49:$B137,0)","v":42},{"$f":"MATCH(Calc2!N$112,Trucks!$B$49:$B137,0)","v":42},{"$f":"MATCH(Calc2!O$112,Trucks!$B$49:$B137,0)","v":42},{"$f":"MATCH(Calc2!P$112,Trucks!$B$49:$B137,0)","v":42},{"$f":"MATCH(Calc2!Q$112,Trucks!$B$49:$B137,0)","v":42},{"$f":"MATCH(Calc2!R$112,Trucks!$B$49:$B137,0)","v":42},{"$f":"MATCH(Calc2!S$112,Trucks!$B$49:$B137,0)","v":42},{"$f":"MATCH(Calc2!T$112,Trucks!$B$49:$B137,0)","v":42},{"$f":"MATCH(Calc2!U$112,Trucks!$B$49:$B137,0)","v":42},{"$f":"MATCH(Calc2!V$112,Trucks!$B$49:$B137,0)","v":42},{"$f":"MATCH(Calc2!W$112,Trucks!$B$49:$B137,0)","v":42},{"$f":"MATCH(Calc2!X$112,Trucks!$B$49:$B137,0)","v":42},{"$f":"MATCH(Calc2!Y$112,Trucks!$B$49:$B137,0)","v":42},{"$f":"MATCH(Calc2!Z$112,Trucks!$B$49:$B137,0)","v":42},{"$f":"MATCH(Calc2!AA$112,Trucks!$B$49:$B137,0)","v":42},{"$f":"MATCH(Calc2!AB$112,Trucks!$B$49:$B137,0)","v":42}]
[null,null,{"$f":"MATCH(Calc2!C$112,Trucks!$B$49:$B138,0)","v":6},{"$f":"MATCH(Calc2!D$112,Trucks!$B$49:$B138,0)","v":{"$error":"#N/A"}},{"$f":"MATCH(Calc2!E$112,Trucks!$B$49:$B138,0)","v":{"$error":"#N/A"}},{"$f":"MATCH(Calc2!F$112,Trucks!$B$49:$B138,0)","v":{"$error":"#N/A"}},{"$f":"MATCH(Calc2!G$112,Trucks!$B$49:$B138,0)","v":42},{"$f":"MATCH(Calc2!H$112,Trucks!$B$49:$B138,0)","v":42},{"$f":"MATCH(Calc2!I$112,Trucks!$B$49:$B138,0)","v":42},{"$f":"MATCH(Calc2!J$112,Trucks!$B$49:$B138,0)","v":42},{"$f":"MATCH(Calc2!K$112,Trucks!$B$49:$B138,0)","v":42},{"$f":"MATCH(Calc2!L$112,Trucks!$B$49:$B138,0)","v":42},{"$f":"MATCH(Calc2!M$112,Trucks!$B$49:$B138,0)","v":42},{"$f":"MATCH(Calc2!N$112,Trucks!$B$49:$B138,0)","v":42},{"$f":"MATCH(Calc2!O$112,Trucks!$B$49:$B138,0)","v":42},{"$f":"MATCH(Calc2!P$112,Trucks!$B$49:$B138,0)","v":42},{"$f":"MATCH(Calc2!Q$112,Trucks!$B$49:$B138,0)","v":42},{"$f":"MATCH(Calc2!R$112,Trucks!$B$49:$B138,0)","v":42},{"$f":"MATCH(Calc2!S$112,Trucks!$B$49:$B138,0)","v":42},{"$f":"MATCH(Calc2!T$112,Trucks!$B$49:$B138,0)","v":42},{"$f":"MATCH(Calc2!U$112,Trucks!$B$49:$B138,0)","v":42},{"$f":"MATCH(Calc2!V$112,Trucks!$B$49:$B138,0)","v":42},{"$f":"MATCH(Calc2!W$112,Trucks!$B$49:$B138,0)","v":42},{"$f":"MATCH(Calc2!X$112,Trucks!$B$49:$B138,0)","v":42},{"$f":"MATCH(Calc2!Y$112,Trucks!$B$49:$B138,0)","v":42},{"$f":"MATCH(Calc2!Z$112,Trucks!$B$49:$B138,0)","v":42},{"$f":"MATCH(Calc2!AA$112,Trucks!$B$49:$B138,0)","v":42},{"$f":"MATCH(Calc2!AB$112,Trucks!$B$49:$B138,0)","v":42}]
[null,null,{"$f":"MATCH(Calc2!C$112,Trucks!$B$49:$B139,0)","v":6},{"$f":"MATCH(Calc2!D$112,Trucks!$B$49:$B139,0)","v":{"$error":"#N/A"}},{"$f":"MATCH(Calc2!E$112,Trucks!$B$49:$B139,0)","v":{"$error":"#N/A"}},{"$f":"MATCH(Calc2!F$112,Trucks!$B$49:$B139,0)","v":{"$error":"#N/A"}},{"$f":"MATCH(Calc2!G$112,Trucks!$B$49:$B139,0)","v":42},{"$f":"MATCH(Calc2!H$112,Trucks!$B$49:$B139,0)","v":42},{"$f":"MATCH(Calc2!I$112,Trucks!$B$49:$B139,0)","v":42},{"$f":"MATCH(Calc2!J$112,Trucks!$B$49:$B139,0)","v":42},{"$f":"MATCH(Calc2!K$112,Trucks!$B$49:$B139,0)","v":42},{"$f":"MATCH(Calc2!L$112,Trucks!$B$49:$B139,0)","v":42},{"$f":"MATCH(Calc2!M$112,Trucks!$B$49:$B139,0)","v":42},{"$f":"MATCH(Calc2!N$112,Trucks!$B$49:$B139,0)","v":42},{"$f":"MATCH(Calc2!O$112,Trucks!$B$49:$B139,0)","v":42},{"$f":"MATCH(Calc2!P$112,Trucks!$B$49:$B139,0)","v":42},{"$f":"MATCH(Calc2!Q$112,Trucks!$B$49:$B139,0)","v":42},{"$f":"MATCH(Calc2!R$112,Trucks!$B$49:$B139,0)","v":42},{"$f":"MATCH(Calc2!S$112,Trucks!$B$49:$B139,0)","v":42},{"$f":"MATCH(Calc2!T$112,Trucks!$B$49:$B139,0)","v":42},{"$f":"MATCH(Calc2!U$112,Trucks!$B$49:$B139,0)","v":42},{"$f":"MATCH(Calc2!V$112,Trucks!$B$49:$B139,0)","v":42},{"$f":"MATCH(Calc2!W$112,Trucks!$B$49:$B139,0)","v":42},{"$f":"MATCH(Calc2!X$112,Trucks!$B$49:$B139,0)","v":42},{"$f":"MATCH(Calc2!Y$112,Trucks!$B$49:$B139,0)","v":42},{"$f":"MATCH(Calc2!Z$112,Trucks!$B$49:$B139,0)","v":42},{"$f":"MATCH(Calc2!AA$112,Trucks!$B$49:$B139,0)","v":42},{"$f":"MATCH(Calc2!AB$112,Trucks!$B$49:$B139,0)","v":42}]
[null,null,{"$f":"MATCH(Calc2!C$112,Trucks!$B$49:$B140,0)","v":6},{"$f":"MATCH(Calc2!D$112,Trucks!$B$49:$B140,0)","v":{"$error":"#N/A"}},{"$f":"MATCH(Calc2!E$112,Trucks!$B$49:$B140,0)","v":{"$error":"#N/A"}},{"$f":"MATCH(Calc2!F$112,Trucks!$B$49:$B140,0)","v":{"$error":"#N/A"}},{"$f":"MATCH(Calc2!G$112,Trucks!$B$49:$B140,0)","v":42},{"$f":"MATCH(Calc2!H$112,Trucks!$B$49:$B140,0)","v":42},{"$f":"MATCH(Calc2!I$112,Trucks!$B$49:$B140,0)","v":42},{"$f":"MATCH(Calc2!J$112,Trucks!$B$49:$B140,0)","v":42},{"$f":"MATCH(Calc2!K$112,Trucks!$B$49:$B140,0)","v":42},{"$f":"MATCH(Calc2!L$112,Trucks!$B$49:$B140,0)","v":42},{"$f":"MATCH(Calc2!M$112,Trucks!$B$49:$B140,0)","v":42},{"$f":"MATCH(Calc2!N$112,Trucks!$B$49:$B140,0)","v":42},{"$f":"MATCH(Calc2!O$112,Trucks!$B$49:$B140,0)","v":42},{"$f":"MATCH(Calc2!P$112,Trucks!$B$49:$B140,0)","v":42},{"$f":"MATCH(Calc2!Q$112,Trucks!$B$49:$B140,0)","v":42},{"$f":"MATCH(Calc2!R$112,Trucks!$B$49:$B140,0)","v":42},{"$f":"MATCH(Calc2!S$112,Trucks!$B$49:$B140,0)","v":42},{"$f":"MATCH(Calc2!T$112,Trucks!$B$49:$B140,0)","v":42},{"$f":"MATCH(Calc2!U$112,Trucks!$B$49:$B140,0)","v":42},{"$f":"MATCH(Calc2!V$112,Trucks!$B$49:$B140,0)","v":42},{"$f":"MATCH(Calc2!W$112,Trucks!$B$49:$B140,0)","v":42},{"$f":"MATCH(Calc2!X$112,Trucks!$B$49:$B140,0)","v":42},{"$f":"MATCH(Calc2!Y$112,Trucks!$B$49:$B140,0)","v":42},{"$f":"MATCH(Calc2!Z$112,Trucks!$B$49:$B140,0)","v":42},{"$f":"MATCH(Calc2!AA$112,Trucks!$B$49:$B140,0)","v":42},{"$f":"MATCH(Calc2!AB$112,Trucks!$B$49:$B140,0)","v":42}]
[null,null,{"$f":"MATCH(Calc2!C$112,Trucks!$B$49:$B141,0)","v":6},{"$f":"MATCH(Calc2!D$112,Trucks!$B$49:$B141,0)","v":{"$error":"#N/A"}},{"$f":"MATCH(Calc2!E$112,Trucks!$B$49:$B141,0)","v":{"$error":"#N/A"}},{"$f":"MATCH(Calc2!F$112,Trucks!$B$49:$B141,0)","v":{"$error":"#N/A"}},{"$f":"MATCH(Calc2!G$112,Trucks!$B$49:$B141,0)","v":42},{"$f":"MATCH(Calc2!H$112,Trucks!$B$49:$B141,0)","v":42},{"$f":"MATCH(Calc2!I$112,Trucks!$B$49:$B141,0)","v":42},{"$f":"MATCH(Calc2!J$112,Trucks!$B$49:$B141,0)","v":42},{"$f":"MATCH(Calc2!K$112,Trucks!$B$49:$B141,0)","v":42},{"$f":"MATCH(Calc2!L$112,Trucks!$B$49:$B141,0)","v":42},{"$f":"MATCH(Calc2!M$112,Trucks!$B$49:$B141,0)","v":42},{"$f":"MATCH(Calc2!N$112,Trucks!$B$49:$B141,0)","v":42},{"$f":"MATCH(Calc2!O$112,Trucks!$B$49:$B141,0)","v":42},{"$f":"MATCH(Calc2!P$112,Trucks!$B$49:$B141,0)","v":42},{"$f":"MATCH(Calc2!Q$112,Trucks!$B$49:$B141,0)","v":42},{"$f":"MATCH(Calc2!R$112,Trucks!$B$49:$B141,0)","v":42},{"$f":"MATCH(Calc2!S$112,Trucks!$B$49:$B141,0)","v":42},{"$f":"MATCH(Calc2!T$112,Trucks!$B$49:$B141,0)","v":42},{"$f":"MATCH(Calc2!U$112,Trucks!$B$49:$B141,0)","v":42},{"$f":"MATCH(Calc2!V$112,Trucks!$B$49:$B141,0)","v":42},{"$f":"MATCH(Calc2!W$112,Trucks!$B$49:$B141,0)","v":42},{"$f":"MATCH(Calc2!X$112,Trucks!$B$49:$B141,0)","v":42},{"$f":"MATCH(Calc2!Y$112,Trucks!$B$49:$B141,0)","v":42},{"$f":"MATCH(Calc2!Z$112,Trucks!$B$49:$B141,0)","v":42},{"$f":"MATCH(Calc2!AA$112,Trucks!$B$49:$B141,0)","v":42},{"$f":"MATCH(Calc2!AB$112,Trucks!$B$49:$B141,0)","v":42}]
[null,null,{"$f":"MATCH(Calc2!C$112,Trucks!$B$49:$B142,0)","v":6},{"$f":"MATCH(Calc2!D$112,Trucks!$B$49:$B142,0)","v":{"$error":"#N/A"}},{"$f":"MATCH(Calc2!E$112,Trucks!$B$49:$B142,0)","v":{"$error":"#N/A"}},{"$f":"MATCH(Calc2!F$112,Trucks!$B$49:$B142,0)","v":{"$error":"#N/A"}},{"$f":"MATCH(Calc2!G$112,Trucks!$B$49:$B142,0)","v":42},{"$f":"MATCH(Calc2!H$112,Trucks!$B$49:$B142,0)","v":42},{"$f":"MATCH(Calc2!I$112,Trucks!$B$49:$B142,0)","v":42},{"$f":"MATCH(Calc2!J$112,Trucks!$B$49:$B142,0)","v":42},{"$f":"MATCH(Calc2!K$112,Trucks!$B$49:$B142,0)","v":42},{"$f":"MATCH(Calc2!L$112,Trucks!$B$49:$B142,0)","v":42},{"$f":"MATCH(Calc2!M$112,Trucks!$B$49:$B142,0)","v":42},{"$f":"MATCH(Calc2!N$112,Trucks!$B$49:$B142,0)","v":42},{"$f":"MATCH(Calc2!O$112,Trucks!$B$49:$B142,0)","v":42},{"$f":"MATCH(Calc2!P$112,Trucks!$B$49:$B142,0)","v":42},{"$f":"MATCH(Calc2!Q$112,Trucks!$B$49:$B142,0)","v":42},{"$f":"MATCH(Calc2!R$112,Trucks!$B$49:$B142,0)","v":42},{"$f":"MATCH(Calc2!S$112,Trucks!$B$49:$B142,0)","v":42},{"$f":"MATCH(Calc2!T$112,Trucks!$B$49:$B142,0)","v":42},{"$f":"MATCH(Calc2!U$112,Trucks!$B$49:$B142,0)","v":42},{"$f":"MATCH(Calc2!V$112,Trucks!$B$49:$B142,0)","v":42},{"$f":"MATCH(Calc2!W$112,Trucks!$B$49:$B142,0)","v":42},{"$f":"MATCH(Calc2!X$112,Trucks!$B$49:$B142,0)","v":42},{"$f":"MATCH(Calc2!Y$112,Trucks!$B$49:$B142,0)","v":42},{"$f":"MATCH(Calc2!Z$112,Trucks!$B$49:$B142,0)","v":42},{"$f":"MATCH(Calc2!AA$112,Trucks!$B$49:$B142,0)","v":42},{"$f":"MATCH(Calc2!AB$112,Trucks!$B$49:$B142,0)","v":42}]
[null,null,{"$f":"MATCH(Calc2!C$112,Trucks!$B$49:$B143,0)","v":6},{"$f":"MATCH(Calc2!D$112,Trucks!$B$49:$B143,0)","v":95},{"$f":"MATCH(Calc2!E$112,Trucks!$B$49:$B143,0)","v":{"$error":"#N/A"}},{"$f":"MATCH(Calc2!F$112,Trucks!$B$49:$B143,0)","v":{"$error":"#N/A"}},{"$f":"MATCH(Calc2!G$112,Trucks!$B$49:$B143,0)","v":42},{"$f":"MATCH(Calc2!H$112,Trucks!$B$49:$B143,0)","v":42},{"$f":"MATCH(Calc2!I$112,Trucks!$B$49:$B143,0)","v":42},{"$f":"MATCH(Calc2!J$112,Trucks!$B$49:$B143,0)","v":42},{"$f":"MATCH(Calc2!K$112,Trucks!$B$49:$B143,0)","v":42},{"$f":"MATCH(Calc2!L$112,Trucks!$B$49:$B143,0)","v":42},{"$f":"MATCH(Calc2!M$112,Trucks!$B$49:$B143,0)","v":42},{"$f":"MATCH(Calc2!N$112,Trucks!$B$49:$B143,0)","v":42},{"$f":"MATCH(Calc2!O$112,Trucks!$B$49:$B143,0)","v":42},{"$f":"MATCH(Calc2!P$112,Trucks!$B$49:$B143,0)","v":42},{"$f":"MATCH(Calc2!Q$112,Trucks!$B$49:$B143,0)","v":42},{"$f":"MATCH(Calc2!R$112,Trucks!$B$49:$B143,0)","v":42},{"$f":"MATCH(Calc2!S$112,Trucks!$B$49:$B143,0)","v":42},{"$f":"MATCH(Calc2!T$112,Trucks!$B$49:$B143,0)","v":42},{"$f":"MATCH(Calc2!U$112,Trucks!$B$49:$B143,0)","v":42},{"$f":"MATCH(Calc2!V$112,Trucks!$B$49:$B143,0)","v":42},{"$f":"MATCH(Calc2!W$112,Trucks!$B$49:$B143,0)","v":42},{"$f":"MATCH(Calc2!X$112,Trucks!$B$49:$B143,0)","v":42},{"$f":"MATCH(Calc2!Y$112,Trucks!$B$49:$B143,0)","v":42},{"$f":"MATCH(Calc2!Z$112,Trucks!$B$49:$B143,0)","v":42},{"$f":"MATCH(Calc2!AA$112,Trucks!$B$49:$B143,0)","v":42},{"$f":"MATCH(Calc2!AB$112,Trucks!$B$49:$B143,0)","v":42}]
[null,null,{"$f":"MATCH(Calc2!C$112,Trucks!$B$49:$B144,0)","v":6},{"$f":"MATCH(Calc2!D$112,Trucks!$B$49:$B144,0)","v":95},{"$f":"MATCH(Calc2!E$112,Trucks!$B$49:$B144,0)","v":{"$error":"#N/A"}},{"$f":"MATCH(Calc2!F$112,Trucks!$B$49:$B144,0)","v":{"$error":"#N/A"}},{"$f":"MATCH(Calc2!G$112,Trucks!$B$49:$B144,0)","v":42},{"$f":"MATCH(Calc2!H$112,Trucks!$B$49:$B144,0)","v":42},{"$f":"MATCH(Calc2!I$112,Trucks!$B$49:$B144,0)","v":42},{"$f":"MATCH(Calc2!J$112,Trucks!$B$49:$B144,0)","v":42},{"$f":"MATCH(Calc2!K$112,Trucks!$B$49:$B144,0)","v":42},{"$f":"MATCH(Calc2!L$112,Trucks!$B$49:$B144,0)","v":42},{"$f":"MATCH(Calc2!M$112,Trucks!$B$49:$B144,0)","v":42},{"$f":"MATCH(Calc2!N$112,Trucks!$B$49:$B144,0)","v":42},{"$f":"MATCH(Calc2!O$112,Trucks!$B$49:$B144,0)","v":42},{"$f":"MATCH(Calc2!P$112,Trucks!$B$49:$B144,0)","v":42},{"$f":"MATCH(Calc2!Q$112,Trucks!$B$49:$B144,0)","v":42},{"$f":"MATCH(Calc2!R$112,Trucks!$B$49:$B144,0)","v":42},{"$f":"MATCH(Calc2!S$112,Trucks!$B$49:$B144,0)","v":42},{"$f":"MATCH(Calc2!T$112,Trucks!$B$49:$B144,0)","v":42},{"$f":"MATCH(Calc2!U$112,Trucks!$B$49:$B144,0)","v":42},{"$f":"MATCH(Calc2!V$112,Trucks!$B$49:$B144,0)","v":42},{"$f":"MATCH(Calc2!W$112,Trucks!$B$49:$B144,0)","v":42},{"$f":"MATCH(Calc2!X$112,Trucks!$B$49:$B144,0)","v":42},{"$f":"MATCH(Calc2!Y$112,Trucks!$B$49:$B144,0)","v":42},{"$f":"MATCH(Calc2!Z$112,Trucks!$B$49:$B144,0)","v":42},{"$f":"MATCH(Calc2!AA$112,Trucks!$B$49:$B144,0)","v":42},{"$f":"MATCH(Calc2!AB$112,Trucks!$B$49:$B144,0)","v":42}]
[null,null,{"$f":"MATCH(Calc2!C$112,Trucks!$B$49:$B147,0)","v":6},{"$f":"MATCH(Calc2!D$112,Trucks!$B$49:$B147,0)","v":95},{"$f":"MATCH(Calc2!E$112,Trucks!$B$49:$B147,0)","v":{"$error":"#N/A"}},{"$f":"MATCH(Calc2!F$112,Trucks!$B$49:$B147,0)","v":{"$error":"#N/A"}},{"$f":"MATCH(Calc2!G$112,Trucks!$B$49:$B147,0)","v":42},{"$f":"MATCH(Calc2!H$112,Trucks!$B$49:$B147,0)","v":42},{"$f":"MATCH(Calc2!I$112,Trucks!$B$49:$B147,0)","v":42},{"$f":"MATCH(Calc2!J$112,Trucks!$B$49:$B147,0)","v":42},{"$f":"MATCH(Calc2!K$112,Trucks!$B$49:$B147,0)","v":42},{"$f":"MATCH(Calc2!L$112,Trucks!$B$49:$B147,0)","v":42},{"$f":"MATCH(Calc2!M$112,Trucks!$B$49:$B147,0)","v":42},{"$f":"MATCH(Calc2!N$112,Trucks!$B$49:$B147,0)","v":42},{"$f":"MATCH(Calc2!O$112,Trucks!$B$49:$B147,0)","v":42},{"$f":"MATCH(Calc2!P$112,Trucks!$B$49:$B147,0)","v":42},{"$f":"MATCH(Calc2!Q$112,Trucks!$B$49:$B147,0)","v":42},{"$f":"MATCH(Calc2!R$112,Trucks!$B$49:$B147,0)","v":42},{"$f":"MATCH(Calc2!S$112,Trucks!$B$49:$B147,0)","v":42},{"$f":"MATCH(Calc2!T$112,Trucks!$B$49:$B147,0)","v":42},{"$f":"MATCH(Calc2!U$112,Trucks!$B$49:$B147,0)","v":42},{"$f":"MATCH(Calc2!V$112,Trucks!$B$49:$B147,0)","v":42},{"$f":"MATCH(Calc2!W$112,Trucks!$B$49:$B147,0)","v":42},{"$f":"MATCH(Calc2!X$112,Trucks!$B$49:$B147,0)","v":42},{"$f":"MATCH(Calc2!Y$112,Trucks!$B$49:$B147,0)","v":42},{"$f":"MATCH(Calc2!Z$112,Trucks!$B$49:$B147,0)","v":42},{"$f":"MATCH(Calc2!AA$112,Trucks!$B$49:$B147,0)","v":42},{"$f":"MATCH(Calc2!AB$112,Trucks!$B$49:$B147,0)","v":42}]
[null,null,{"$f":"MATCH(Calc2!C$112,Trucks!$B$49:$B150,0)","v":6},{"$f":"MATCH(Calc2!D$112,Trucks!$B$49:$B150,0)","v":95},{"$f":"MATCH(Calc2!E$112,Trucks!$B$49:$B150,0)","v":{"$error":"#N/A"}},{"$f":"MATCH(Calc2!F$112,Trucks!$B$49:$B150,0)","v":{"$error":"#N/A"}},{"$f":"MATCH(Calc2!G$112,Trucks!$B$49:$B150,0)","v":42},{"$f":"MATCH(Calc2!H$112,Trucks!$B$49:$B150,0)","v":42},{"$f":"MATCH(Calc2!I$112,Trucks!$B$49:$B150,0)","v":42},{"$f":"MATCH(Calc2!J$112,Trucks!$B$49:$B150,0)","v":42},{"$f":"MATCH(Calc2!K$112,Trucks!$B$49:$B150,0)","v":42},{"$f":"MATCH(Calc2!L$112,Trucks!$B$49:$B150,0)","v":42},{"$f":"MATCH(Calc2!M$112,Trucks!$B$49:$B150,0)","v":42},{"$f":"MATCH(Calc2!N$112,Trucks!$B$49:$B150,0)","v":42},{"$f":"MATCH(Calc2!O$112,Trucks!$B$49:$B150,0)","v":42},{"$f":"MATCH(Calc2!P$112,Trucks!$B$49:$B150,0)","v":42},{"$f":"MATCH(Calc2!Q$112,Trucks!$B$49:$B150,0)","v":42},{"$f":"MATCH(Calc2!R$112,Trucks!$B$49:$B150,0)","v":42},{"$f":"MATCH(Calc2!S$112,Trucks!$B$49:$B150,0)","v":42},{"$f":"MATCH(Calc2!T$112,Trucks!$B$49:$B150,0)","v":42},{"$f":"MATCH(Calc2!U$112,Trucks!$B$49:$B150,0)","v":42},{"$f":"MATCH(Calc2!V$112,Trucks!$B$49:$B150,0)","v":42},{"$f":"MATCH(Calc2!W$112,Trucks!$B$49:$B150,0)","v":42},{"$f":"MATCH(Calc2!X$112,Trucks!$B$49:$B150,0)","v":42},{"$f":"MATCH(Calc2!Y$112,Trucks!$B$49:$B150,0)","v":42},{"$f":"MATCH(Calc2!Z$112,Trucks!$B$49:$B150,0)","v":42},{"$f":"MATCH(Calc2!AA$112,Trucks!$B$49:$B150,0)","v":42},{"$f":"MATCH(Calc2!AB$112,Trucks!$B$49:$B150,0)","v":42}]
[null,null,{"$f":"MATCH(Calc2!C$112,Trucks!$B$49:$B155,0)","v":6},{"$f":"MATCH(Calc2!D$112,Trucks!$B$49:$B155,0)","v":95},{"$f":"MATCH(Calc2!E$112,Trucks!$B$49:$B155,0)","v":103},{"$f":"MATCH(Calc2!F$112,Trucks!$B$49:$B155,0)","v":107},{"$f":"MATCH(Calc2!G$112,Trucks!$B$49:$B155,0)","v":42},{"$f":"MATCH(Calc2!H$112,Trucks!$B$49:$B155,0)","v":42},{"$f":"MATCH(Calc2!I$112,Trucks!$B$49:$B155,0)","v":42},{"$f":"MATCH(Calc2!J$112,Trucks!$B$49:$B155,0)","v":42},{"$f":"MATCH(Calc2!K$112,Trucks!$B$49:$B155,0)","v":42},{"$f":"MATCH(Calc2!L$112,Trucks!$B$49:$B155,0)","v":42},{"$f":"MATCH(Calc2!M$112,Trucks!$B$49:$B155,0)","v":42},{"$f":"MATCH(Calc2!N$112,Trucks!$B$49:$B155,0)","v":42},{"$f":"MATCH(Calc2!O$112,Trucks!$B$49:$B155,0)","v":42},{"$f":"MATCH(Calc2!P$112,Trucks!$B$49:$B155,0)","v":42},{"$f":"MATCH(Calc2!Q$112,Trucks!$B$49:$B155,0)","v":42},{"$f":"MATCH(Calc2!R$112,Trucks!$B$49:$B155,0)","v":42},{"$f":"MATCH(Calc2!S$112,Trucks!$B$49:$B155,0)","v":42},{"$f":"MATCH(Calc2!T$112,Trucks!$B$49:$B155,0)","v":42},{"$f":"MATCH(Calc2!U$112,Trucks!$B$49:$B155,0)","v":42},{"$f":"MATCH(Calc2!V$112,Trucks!$B$49:$B155,0)","v":42},{"$f":"MATCH(Calc2!W$112,Trucks!$B$49:$B155,0)","v":42},{"$f":"MATCH(Calc2!X$112,Trucks!$B$49:$B155,0)","v":42},{"$f":"MATCH(Calc2!Y$112,Trucks!$B$49:$B155,0)","v":42},{"$f":"MATCH(Calc2!Z$112,Trucks!$B$49:$B155,0)","v":42},{"$f":"MATCH(Calc2!AA$112,Trucks!$B$49:$B155,0)","v":42},{"$f":"MATCH(Calc2!AB$112,Trucks!$B$49:$B155,0)","v":42}]
[null,null,{"$f":"MATCH(Calc2!C$112,Trucks!$B$49:$B156,0)","v":6},{"$f":"MATCH(Calc2!D$112,Trucks!$B$49:$B156,0)","v":95},{"$f":"MATCH(Calc2!E$112,Trucks!$B$49:$B156,0)","v":103},{"$f":"MATCH(Calc2!F$112,Trucks!$B$49:$B156,0)","v":107},{"$f":"MATCH(Calc2!G$112,Trucks!$B$49:$B156,0)","v":42},{"$f":"MATCH(Calc2!H$112,Trucks!$B$49:$B156,0)","v":42},{"$f":"MATCH(Calc2!I$112,Trucks!$B$49:$B156,0)","v":42},{"$f":"MATCH(Calc2!J$112,Trucks!$B$49:$B156,0)","v":42},{"$f":"MATCH(Calc2!K$112,Trucks!$B$49:$B156,0)","v":42},{"$f":"MATCH(Calc2!L$112,Trucks!$B$49:$B156,0)","v":42},{"$f":"MATCH(Calc2!M$112,Trucks!$B$49:$B156,0)","v":42},{"$f":"MATCH(Calc2!N$112,Trucks!$B$49:$B156,0)","v":42},{"$f":"MATCH(Calc2!O$112,Trucks!$B$49:$B156,0)","v":42},{"$f":"MATCH(Calc2!P$112,Trucks!$B$49:$B156,0)","v":42},{"$f":"MATCH(Calc2!Q$112,Trucks!$B$49:$B156,0)","v":42},{"$f":"MATCH(Calc2!R$112,Trucks!$B$49:$B156,0)","v":42},{"$f":"MATCH(Calc2!S$112,Trucks!$B$49:$B156,0)","v":42},{"$f":"MATCH(Calc2!T$112,Trucks!$B$49:$B156,0)","v":42},{"$f":"MATCH(Calc2!U$112,Trucks!$B$49:$B156,0)","v":42},{"$f":"MATCH(Calc2!V$112,Trucks!$B$49:$B156,0)","v":42},{"$f":"MATCH(Calc2!W$112,Trucks!$B$49:$B156,0)","v":42},{"$f":"MATCH(Calc2!X$112,Trucks!$B$49:$B156,0)","v":42},{"$f":"MATCH(Calc2!Y$112,Trucks!$B$49:$B156,0)","v":42},{"$f":"MATCH(Calc2!Z$112,Trucks!$B$49:$B156,0)","v":42},{"$f":"MATCH(Calc2!AA$112,Trucks!$B$49:$B156,0)","v":42},{"$f":"MATCH(Calc2!AB$112,Trucks!$B$49:$B156,0)","v":42}]
[null,null,{"$f":"MATCH(Calc2!C$112,Trucks!$B$49:$B156,0)","v":6},{"$f":"MATCH(Calc2!D$112,Trucks!$B$49:$B156,0)","v":95},{"$f":"MATCH(Calc2!E$112,Trucks!$B$49:$B156,0)","v":103},{"$f":"MATCH(Calc2!F$112,Trucks!$B$49:$B156,0)","v":107},{"$f":"MATCH(Calc2!G$112,Trucks!$B$49:$B156,0)","v":42},{"$f":"MATCH(Calc2!H$112,Trucks!$B$49:$B156,0)","v":42},{"$f":"MATCH(Calc2!I$112,Trucks!$B$49:$B156,0)","v":42},{"$f":"MATCH(Calc2!J$112,Trucks!$B$49:$B156,0)","v":42},{"$f":"MATCH(Calc2!K$112,Trucks!$B$49:$B156,0)","v":42},{"$f":"MATCH(Calc2!L$112,Trucks!$B$49:$B156,0)","v":42},{"$f":"MATCH(Calc2!M$112,Trucks!$B$49:$B156,0)","v":42},{"$f":"MATCH(Calc2!N$112,Trucks!$B$49:$B156,0)","v":42},{"$f":"MATCH(Calc2!O$112,Trucks!$B$49:$B156,0)","v":42},{"$f":"MATCH(Calc2!P$112,Trucks!$B$49:$B156,0)","v":42},{"$f":"MATCH(Calc2!Q$112,Trucks!$B$49:$B156,0)","v":42},{"$f":"MATCH(Calc2!R$112,Trucks!$B$49:$B156,0)","v":42},{"$f":"MATCH(Calc2!S$112,Trucks!$B$49:$B156,0)","v":42},{"$f":"MATCH(Calc2!T$112,Trucks!$B$49:$B156,0)","v":42},{"$f":"MATCH(Calc2!U$112,Trucks!$B$49:$B156,0)","v":42},{"$f":"MATCH(Calc2!V$112,Trucks!$B$49:$B156,0)","v":42},{"$f":"MATCH(Calc2!W$112,Trucks!$B$49:$B156,0)","v":42},{"$f":"MATCH(Calc2!X$112,Trucks!$B$49:$B156,0)","v":42},{"$f":"MATCH(Calc2!Y$112,Trucks!$B$49:$B156,0)","v":42},{"$f":"MATCH(Calc2!Z$112,Trucks!$B$49:$B156,0)","v":42},{"$f":"MATCH(Calc2!AA$112,Trucks!$B$49:$B156,0)","v":42},{"$f":"MATCH(Calc2!AB$112,Trucks!$B$49:$B156,0)","v":42}]
[null,null,{"$f":"MATCH(Calc2!C$112,Trucks!$B$49:$B157,0)","v":6},{"$f":"MATCH(Calc2!D$112,Trucks!$B$49:$B157,0)","v":95},{"$f":"MATCH(Calc2!E$112,Trucks!$B$49:$B157,0)","v":103},{"$f":"MATCH(Calc2!F$112,Trucks!$B$49:$B157,0)","v":107},{"$f":"MATCH(Calc2!G$112,Trucks!$B$49:$B157,0)","v":42},{"$f":"MATCH(Calc2!H$112,Trucks!$B$49:$B157,0)","v":42},{"$f":"MATCH(Calc2!I$112,Trucks!$B$49:$B157,0)","v":42},{"$f":"MATCH(Calc2!J$112,Trucks!$B$49:$B157,0)","v":42},{"$f":"MATCH(Calc2!K$112,Trucks!$B$49:$B157,0)","v":42},{"$f":"MATCH(Calc2!L$112,Trucks!$B$49:$B157,0)","v":42},{"$f":"MATCH(Calc2!M$112,Trucks!$B$49:$B157,0)","v":42},{"$f":"MATCH(Calc2!N$112,Trucks!$B$49:$B157,0)","v":42},{"$f":"MATCH(Calc2!O$112,Trucks!$B$49:$B157,0)","v":42},{"$f":"MATCH(Calc2!P$112,Trucks!$B$49:$B157,0)","v":42},{"$f":"MATCH(Calc2!Q$112,Trucks!$B$49:$B157,0)","v":42},{"$f":"MATCH(Calc2!R$112,Trucks!$B$49:$B157,0)","v":42},{"$f":"MATCH(Calc2!S$112,Trucks!$B$49:$B157,0)","v":42},{"$f":"MATCH(Calc2!T$112,Trucks!$B$49:$B157,0)","v":42},{"$f":"MATCH(Calc2!U$112,Trucks!$B$49:$B157,0)","v":42},{"$f":"MATCH(Calc2!V$112,Trucks!$B$49:$B157,0)","v":42},{"$f":"MATCH(Calc2!W$112,Trucks!$B$49:$B157,0)","v":42},{"$f":"MATCH(Calc2!X$112,Trucks!$B$49:$B157,0)","v":42},{"$f":"MATCH(Calc2!Y$112,Trucks!$B$49:$B157,0)","v":42},{"$f":"MATCH(Calc2!Z$112,Trucks!$B$49:$B157,0)","v":42},{"$f":"MATCH(Calc2!AA$112,Trucks!$B$49:$B157,0)","v":42},{"$f":"MATCH(Calc2!AB$112,Trucks!$B$49:$B157,0)","v":42}]
[null,null,{"$f":"MATCH(Calc2!C$112,Trucks!$B$49:$B159,0)","v":6},{"$f":"MATCH(Calc2!D$112,Trucks!$B$49:$B159,0)","v":95},{"$f":"MATCH(Calc2!E$112,Trucks!$B$49:$B159,0)","v":103},{"$f":"MATCH(Calc2!F$112,Trucks!$B$49:$B159,0)","v":107},{"$f":"MATCH(Calc2!G$112,Trucks!$B$49:$B159,0)","v":42},{"$f":"MATCH(Calc2!H$112,Trucks!$B$49:$B159,0)","v":42},{"$f":"MATCH(Calc2!I$112,Trucks!$B$49:$B159,0)","v":42},{"$f":"MATCH(Calc2!J$112,Trucks!$B$49:$B159,0)","v":42},{"$f":"MATCH(Calc2!K$112,Trucks!$B$49:$B159,0)","v":42},{"$f":"MATCH(Calc2!L$112,Trucks!$B$49:$B159,0)","v":42},{"$f":"MATCH(Calc2!M$112,Trucks!$B$49:$B159,0)","v":42},{"$f":"MATCH(Calc2!N$112,Trucks!$B$49:$B159,0)","v":42},{"$f":"MATCH(Calc2!O$112,Trucks!$B$49:$B159,0)","v":42},{"$f":"MATCH(Calc2!P$112,Trucks!$B$49:$B159,0)","v":42},{"$f":"MATCH(Calc2!Q$112,Trucks!$B$49:$B159,0)","v":42},{"$f":"MATCH(Calc2!R$112,Trucks!$B$49:$B159,0)","v":42},{"$f":"MATCH(Calc2!S$112,Trucks!$B$49:$B159,0)","v":42},{"$f":"MATCH(Calc2!T$112,Trucks!$B$49:$B159,0)","v":42},{"$f":"MATCH(Calc2!U$112,Trucks!$B$49:$B159,0)","v":42},{"$f":"MATCH(Calc2!V$112,Trucks!$B$49:$B159,0)","v":42},{"$f":"MATCH(Calc2!W$112,Trucks!$B$49:$B159,0)","v":42},{"$f":"MATCH(Calc2!X$112,Trucks!$B$49:$B159,0)","v":42},{"$f":"MATCH(Calc2!Y$112,Trucks!$B$49:$B159,0)","v":42},{"$f":"MATCH(Calc2!Z$112,Trucks!$B$49:$B159,0)","v":42},{"$f":"MATCH(Calc2!AA$112,Trucks!$B$49:$B159,0)","v":42},{"$f":"MATCH(Calc2!AB$112,Trucks!$B$49:$B159,0)","v":42}]
[null,null,{"$f":"MATCH(Calc2!C$112,Trucks!$B$49:$B160,0)","v":6},{"$f":"MATCH(Calc2!D$112,Trucks!$B$49:$B160,0)","v":95},{"$f":"MATCH(Calc2!E$112,Trucks!$B$49:$B160,0)","v":103},{"$f":"MATCH(Calc2!F$112,Trucks!$B$49:$B160,0)","v":107},{"$f":"MATCH(Calc2!G$112,Trucks!$B$49:$B160,0)","v":42},{"$f":"MATCH(Calc2!H$112,Trucks!$B$49:$B160,0)","v":42},{"$f":"MATCH(Calc2!I$112,Trucks!$B$49:$B160,0)","v":42},{"$f":"MATCH(Calc2!J$112,Trucks!$B$49:$B160,0)","v":42},{"$f":"MATCH(Calc2!K$112,Trucks!$B$49:$B160,0)","v":42},{"$f":"MATCH(Calc2!L$112,Trucks!$B$49:$B160,0)","v":42},{"$f":"MATCH(Calc2!M$112,Trucks!$B$49:$B160,0)","v":42},{"$f":"MATCH(Calc2!N$112,Trucks!$B$49:$B160,0)","v":42},{"$f":"MATCH(Calc2!O$112,Trucks!$B$49:$B160,0)","v":42},{"$f":"MATCH(Calc2!P$112,Trucks!$B$49:$B160,0)","v":42},{"$f":"MATCH(Calc2!Q$112,Trucks!$B$49:$B160,0)","v":42},{"$f":"MATCH(Calc2!R$112,Trucks!$B$49:$B160,0)","v":42},{"$f":"MATCH(Calc2!S$112,Trucks!$B$49:$B160,0)","v":42},{"$f":"MATCH(Calc2!T$112,Trucks!$B$49:$B160,0)","v":42},{"$f":"MATCH(Calc2!U$112,Trucks!$B$49:$B160,0)","v":42},{"$f":"MATCH(Calc2!V$112,Trucks!$B$49:$B160,0)","v":42},{"$f":"MATCH(Calc2!W$112,Trucks!$B$49:$B160,0)","v":42},{"$f":"MATCH(Calc2!X$112,Trucks!$B$49:$B160,0)","v":42},{"$f":"MATCH(Calc2!Y$112,Trucks!$B$49:$B160,0)","v":42},{"$f":"MATCH(Calc2!Z$112,Trucks!$B$49:$B160,0)","v":42},{"$f":"MATCH(Calc2!AA$112,Trucks!$B$49:$B160,0)","v":42},{"$f":"MATCH(Calc2!AB$112,Trucks!$B$49:$B160,0)","v":42}]
[null,null,{"$f":"MATCH(Calc2!C$112,Trucks!$B$49:$B161,0)","v":6},{"$f":"MATCH(Calc2!D$112,Trucks!$B$49:$B161,0)","v":95},{"$f":"MATCH(Calc2!E$112,Trucks!$B$49:$B161,0)","v":103},{"$f":"MATCH(Calc2!F$112,Trucks!$B$49:$B161,0)","v":107},{"$f":"MATCH(Calc2!G$112,Trucks!$B$49:$B161,0)","v":42},{"$f":"MATCH(Calc2!H$112,Trucks!$B$49:$B161,0)","v":42},{"$f":"MATCH(Calc2!I$112,Trucks!$B$49:$B161,0)","v":42},{"$f":"MATCH(Calc2!J$112,Trucks!$B$49:$B161,0)","v":42},{"$f":"MATCH(Calc2!K$112,Trucks!$B$49:$B161,0)","v":42},{"$f":"MATCH(Calc2!L$112,Trucks!$B$49:$B161,0)","v":42},{"$f":"MATCH(Calc2!M$112,Trucks!$B$49:$B161,0)","v":42},{"$f":"MATCH(Calc2!N$112,Trucks!$B$49:$B161,0)","v":42},{"$f":"MATCH(Calc2!O$112,Trucks!$B$49:$B161,0)","v":42},{"$f":"MATCH(Calc2!P$112,Trucks!$B$49:$B161,0)","v":42},{"$f":"MATCH(Calc2!Q$112,Trucks!$B$49:$B161,0)","v":42},{"$f":"MATCH(Calc2!R$112,Trucks!$B$49:$B161,0)","v":42},{"$f":"MATCH(Calc2!S$112,Trucks!$B$49:$B161,0)","v":42},{"$f":"MATCH(Calc2!T$112,Trucks!$B$49:$B161,0)","v":42},{"$f":"MATCH(Calc2!U$112,Trucks!$B$49:$B161,0)","v":42},{"$f":"MATCH(Calc2!V$112,Trucks!$B$49:$B161,0)","v":42},{"$f":"MATCH(Calc2!W$112,Trucks!$B$49:$B161,0)","v":42},{"$f":"MATCH(Calc2!X$112,Trucks!$B$49:$B161,0)","v":42},{"$f":"MATCH(Calc2!Y$112,Trucks!$B$49:$B161,0)","v":42},{"$f":"MATCH(Calc2!Z$112,Trucks!$B$49:$B161,0)","v":42},{"$f":"MATCH(Calc2!AA$112,Trucks!$B$49:$B161,0)","v":42},{"$f":"MATCH(Calc2!AB$112,Trucks!$B$49:$B161,0)","v":42}]
[null,null,{"$f":"MATCH(Calc2!C$112,Trucks!$B$49:$B162,0)","v":6},{"$f":"MATCH(Calc2!D$112,Trucks!$B$49:$B162,0)","v":95},{"$f":"MATCH(Calc2!E$112,Trucks!$B$49:$B162,0)","v":103},{"$f":"MATCH(Calc2!F$112,Trucks!$B$49:$B162,0)","v":107},{"$f":"MATCH(Calc2!G$112,Trucks!$B$49:$B162,0)","v":42},{"$f":"MATCH(Calc2!H$112,Trucks!$B$49:$B162,0)","v":42},{"$f":"MATCH(Calc2!I$112,Trucks!$B$49:$B162,0)","v":42},{"$f":"MATCH(Calc2!J$112,Trucks!$B$49:$B162,0)","v":42},{"$f":"MATCH(Calc2!K$112,Trucks!$B$49:$B162,0)","v":42},{"$f":"MATCH(Calc2!L$112,Trucks!$B$49:$B162,0)","v":42},{"$f":"MATCH(Calc2!M$112,Trucks!$B$49:$B162,0)","v":42},{"$f":"MATCH(Calc2!N$112,Trucks!$B$49:$B162,0)","v":42},{"$f":"MATCH(Calc2!O$112,Trucks!$B$49:$B162,0)","v":42},{"$f":"MATCH(Calc2!P$112,Trucks!$B$49:$B162,0)","v":42},{"$f":"MATCH(Calc2!Q$112,Trucks!$B$49:$B162,0)","v":42},{"$f":"MATCH(Calc2!R$112,Trucks!$B$49:$B162,0)","v":42},{"$f":"MATCH(Calc2!S$112,Trucks!$B$49:$B162,0)","v":42},{"$f":"MATCH(Calc2!T$112,Trucks!$B$49:$B162,0)","v":42},{"$f":"MATCH(Calc2!U$112,Trucks!$B$49:$B162,0)","v":42},{"$f":"MATCH(Calc2!V$112,Trucks!$B$49:$B162,0)","v":42},{"$f":"MATCH(Calc2!W$112,Trucks!$B$49:$B162,0)","v":42},{"$f":"MATCH(Calc2!X$112,Trucks!$B$49:$B162,0)","v":42},{"$f":"MATCH(Calc2!Y$112,Trucks!$B$49:$B162,0)","v":42},{"$f":"MATCH(Calc2!Z$112,Trucks!$B$49:$B162,0)","v":42},{"$f":"MATCH(Calc2!AA$112,Trucks!$B$49:$B162,0)","v":42},{"$f":"MATCH(Calc2!AB$112,Trucks!$B$49:$B162,0)","v":42}]
[null,null,{"$f":"MATCH(Calc2!C$112,Trucks!$B$49:$B163,0)","v":6},{"$f":"MATCH(Calc2!D$112,Trucks!$B$49:$B163,0)","v":95},{"$f":"MATCH(Calc2!E$112,Trucks!$B$49:$B163,0)","v":103},{"$f":"MATCH(Calc2!F$112,Trucks!$B$49:$B163,0)","v":107},{"$f":"MATCH(Calc2!G$112,Trucks!$B$49:$B163,0)","v":42},{"$f":"MATCH(Calc2!H$112,Trucks!$B$49:$B163,0)","v":42},{"$f":"MATCH(Calc2!I$112,Trucks!$B$49:$B163,0)","v":42},{"$f":"MATCH(Calc2!J$112,Trucks!$B$49:$B163,0)","v":42},{"$f":"MATCH(Calc2!K$112,Trucks!$B$49:$B163,0)","v":42},{"$f":"MATCH(Calc2!L$112,Trucks!$B$49:$B163,0)","v":42},{"$f":"MATCH(Calc2!M$112,Trucks!$B$49:$B163,0)","v":42},{"$f":"MATCH(Calc2!N$112,Trucks!$B$49:$B163,0)","v":42},{"$f":"MATCH(Calc2!O$112,Trucks!$B$49:$B163,0)","v":42},{"$f":"MATCH(Calc2!P$112,Trucks!$B$49:$B163,0)","v":42},{"$f":"MATCH(Calc2!Q$112,Trucks!$B$49:$B163,0)","v":42},{"$f":"MATCH(Calc2!R$112,Trucks!$B$49:$B163,0)","v":42},{"$f":"MATCH(Calc2!S$112,Trucks!$B$49:$B163,0)","v":42},{"$f":"MATCH(Calc2!T$112,Trucks!$B$49:$B163,0)","v":42},{"$f":"MATCH(Calc2!U$112,Trucks!$B$49:$B163,0)","v":42},{"$f":"MATCH(Calc2!V$112,Trucks!$B$49:$B163,0)","v":42},{"$f":"MATCH(Calc2!W$112,Trucks!$B$49:$B163,0)","v":42},{"$f":"MATCH(Calc2!X$112,Trucks!$B$49:$B163,0)","v":42},{"$f":"MATCH(Calc2!Y$112,Trucks!$B$49:$B163,0)","v":42},{"$f":"MATCH(Calc2!Z$112,Trucks!$B$49:$B163,0)","v":42},{"$f":"MATCH(Calc2!AA$112,Trucks!$B$49:$B163,0)","v":42},{"$f":"MATCH(Calc2!AB$112,Trucks!$B$49:$B163,0)","v":42}]
[null,null,{"$f":"MATCH(Calc2!C$112,Trucks!$B$49:$B164,0)","v":6},{"$f":"MATCH(Calc2!D$112,Trucks!$B$49:$B164,0)","v":95},{"$f":"MATCH(Calc2!E$112,Trucks!$B$49:$B164,0)","v":103},{"$f":"MATCH(Calc2!F$112,Trucks!$B$49:$B164,0)","v":107},{"$f":"MATCH(Calc2!G$112,Trucks!$B$49:$B164,0)","v":42},{"$f":"MATCH(Calc2!H$112,Trucks!$B$49:$B164,0)","v":42},{"$f":"MATCH(Calc2!I$112,Trucks!$B$49:$B164,0)","v":42},{"$f":"MATCH(Calc2!J$112,Trucks!$B$49:$B164,0)","v":42},{"$f":"MATCH(Calc2!K$112,Trucks!$B$49:$B164,0)","v":42},{"$f":"MATCH(Calc2!L$112,Trucks!$B$49:$B164,0)","v":42},{"$f":"MATCH(Calc2!M$112,Trucks!$B$49:$B164,0)","v":42},{"$f":"MATCH(Calc2!N$112,Trucks!$B$49:$B164,0)","v":42},{"$f":"MATCH(Calc2!O$112,Trucks!$B$49:$B164,0)","v":42},{"$f":"MATCH(Calc2!P$112,Trucks!$B$49:$B164,0)","v":42},{"$f":"MATCH(Calc2!Q$112,Trucks!$B$49:$B164,0)","v":42},{"$f":"MATCH(Calc2!R$112,Trucks!$B$49:$B164,0)","v":42},{"$f":"MATCH(Calc2!S$112,Trucks!$B$49:$B164,0)","v":42},{"$f":"MATCH(Calc2!T$112,Trucks!$B$49:$B164,0)","v":42},{"$f":"MATCH(Calc2!U$112,Trucks!$B$49:$B164,0)","v":42},{"$f":"MATCH(Calc2!V$112,Trucks!$B$49:$B164,0)","v":42},{"$f":"MATCH(Calc2!W$112,Trucks!$B$49:$B164,0)","v":42},{"$f":"MATCH(Calc2!X$112,Trucks!$B$49:$B164,0)","v":42},{"$f":"MATCH(Calc2!Y$112,Trucks!$B$49:$B164,0)","v":42},{"$f":"MATCH(Calc2!Z$112,Trucks!$B$49:$B164,0)","v":42},{"$f":"MATCH(Calc2!AA$112,Trucks!$B$49:$B164,0)","v":42},{"$f":"MATCH(Calc2!AB$112,Trucks!$B$49:$B164,0)","v":42}]
[null,null,{"$f":"MATCH(Calc2!C$112,Trucks!$B$49:$B165,0)","v":6},{"$f":"MATCH(Calc2!D$112,Trucks!$B$49:$B165,0)","v":95},{"$f":"MATCH(Calc2!E$112,Trucks!$B$49:$B165,0)","v":103},{"$f":"MATCH(Calc2!F$112,Trucks!$B$49:$B165,0)","v":107},{"$f":"MATCH(Calc2!G$112,Trucks!$B$49:$B165,0)","v":42},{"$f":"MATCH(Calc2!H$112,Trucks!$B$49:$B165,0)","v":42},{"$f":"MATCH(Calc2!I$112,Trucks!$B$49:$B165,0)","v":42},{"$f":"MATCH(Calc2!J$112,Trucks!$B$49:$B165,0)","v":42},{"$f":"MATCH(Calc2!K$112,Trucks!$B$49:$B165,0)","v":42},{"$f":"MATCH(Calc2!L$112,Trucks!$B$49:$B165,0)","v":42},{"$f":"MATCH(Calc2!M$112,Trucks!$B$49:$B165,0)","v":42},{"$f":"MATCH(Calc2!N$112,Trucks!$B$49:$B165,0)","v":42},{"$f":"MATCH(Calc2!O$112,Trucks!$B$49:$B165,0)","v":42},{"$f":"MATCH(Calc2!P$112,Trucks!$B$49:$B165,0)","v":42},{"$f":"MATCH(Calc2!Q$112,Trucks!$B$49:$B165,0)","v":42},{"$f":"MATCH(Calc2!R$112,Trucks!$B$49:$B165,0)","v":42},{"$f":"MATCH(Calc2!S$112,Trucks!$B$49:$B165,0)","v":42},{"$f":"MATCH(Calc2!T$112,Trucks!$B$49:$B165,0)","v":42},{"$f":"MATCH(Calc2!U$112,Trucks!$B$49:$B165,0)","v":42},{"$f":"MATCH(Calc2!V$112,Trucks!$B$49:$B165,0)","v":42},{"$f":"MATCH(Calc2!W$112,Trucks!$B$49:$B165,0)","v":42},{"$f":"MATCH(Calc2!X$112,Trucks!$B$49:$B165,0)","v":42},{"$f":"MATCH(Calc2!Y$112,Trucks!$B$49:$B165,0)","v":42},{"$f":"MATCH(Calc2!Z$112,Trucks!$B$49:$B165,0)","v":42},{"$f":"MATCH(Calc2!AA$112,Trucks!$B$49:$B165,0)","v":42},{"$f":"MATCH(Calc2!AB$112,Trucks!$B$49:$B165,0)","v":42}]
[null,null,{"$f":"MATCH(Calc2!C$112,Trucks!$B$49:$B166,0)","v":6},{"$f":"MATCH(Calc2!D$112,Trucks!$B$49:$B166,0)","v":95},{"$f":"MATCH(Calc2!E$112,Trucks!$B$49:$B166,0)","v":103},{"$f":"MATCH(Calc2!F$112,Trucks!$B$49:$B166,0)","v":107},{"$f":"MATCH(Calc2!G$112,Trucks!$B$49:$B166,0)","v":42},{"$f":"MATCH(Calc2!H$112,Trucks!$B$49:$B166,0)","v":42},{"$f":"MATCH(Calc2!I$112,Trucks!$B$49:$B166,0)","v":42},{"$f":"MATCH(Calc2!J$112,Trucks!$B$49:$B166,0)","v":42},{"$f":"MATCH(Calc2!K$112,Trucks!$B$49:$B166,0)","v":42},{"$f":"MATCH(Calc2!L$112,Trucks!$B$49:$B166,0)","v":42},{"$f":"MATCH(Calc2!M$112,Trucks!$B$49:$B166,0)","v":42},{"$f":"MATCH(Calc2!N$112,Trucks!$B$49:$B166,0)","v":42},{"$f":"MATCH(Calc2!O$112,Trucks!$B$49:$B166,0)","v":42},{"$f":"MATCH(Calc2!P$112,Trucks!$B$49:$B166,0)","v":42},{"$f":"MATCH(Calc2!Q$112,Trucks!$B$49:$B166,0)","v":42},{"$f":"MATCH(Calc2!R$112,Trucks!$B$49:$B166,0)","v":42},{"$f":"MATCH(Calc2!S$112,Trucks!$B$49:$B166,0)","v":42},{"$f":"MATCH(Calc2!T$112,Trucks!$B$49:$B166,0)","v":42},{"$f":"MATCH(Calc2!U$112,Trucks!$B$49:$B166,0)","v":42},{"$f":"MATCH(Calc2!V$112,Trucks!$B$49:$B166,0)","v":42},{"$f":"MATCH(Calc2!W$112,Trucks!$B$49:$B166,0)","v":42},{"$f":"MATCH(Calc2!X$112,Trucks!$B$49:$B166,0)","v":42},{"$f":"MATCH(Calc2!Y$112,Trucks!$B$49:$B166,0)","v":42},{"$f":"MATCH(Calc2!Z$112,Trucks!$B$49:$B166,0)","v":42},{"$f":"MATCH(Calc2!AA$112,Trucks!$B$49:$B166,0)","v":42},{"$f":"MATCH(Calc2!AB$112,Trucks!$B$49:$B166,0)","v":42}]
[null,null,{"$f":"MATCH(Calc2!C$112,Trucks!$B$49:$B167,0)","v":6},{"$f":"MATCH(Calc2!D$112,Trucks!$B$49:$B167,0)","v":95},{"$f":"MATCH(Calc2!E$112,Trucks!$B$49:$B167,0)","v":103},{"$f":"MATCH(Calc2!F$112,Trucks!$B$49:$B167,0)","v":107},{"$f":"MATCH(Calc2!G$112,Trucks!$B$49:$B167,0)","v":42},{"$f":"MATCH(Calc2!H$112,Trucks!$B$49:$B167,0)","v":42},{"$f":"MATCH(Calc2!I$112,Trucks!$B$49:$B167,0)","v":42},{"$f":"MATCH(Calc2!J$112,Trucks!$B$49:$B167,0)","v":42},{"$f":"MATCH(Calc2!K$112,Trucks!$B$49:$B167,0)","v":42},{"$f":"MATCH(Calc2!L$112,Trucks!$B$49:$B167,0)","v":42},{"$f":"MATCH(Calc2!M$112,Trucks!$B$49:$B167,0)","v":42},{"$f":"MATCH(Calc2!N$112,Trucks!$B$49:$B167,0)","v":42},{"$f":"MATCH(Calc2!O$112,Trucks!$B$49:$B167,0)","v":42},{"$f":"MATCH(Calc2!P$112,Trucks!$B$49:$B167,0)","v":42},{"$f":"MATCH(Calc2!Q$112,Trucks!$B$49:$B167,0)","v":42},{"$f":"MATCH(Calc2!R$112,Trucks!$B$49:$B167,0)","v":42},{"$f":"MATCH(Calc2!S$112,Trucks!$B$49:$B167,0)","v":42},{"$f":"MATCH(Calc2!T$112,Trucks!$B$49:$B167,0)","v":42},{"$f":"MATCH(Calc2!U$112,Trucks!$B$49:$B167,0)","v":42},{"$f":"MATCH(Calc2!V$112,Trucks!$B$49:$B167,0)","v":42},{"$f":"MATCH(Calc2!W$112,Trucks!$B$49:$B167,0)","v":42},{"$f":"MATCH(Calc2!X$112,Trucks!$B$49:$B167,0)","v":42},{"$f":"MATCH(Calc2!Y$112,Trucks!$B$49:$B167,0)","v":42},{"$f":"MATCH(Calc2!Z$112,Trucks!$B$49:$B167,0)","v":42},{"$f":"MATCH(Calc2!AA$112,Trucks!$B$49:$B167,0)","v":42},{"$f":"MATCH(Calc2!AB$112,Trucks!$B$49:$B167,0)","v":42}]
[null,null,{"$f":"MATCH(Calc2!C$112,Trucks!$B$49:$B168,0)","v":6},{"$f":"MATCH(Calc2!D$112,Trucks!$B$49:$B168,0)","v":95},{"$f":"MATCH(Calc2!E$112,Trucks!$B$49:$B168,0)","v":103},{"$f":"MATCH(Calc2!F$112,Trucks!$B$49:$B168,0)","v":107},{"$f":"MATCH(Calc2!G$112,Trucks!$B$49:$B168,0)","v":42},{"$f":"MATCH(Calc2!H$112,Trucks!$B$49:$B168,0)","v":42},{"$f":"MATCH(Calc2!I$112,Trucks!$B$49:$B168,0)","v":42},{"$f":"MATCH(Calc2!J$112,Trucks!$B$49:$B168,0)","v":42},{"$f":"MATCH(Calc2!K$112,Trucks!$B$49:$B168,0)","v":42},{"$f":"MATCH(Calc2!L$112,Trucks!$B$49:$B168,0)","v":42},{"$f":"MATCH(Calc2!M$112,Trucks!$B$49:$B168,0)","v":42},{"$f":"MATCH(Calc2!N$112,Trucks!$B$49:$B168,0)","v":42},{"$f":"MATCH(Calc2!O$112,Trucks!$B$49:$B168,0)","v":42},{"$f":"MATCH(Calc2!P$112,Trucks!$B$49:$B168,0)","v":42},{"$f":"MATCH(Calc2!Q$112,Trucks!$B$49:$B168,0)","v":42},{"$f":"MATCH(Calc2!R$112,Trucks!$B$49:$B168,0)","v":42},{"$f":"MATCH(Calc2!S$112,Trucks!$B$49:$B168,0)","v":42},{"$f":"MATCH(Calc2!T$112,Trucks!$B$49:$B168,0)","v":42},{"$f":"MATCH(Calc2!U$112,Trucks!$B$49:$B168,0)","v":42},{"$f":"MATCH(Calc2!V$112,Trucks!$B$49:$B168,0)","v":42},{"$f":"MATCH(Calc2!W$112,Trucks!$B$49:$B168,0)","v":42},{"$f":"MATCH(Calc2!X$112,Trucks!$B$49:$B168,0)","v":42},{"$f":"MATCH(Calc2!Y$112,Trucks!$B$49:$B168,0)","v":42},{"$f":"MATCH(Calc2!Z$112,Trucks!$B$49:$B168,0)","v":42},{"$f":"MATCH(Calc2!AA$112,Trucks!$B$49:$B168,0)","v":42},{"$f":"MATCH(Calc2!AB$112,Trucks!$B$49:$B168,0)","v":42}]
[null,null,{"$f":"MATCH(Calc2!C$112,Trucks!$B$49:$B169,0)","v":6},{"$f":"MATCH(Calc2!D$112,Trucks!$B$49:$B169,0)","v":95},{"$f":"MATCH(Calc2!E$112,Trucks!$B$49:$B169,0)","v":103},{"$f":"MATCH(Calc2!F$112,Trucks!$B$49:$B169,0)","v":107},{"$f":"MATCH(Calc2!G$112,Trucks!$B$49:$B169,0)","v":42},{"$f":"MATCH(Calc2!H$112,Trucks!$B$49:$B169,0)","v":42},{"$f":"MATCH(Calc2!I$112,Trucks!$B$49:$B169,0)","v":42},{"$f":"MATCH(Calc2!J$112,Trucks!$B$49:$B169,0)","v":42},{"$f":"MATCH(Calc2!K$112,Trucks!$B$49:$B169,0)","v":42},{"$f":"MATCH(Calc2!L$112,Trucks!$B$49:$B169,0)","v":42},{"$f":"MATCH(Calc2!M$112,Trucks!$B$49:$B169,0)","v":42},{"$f":"MATCH(Calc2!N$112,Trucks!$B$49:$B169,0)","v":42},{"$f":"MATCH(Calc2!O$112,Trucks!$B$49:$B169,0)","v":42},{"$f":"MATCH(Calc2!P$112,Trucks!$B$49:$B169,0)","v":42},{"$f":"MATCH(Calc2!Q$112,Trucks!$B$49:$B169,0)","v":42},{"$f":"MATCH(Calc2!R$112,Trucks!$B$49:$B169,0)","v":42},{"$f":"MATCH(Calc2!S$112,Trucks!$B$49:$B169,0)","v":42},{"$f":"MATCH(Calc2!T$112,Trucks!$B$49:$B169,0)","v":42},{"$f":"MATCH(Calc2!U$112,Trucks!$B$49:$B169,0)","v":42},{"$f":"MATCH(Calc2!V$112,Trucks!$B$49:$B169,0)","v":42},{"$f":"MATCH(Calc2!W$112,Trucks!$B$49:$B169,0)","v":42},{"$f":"MATCH(Calc2!X$112,Trucks!$B$49:$B169,0)","v":42},{"$f":"MATCH(Calc2!Y$112,Trucks!$B$49:$B169,0)","v":42},{"$f":"MATCH(Calc2!Z$112,Trucks!$B$49:$B169,0)","v":42},{"$f":"MATCH(Calc2!AA$112,Trucks!$B$49:$B169,0)","v":42},{"$f":"MATCH(Calc2!AB$112,Trucks!$B$49:$B169,0)","v":42}]
[null,null,{"$f":"MATCH(Calc2!C$112,Trucks!$B$49:$B170,0)","v":6},{"$f":"MATCH(Calc2!D$112,Trucks!$B$49:$B170,0)","v":95},{"$f":"MATCH(Calc2!E$112,Trucks!$B$49:$B170,0)","v":103},{"$f":"MATCH(Calc2!F$112,Trucks!$B$49:$B170,0)","v":107},{"$f":"MATCH(Calc2!G$112,Trucks!$B$49:$B170,0)","v":42},{"$f":"MATCH(Calc2!H$112,Trucks!$B$49:$B170,0)","v":42},{"$f":"MATCH(Calc2!I$112,Trucks!$B$49:$B170,0)","v":42},{"$f":"MATCH(Calc2!J$112,Trucks!$B$49:$B170,0)","v":42},{"$f":"MATCH(Calc2!K$112,Trucks!$B$49:$B170,0)","v":42},{"$f":"MATCH(Calc2!L$112,Trucks!$B$49:$B170,0)","v":42},{"$f":"MATCH(Calc2!M$112,Trucks!$B$49:$B170,0)","v":42},{"$f":"MATCH(Calc2!N$112,Trucks!$B$49:$B170,0)","v":42},{"$f":"MATCH(Calc2!O$112,Trucks!$B$49:$B170,0)","v":42},{"$f":"MATCH(Calc2!P$112,Trucks!$B$49:$B170,0)","v":42},{"$f":"MATCH(Calc2!Q$112,Trucks!$B$49:$B170,0)","v":42},{"$f":"MATCH(Calc2!R$112,Trucks!$B$49:$B170,0)","v":42},{"$f":"MATCH(Calc2!S$112,Trucks!$B$49:$B170,0)","v":42},{"$f":"MATCH(Calc2!T$112,Trucks!$B$49:$B170,0)","v":42},{"$f":"MATCH(Calc2!U$112,Trucks!$B$49:$B170,0)","v":42},{"$f":"MATCH(Calc2!V$112,Trucks!$B$49:$B170,0)","v":42},{"$f":"MATCH(Calc2!W$112,Trucks!$B$49:$B170,0)","v":42},{"$f":"MATCH(Calc2!X$112,Trucks!$B$49:$B170,0)","v":42},{"$f":"MATCH(Calc2!Y$112,Trucks!$B$49:$B170,0)","v":42},{"$f":"MATCH(Calc2!Z$112,Trucks!$B$49:$B170,0)","v":42},{"$f":"MATCH(Calc2!AA$112,Trucks!$B$49:$B170,0)","v":42},{"$f":"MATCH(Calc2!AB$112,Trucks!$B$49:$B170,0)","v":42}]
[null,null,{"$f":"MATCH(Calc2!C$112,Trucks!$B$49:$B171,0)","v":6},{"$f":"MATCH(Calc2!D$112,Trucks!$B$49:$B171,0)","v":95},{"$f":"MATCH(Calc2!E$112,Trucks!$B$49:$B171,0)","v":103},{"$f":"MATCH(Calc2!F$112,Trucks!$B$49:$B171,0)","v":107},{"$f":"MATCH(Calc2!G$112,Trucks!$B$49:$B171,0)","v":42},{"$f":"MATCH(Calc2!H$112,Trucks!$B$49:$B171,0)","v":42},{"$f":"MATCH(Calc2!I$112,Trucks!$B$49:$B171,0)","v":42},{"$f":"MATCH(Calc2!J$112,Trucks!$B$49:$B171,0)","v":42},{"$f":"MATCH(Calc2!K$112,Trucks!$B$49:$B171,0)","v":42},{"$f":"MATCH(Calc2!L$112,Trucks!$B$49:$B171,0)","v":42},{"$f":"MATCH(Calc2!M$112,Trucks!$B$49:$B171,0)","v":42},{"$f":"MATCH(Calc2!N$112,Trucks!$B$49:$B171,0)","v":42},{"$f":"MATCH(Calc2!O$112,Trucks!$B$49:$B171,0)","v":42},{"$f":"MATCH(Calc2!P$112,Trucks!$B$49:$B171,0)","v":42},{"$f":"MATCH(Calc2!Q$112,Trucks!$B$49:$B171,0)","v":42},{"$f":"MATCH(Calc2!R$112,Trucks!$B$49:$B171,0)","v":42},{"$f":"MATCH(Calc2!S$112,Trucks!$B$49:$B171,0)","v":42},{"$f":"MATCH(Calc2!T$112,Trucks!$B$49:$B171,0)","v":42},{"$f":"MATCH(Calc2!U$112,Trucks!$B$49:$B171,0)","v":42},{"$f":"MATCH(Calc2!V$112,Trucks!$B$49:$B171,0)","v":42},{"$f":"MATCH(Calc2!W$112,Trucks!$B$49:$B171,0)","v":42},{"$f":"MATCH(Calc2!X$112,Trucks!$B$49:$B171,0)","v":42},{"$f":"MATCH(Calc2!Y$112,Trucks!$B$49:$B171,0)","v":42},{"$f":"MATCH(Calc2!Z$112,Trucks!$B$49:$B171,0)","v":42},{"$f":"MATCH(Calc2!AA$112,Trucks!$B$49:$B171,0)","v":42},{"$f":"MATCH(Calc2!AB$112,Trucks!$B$49:$B171,0)","v":42}]
[null,null,{"$f":"MATCH(Calc2!C$112,Trucks!$B$49:$B172,0)","v":6},{"$f":"MATCH(Calc2!D$112,Trucks!$B$49:$B172,0)","v":95},{"$f":"MATCH(Calc2!E$112,Trucks!$B$49:$B172,0)","v":103},{"$f":"MATCH(Calc2!F$112,Trucks!$B$49:$B172,0)","v":107},{"$f":"MATCH(Calc2!G$112,Trucks!$B$49:$B172,0)","v":42},{"$f":"MATCH(Calc2!H$112,Trucks!$B$49:$B172,0)","v":42},{"$f":"MATCH(Calc2!I$112,Trucks!$B$49:$B172,0)","v":42},{"$f":"MATCH(Calc2!J$112,Trucks!$B$49:$B172,0)","v":42},{"$f":"MATCH(Calc2!K$112,Trucks!$B$49:$B172,0)","v":42},{"$f":"MATCH(Calc2!L$112,Trucks!$B$49:$B172,0)","v":42},{"$f":"MATCH(Calc2!M$112,Trucks!$B$49:$B172,0)","v":42},{"$f":"MATCH(Calc2!N$112,Trucks!$B$49:$B172,0)","v":42},{"$f":"MATCH(Calc2!O$112,Trucks!$B$49:$B172,0)","v":42},{"$f":"MATCH(Calc2!P$112,Trucks!$B$49:$B172,0)","v":42},{"$f":"MATCH(Calc2!Q$112,Trucks!$B$49:$B172,0)","v":42},{"$f":"MATCH(Calc2!R$112,Trucks!$B$49:$B172,0)","v":42},{"$f":"MATCH(Calc2!S$112,Trucks!$B$49:$B172,0)","v":42},{"$f":"MATCH(Calc2!T$112,Trucks!$B$49:$B172,0)","v":42},{"$f":"MATCH(Calc2!U$112,Trucks!$B$49:$B172,0)","v":42},{"$f":"MATCH(Calc2!V$112,Trucks!$B$49:$B172,0)","v":42},{"$f":"MATCH(Calc2!W$112,Trucks!$B$49:$B172,0)","v":42},{"$f":"MATCH(Calc2!X$112,Trucks!$B$49:$B172,0)","v":42},{"$f":"MATCH(Calc2!Y$112,Trucks!$B$49:$B172,0)","v":42},{"$f":"MATCH(Calc2!Z$112,Trucks!$B$49:$B172,0)","v":42},{"$f":"MATCH(Calc2!AA$112,Trucks!$B$49:$B172,0)","v":42},{"$f":"MATCH(Calc2!AB$112,Trucks!$B$49:$B172,0)","v":42}]
[null,null,{"$f":"MATCH(Calc2!C$112,Trucks!$B$49:$B173,0)","v":6},{"$f":"MATCH(Calc2!D$112,Trucks!$B$49:$B173,0)","v":95},{"$f":"MATCH(Calc2!E$112,Trucks!$B$49:$B173,0)","v":103},{"$f":"MATCH(Calc2!F$112,Trucks!$B$49:$B173,0)","v":107},{"$f":"MATCH(Calc2!G$112,Trucks!$B$49:$B173,0)","v":42},{"$f":"MATCH(Calc2!H$112,Trucks!$B$49:$B173,0)","v":42},{"$f":"MATCH(Calc2!I$112,Trucks!$B$49:$B173,0)","v":42},{"$f":"MATCH(Calc2!J$112,Trucks!$B$49:$B173,0)","v":42},{"$f":"MATCH(Calc2!K$112,Trucks!$B$49:$B173,0)","v":42},{"$f":"MATCH(Calc2!L$112,Trucks!$B$49:$B173,0)","v":42},{"$f":"MATCH(Calc2!M$112,Trucks!$B$49:$B173,0)","v":42},{"$f":"MATCH(Calc2!N$112,Trucks!$B$49:$B173,0)","v":42},{"$f":"MATCH(Calc2!O$112,Trucks!$B$49:$B173,0)","v":42},{"$f":"MATCH(Calc2!P$112,Trucks!$B$49:$B173,0)","v":42},{"$f":"MATCH(Calc2!Q$112,Trucks!$B$49:$B173,0)","v":42},{"$f":"MATCH(Calc2!R$112,Trucks!$B$49:$B173,0)","v":42},{"$f":"MATCH(Calc2!S$112,Trucks!$B$49:$B173,0)","v":42},{"$f":"MATCH(Calc2!T$112,Trucks!$B$49:$B173,0)","v":42},{"$f":"MATCH(Calc2!U$112,Trucks!$B$49:$B173,0)","v":42},{"$f":"MATCH(Calc2!V$112,Trucks!$B$49:$B173,0)","v":42},{"$f":"MATCH(Calc2!W$112,Trucks!$B$49:$B173,0)","v":42},{"$f":"MATCH(Calc2!X$112,Trucks!$B$49:$B173,0)","v":42},{"$f":"MATCH(Calc2!Y$112,Trucks!$B$49:$B173,0)","v":42},{"$f":"MATCH(Calc2!Z$112,Trucks!$B$49:$B173,0)","v":42},{"$f":"MATCH(Calc2!AA$112,Trucks!$B$49:$B173,0)","v":42},{"$f":"MATCH(Calc2!AB$112,Trucks!$B$49:$B173,0)","v":42}]
[null,null,{"$f":"MATCH(Calc2!C$112,Trucks!$B$49:$B174,0)","v":6},{"$f":"MATCH(Calc2!D$112,Trucks!$B$49:$B174,0)","v":95},{"$f":"MATCH(Calc2!E$112,Trucks!$B$49:$B174,0)","v":103},{"$f":"MATCH(Calc2!F$112,Trucks!$B$49:$B174,0)","v":107},{"$f":"MATCH(Calc2!G$112,Trucks!$B$49:$B174,0)","v":42},{"$f":"MATCH(Calc2!H$112,Trucks!$B$49:$B174,0)","v":42},{"$f":"MATCH(Calc2!I$112,Trucks!$B$49:$B174,0)","v":42},{"$f":"MATCH(Calc2!J$112,Trucks!$B$49:$B174,0)","v":42},{"$f":"MATCH(Calc2!K$112,Trucks!$B$49:$B174,0)","v":42},{"$f":"MATCH(Calc2!L$112,Trucks!$B$49:$B174,0)","v":42},{"$f":"MATCH(Calc2!M$112,Trucks!$B$49:$B174,0)","v":42},{"$f":"MATCH(Calc2!N$112,Trucks!$B$49:$B174,0)","v":42},{"$f":"MATCH(Calc2!O$112,Trucks!$B$49:$B174,0)","v":42},{"$f":"MATCH(Calc2!P$112,Trucks!$B$49:$B174,0)","v":42},{"$f":"MATCH(Calc2!Q$112,Trucks!$B$49:$B174,0)","v":42},{"$f":"MATCH(Calc2!R$112,Trucks!$B$49:$B174,0)","v":42},{"$f":"MATCH(Calc2!S$112,Trucks!$B$49:$B174,0)","v":42},{"$f":"MATCH(Calc2!T$112,Trucks!$B$49:$B174,0)","v":42},{"$f":"MATCH(Calc2!U$112,Trucks!$B$49:$B174,0)","v":42},{"$f":"MATCH(Calc2!V$112,Trucks!$B$49:$B174,0)","v":42},{"$f":"MATCH(Calc2!W$112,Trucks!$B$49:$B174,0)","v":42},{"$f":"MATCH(Calc2!X$112,Trucks!$B$49:$B174,0)","v":42},{"$f":"MATCH(Calc2!Y$112,Trucks!$B$49:$B174,0)","v":42},{"$f":"MATCH(Calc2!Z$112,Trucks!$B$49:$B174,0)","v":42},{"$f":"MATCH(Calc2!AA$112,Trucks!$B$49:$B174,0)","v":42},{"$f":"MATCH(Calc2!AB$112,Trucks!$B$49:$B174,0)","v":42}]
[null,null,{"$f":"MATCH(Calc2!C$112,Trucks!$B$49:$B175,0)","v":6},{"$f":"MATCH(Calc2!D$112,Trucks!$B$49:$B175,0)","v":95},{"$f":"MATCH(Calc2!E$112,Trucks!$B$49:$B175,0)","v":103},{"$f":"MATCH(Calc2!F$112,Trucks!$B$49:$B175,0)","v":107},{"$f":"MATCH(Calc2!G$112,Trucks!$B$49:$B175,0)","v":42},{"$f":"MATCH(Calc2!H$112,Trucks!$B$49:$B175,0)","v":42},{"$f":"MATCH(Calc2!I$112,Trucks!$B$49:$B175,0)","v":42},{"$f":"MATCH(Calc2!J$112,Trucks!$B$49:$B175,0)","v":42},{"$f":"MATCH(Calc2!K$112,Trucks!$B$49:$B175,0)","v":42},{"$f":"MATCH(Calc2!L$112,Trucks!$B$49:$B175,0)","v":42},{"$f":"MATCH(Calc2!M$112,Trucks!$B$49:$B175,0)","v":42},{"$f":"MATCH(Calc2!N$112,Trucks!$B$49:$B175,0)","v":42},{"$f":"MATCH(Calc2!O$112,Trucks!$B$49:$B175,0)","v":42},{"$f":"MATCH(Calc2!P$112,Trucks!$B$49:$B175,0)","v":42},{"$f":"MATCH(Calc2!Q$112,Trucks!$B$49:$B175,0)","v":42},{"$f":"MATCH(Calc2!R$112,Trucks!$B$49:$B175,0)","v":42},{"$f":"MATCH(Calc2!S$112,Trucks!$B$49:$B175,0)","v":42},{"$f":"MATCH(Calc2!T$112,Trucks!$B$49:$B175,0)","v":42},{"$f":"MATCH(Calc2!U$112,Trucks!$B$49:$B175,0)","v":42},{"$f":"MATCH(Calc2!V$112,Trucks!$B$49:$B175,0)","v":42},{"$f":"MATCH(Calc2!W$112,Trucks!$B$49:$B175,0)","v":42},{"$f":"MATCH(Calc2!X$112,Trucks!$B$49:$B175,0)","v":42},{"$f":"MATCH(Calc2!Y$112,Trucks!$B$49:$B175,0)","v":42},{"$f":"MATCH(Calc2!Z$112,Trucks!$B$49:$B175,0)","v":42},{"$f":"MATCH(Calc2!AA$112,Trucks!$B$49:$B175,0)","v":42},{"$f":"MATCH(Calc2!AB$112,Trucks!$B$49:$B175,0)","v":42}]
[null,null,{"$f":"MATCH(Calc2!C$112,Trucks!$B$49:$B176,0)","v":6},{"$f":"MATCH(Calc2!D$112,Trucks!$B$49:$B176,0)","v":95},{"$f":"MATCH(Calc2!E$112,Trucks!$B$49:$B176,0)","v":103},{"$f":"MATCH(Calc2!F$112,Trucks!$B$49:$B176,0)","v":107},{"$f":"MATCH(Calc2!G$112,Trucks!$B$49:$B176,0)","v":42},{"$f":"MATCH(Calc2!H$112,Trucks!$B$49:$B176,0)","v":42},{"$f":"MATCH(Calc2!I$112,Trucks!$B$49:$B176,0)","v":42},{"$f":"MATCH(Calc2!J$112,Trucks!$B$49:$B176,0)","v":42},{"$f":"MATCH(Calc2!K$112,Trucks!$B$49:$B176,0)","v":42},{"$f":"MATCH(Calc2!L$112,Trucks!$B$49:$B176,0)","v":42},{"$f":"MATCH(Calc2!M$112,Trucks!$B$49:$B176,0)","v":42},{"$f":"MATCH(Calc2!N$112,Trucks!$B$49:$B176,0)","v":42},{"$f":"MATCH(Calc2!O$112,Trucks!$B$49:$B176,0)","v":42},{"$f":"MATCH(Calc2!P$112,Trucks!$B$49:$B176,0)","v":42},{"$f":"MATCH(Calc2!Q$112,Trucks!$B$49:$B176,0)","v":42},{"$f":"MATCH(Calc2!R$112,Trucks!$B$49:$B176,0)","v":42},{"$f":"MATCH(Calc2!S$112,Trucks!$B$49:$B176,0)","v":42},{"$f":"MATCH(Calc2!T$112,Trucks!$B$49:$B176,0)","v":42},{"$f":"MATCH(Calc2!U$112,Trucks!$B$49:$B176,0)","v":42},{"$f":"MATCH(Calc2!V$112,Trucks!$B$49:$B176,0)","v":42},{"$f":"MATCH(Calc2!W$112,Trucks!$B$49:$B176,0)","v":42},{"$f":"MATCH(Calc2!X$112,Trucks!$B$49:$B176,0)","v":42},{"$f":"MATCH(Calc2!Y$112,Trucks!$B$49:$B176,0)","v":42},{"$f":"MATCH(Calc2!Z$112,Trucks!$B$49:$B176,0)","v":42},{"$f":"MATCH(Calc2!AA$112,Trucks!$B$49:$B176,0)","v":42},{"$f":"MATCH(Calc2!AB$112,Trucks!$B$49:$B176,0)","v":42}]
[null,null,{"$f":"MATCH(Calc2!C$112,Trucks!$B$49:$B177,0)","v":6},{"$f":"MATCH(Calc2!D$112,Trucks!$B$49:$B177,0)","v":95},{"$f":"MATCH(Calc2!E$112,Trucks!$B$49:$B177,0)","v":103},{"$f":"MATCH(Calc2!F$112,Trucks!$B$49:$B177,0)","v":107},{"$f":"MATCH(Calc2!G$112,Trucks!$B$49:$B177,0)","v":42},{"$f":"MATCH(Calc2!H$112,Trucks!$B$49:$B177,0)","v":42},{"$f":"MATCH(Calc2!I$112,Trucks!$B$49:$B177,0)","v":42},{"$f":"MATCH(Calc2!J$112,Trucks!$B$49:$B177,0)","v":42},{"$f":"MATCH(Calc2!K$112,Trucks!$B$49:$B177,0)","v":42},{"$f":"MATCH(Calc2!L$112,Trucks!$B$49:$B177,0)","v":42},{"$f":"MATCH(Calc2!M$112,Trucks!$B$49:$B177,0)","v":42},{"$f":"MATCH(Calc2!N$112,Trucks!$B$49:$B177,0)","v":42},{"$f":"MATCH(Calc2!O$112,Trucks!$B$49:$B177,0)","v":42},{"$f":"MATCH(Calc2!P$112,Trucks!$B$49:$B177,0)","v":42},{"$f":"MATCH(Calc2!Q$112,Trucks!$B$49:$B177,0)","v":42},{"$f":"MATCH(Calc2!R$112,Trucks!$B$49:$B177,0)","v":42},{"$f":"MATCH(Calc2!S$112,Trucks!$B$49:$B177,0)","v":42},{"$f":"MATCH(Calc2!T$112,Trucks!$B$49:$B177,0)","v":42},{"$f":"MATCH(Calc2!U$112,Trucks!$B$49:$B177,0)","v":42},{"$f":"MATCH(Calc2!V$112,Trucks!$B$49:$B177,0)","v":42},{"$f":"MATCH(Calc2!W$112,Trucks!$B$49:$B177,0)","v":42},{"$f":"MATCH(Calc2!X$112,Trucks!$B$49:$B177,0)","v":42},{"$f":"MATCH(Calc2!Y$112,Trucks!$B$49:$B177,0)","v":42},{"$f":"MATCH(Calc2!Z$112,Trucks!$B$49:$B177,0)","v":42},{"$f":"MATCH(Calc2!AA$112,Trucks!$B$49:$B177,0)","v":42},{"$f":"MATCH(Calc2!AB$112,Trucks!$B$49:$B177,0)","v":42}]
[null,null,{"$f":"MATCH(Calc2!C$112,Trucks!$B$49:$B179,0)","v":6},{"$f":"MATCH(Calc2!D$112,Trucks!$B$49:$B179,0)","v":95},{"$f":"MATCH(Calc2!E$112,Trucks!$B$49:$B179,0)","v":103},{"$f":"MATCH(Calc2!F$112,Trucks!$B$49:$B179,0)","v":107},{"$f":"MATCH(Calc2!G$112,Trucks!$B$49:$B179,0)","v":42},{"$f":"MATCH(Calc2!H$112,Trucks!$B$49:$B179,0)","v":42},{"$f":"MATCH(Calc2!I$112,Trucks!$B$49:$B179,0)","v":42},{"$f":"MATCH(Calc2!J$112,Trucks!$B$49:$B179,0)","v":42},{"$f":"MATCH(Calc2!K$112,Trucks!$B$49:$B179,0)","v":42},{"$f":"MATCH(Calc2!L$112,Trucks!$B$49:$B179,0)","v":42},{"$f":"MATCH(Calc2!M$112,Trucks!$B$49:$B179,0)","v":42},{"$f":"MATCH(Calc2!N$112,Trucks!$B$49:$B179,0)","v":42},{"$f":"MATCH(Calc2!O$112,Trucks!$B$49:$B179,0)","v":42},{"$f":"MATCH(Calc2!P$112,Trucks!$B$49:$B179,0)","v":42},{"$f":"MATCH(Calc2!Q$112,Trucks!$B$49:$B179,0)","v":42},{"$f":"MATCH(Calc2!R$112,Trucks!$B$49:$B179,0)","v":42},{"$f":"MATCH(Calc2!S$112,Trucks!$B$49:$B179,0)","v":42},{"$f":"MATCH(Calc2!T$112,Trucks!$B$49:$B179,0)","v":42},{"$f":"MATCH(Calc2!U$112,Trucks!$B$49:$B179,0)","v":42},{"$f":"MATCH(Calc2!V$112,Trucks!$B$49:$B179,0)","v":42},{"$f":"MATCH(Calc2!W$112,Trucks!$B$49:$B179,0)","v":42},{"$f":"MATCH(Calc2!X$112,Trucks!$B$49:$B179,0)","v":42},{"$f":"MATCH(Calc2!Y$112,Trucks!$B$49:$B179,0)","v":42},{"$f":"MATCH(Calc2!Z$112,Trucks!$B$49:$B179,0)","v":42},{"$f":"MATCH(Calc2!AA$112,Trucks!$B$49:$B179,0)","v":42},{"$f":"MATCH(Calc2!AB$112,Trucks!$B$49:$B179,0)","v":42}]
[null,null,{"$f":"MATCH(Calc2!C$112,Trucks!$B$49:$B180,0)","v":6},{"$f":"MATCH(Calc2!D$112,Trucks!$B$49:$B180,0)","v":95},{"$f":"MATCH(Calc2!E$112,Trucks!$B$49:$B180,0)","v":103},{"$f":"MATCH(Calc2!F$112,Trucks!$B$49:$B180,0)","v":107},{"$f":"MATCH(Calc2!G$112,Trucks!$B$49:$B180,0)","v":42},{"$f":"MATCH(Calc2!H$112,Trucks!$B$49:$B180,0)","v":42},{"$f":"MATCH(Calc2!I$112,Trucks!$B$49:$B180,0)","v":42},{"$f":"MATCH(Calc2!J$112,Trucks!$B$49:$B180,0)","v":42},{"$f":"MATCH(Calc2!K$112,Trucks!$B$49:$B180,0)","v":42},{"$f":"MATCH(Calc2!L$112,Trucks!$B$49:$B180,0)","v":42},{"$f":"MATCH(Calc2!M$112,Trucks!$B$49:$B180,0)","v":42},{"$f":"MATCH(Calc2!N$112,Trucks!$B$49:$B180,0)","v":42},{"$f":"MATCH(Calc2!O$112,Trucks!$B$49:$B180,0)","v":42},{"$f":"MATCH(Calc2!P$112,Trucks!$B$49:$B180,0)","v":42},{"$f":"MATCH(Calc2!Q$112,Trucks!$B$49:$B180,0)","v":42},{"$f":"MATCH(Calc2!R$112,Trucks!$B$49:$B180,0)","v":42},{"$f":"MATCH(Calc2!S$112,Trucks!$B$49:$B180,0)","v":42},{"$f":"MATCH(Calc2!T$112,Trucks!$B$49:$B180,0)","v":42},{"$f":"MATCH(Calc2!U$112,Trucks!$B$49:$B180,0)","v":42},{"$f":"MATCH(Calc2!V$112,Trucks!$B$49:$B180,0)","v":42},{"$f":"MATCH(Calc2!W$112,Trucks!$B$49:$B180,0)","v":42},{"$f":"MATCH(Calc2!X$112,Trucks!$B$49:$B180,0)","v":42},{"$f":"MATCH(Calc2!Y$112,Trucks!$B$49:$B180,0)","v":42},{"$f":"MATCH(Calc2!Z$112,Trucks!$B$49:$B180,0)","v":42},{"$f":"MATCH(Calc2!AA$112,Trucks!$B$49:$B180,0)","v":42},{"$f":"MATCH(Calc2!AB$112,Trucks!$B$49:$B180,0)","v":42}]
[null,null,{"$f":"MATCH(Calc2!C$112,Trucks!$B$49:$B181,0)","v":6},{"$f":"MATCH(Calc2!D$112,Trucks!$B$49:$B181,0)","v":95},{"$f":"MATCH(Calc2!E$112,Trucks!$B$49:$B181,0)","v":103},{"$f":"MATCH(Calc2!F$112,Trucks!$B$49:$B181,0)","v":107},{"$f":"MATCH(Calc2!G$112,Trucks!$B$49:$B181,0)","v":42},{"$f":"MATCH(Calc2!H$112,Trucks!$B$49:$B181,0)","v":42},{"$f":"MATCH(Calc2!I$112,Trucks!$B$49:$B181,0)","v":42},{"$f":"MATCH(Calc2!J$112,Trucks!$B$49:$B181,0)","v":42},{"$f":"MATCH(Calc2!K$112,Trucks!$B$49:$B181,0)","v":42},{"$f":"MATCH(Calc2!L$112,Trucks!$B$49:$B181,0)","v":42},{"$f":"MATCH(Calc2!M$112,Trucks!$B$49:$B181,0)","v":42},{"$f":"MATCH(Calc2!N$112,Trucks!$B$49:$B181,0)","v":42},{"$f":"MATCH(Calc2!O$112,Trucks!$B$49:$B181,0)","v":42},{"$f":"MATCH(Calc2!P$112,Trucks!$B$49:$B181,0)","v":42},{"$f":"MATCH(Calc2!Q$112,Trucks!$B$49:$B181,0)","v":42},{"$f":"MATCH(Calc2!R$112,Trucks!$B$49:$B181,0)","v":42},{"$f":"MATCH(Calc2!S$112,Trucks!$B$49:$B181,0)","v":42},{"$f":"MATCH(Calc2!T$112,Trucks!$B$49:$B181,0)","v":42},{"$f":"MATCH(Calc2!U$112,Trucks!$B$49:$B181,0)","v":42},{"$f":"MATCH(Calc2!V$112,Trucks!$B$49:$B181,0)","v":42},{"$f":"MATCH(Calc2!W$112,Trucks!$B$49:$B181,0)","v":42},{"$f":"MATCH(Calc2!X$112,Trucks!$B$49:$B181,0)","v":42},{"$f":"MATCH(Calc2!Y$112,Trucks!$B$49:$B181,0)","v":42},{"$f":"MATCH(Calc2!Z$112,Trucks!$B$49:$B181,0)","v":42},{"$f":"MATCH(Calc2!AA$112,Trucks!$B$49:$B181,0)","v":42},{"$f":"MATCH(Calc2!AB$112,Trucks!$B$49:$B181,0)","v":42}]
[null,null,{"$f":"MATCH(Calc2!C$112,Trucks!$B$49:$B182,0)","v":6},{"$f":"MATCH(Calc2!D$112,Trucks!$B$49:$B182,0)","v":95},{"$f":"MATCH(Calc2!E$112,Trucks!$B$49:$B182,0)","v":103},{"$f":"MATCH(Calc2!F$112,Trucks!$B$49:$B182,0)","v":107},{"$f":"MATCH(Calc2!G$112,Trucks!$B$49:$B182,0)","v":42},{"$f":"MATCH(Calc2!H$112,Trucks!$B$49:$B182,0)","v":42},{"$f":"MATCH(Calc2!I$112,Trucks!$B$49:$B182,0)","v":42},{"$f":"MATCH(Calc2!J$112,Trucks!$B$49:$B182,0)","v":42},{"$f":"MATCH(Calc2!K$112,Trucks!$B$49:$B182,0)","v":42},{"$f":"MATCH(Calc2!L$112,Trucks!$B$49:$B182,0)","v":42},{"$f":"MATCH(Calc2!M$112,Trucks!$B$49:$B182,0)","v":42},{"$f":"MATCH(Calc2!N$112,Trucks!$B$49:$B182,0)","v":42},{"$f":"MATCH(Calc2!O$112,Trucks!$B$49:$B182,0)","v":42},{"$f":"MATCH(Calc2!P$112,Trucks!$B$49:$B182,0)","v":42},{"$f":"MATCH(Calc2!Q$112,Trucks!$B$49:$B182,0)","v":42},{"$f":"MATCH(Calc2!R$112,Trucks!$B$49:$B182,0)","v":42},{"$f":"MATCH(Calc2!S$112,Trucks!$B$49:$B182,0)","v":42},{"$f":"MATCH(Calc2!T$112,Trucks!$B$49:$B182,0)","v":42},{"$f":"MATCH(Calc2!U$112,Trucks!$B$49:$B182,0)","v":42},{"$f":"MATCH(Calc2!V$112,Trucks!$B$49:$B182,0)","v":42},{"$f":"MATCH(Calc2!W$112,Trucks!$B$49:$B182,0)","v":42},{"$f":"MATCH(Calc2!X$112,Trucks!$B$49:$B182,0)","v":42},{"$f":"MATCH(Calc2!Y$112,Trucks!$B$49:$B182,0)","v":42},{"$f":"MATCH(Calc2!Z$112,Trucks!$B$49:$B182,0)","v":42},{"$f":"MATCH(Calc2!AA$112,Trucks!$B$49:$B182,0)","v":42},{"$f":"MATCH(Calc2!AB$112,Trucks!$B$49:$B182,0)","v":42}]
[null,null,{"$f":"MATCH(Calc2!C$112,Trucks!$B$49:$B183,0)","v":6},{"$f":"MATCH(Calc2!D$112,Trucks!$B$49:$B183,0)","v":95},{"$f":"MATCH(Calc2!E$112,Trucks!$B$49:$B183,0)","v":103},{"$f":"MATCH(Calc2!F$112,Trucks!$B$49:$B183,0)","v":107},{"$f":"MATCH(Calc2!G$112,Trucks!$B$49:$B183,0)","v":42},{"$f":"MATCH(Calc2!H$112,Trucks!$B$49:$B183,0)","v":42},{"$f":"MATCH(Calc2!I$112,Trucks!$B$49:$B183,0)","v":42},{"$f":"MATCH(Calc2!J$112,Trucks!$B$49:$B183,0)","v":42},{"$f":"MATCH(Calc2!K$112,Trucks!$B$49:$B183,0)","v":42},{"$f":"MATCH(Calc2!L$112,Trucks!$B$49:$B183,0)","v":42},{"$f":"MATCH(Calc2!M$112,Trucks!$B$49:$B183,0)","v":42},{"$f":"MATCH(Calc2!N$112,Trucks!$B$49:$B183,0)","v":42},{"$f":"MATCH(Calc2!O$112,Trucks!$B$49:$B183,0)","v":42},{"$f":"MATCH(Calc2!P$112,Trucks!$B$49:$B183,0)","v":42},{"$f":"MATCH(Calc2!Q$112,Trucks!$B$49:$B183,0)","v":42},{"$f":"MATCH(Calc2!R$112,Trucks!$B$49:$B183,0)","v":42},{"$f":"MATCH(Calc2!S$112,Trucks!$B$49:$B183,0)","v":42},{"$f":"MATCH(Calc2!T$112,Trucks!$B$49:$B183,0)","v":42},{"$f":"MATCH(Calc2!U$112,Trucks!$B$49:$B183,0)","v":42},{"$f":"MATCH(Calc2!V$112,Trucks!$B$49:$B183,0)","v":42},{"$f":"MATCH(Calc2!W$112,Trucks!$B$49:$B183,0)","v":42},{"$f":"MATCH(Calc2!X$112,Trucks!$B$49:$B183,0)","v":42},{"$f":"MATCH(Calc2!Y$112,Trucks!$B$49:$B183,0)","v":42},{"$f":"MATCH(Calc2!Z$112,Trucks!$B$49:$B183,0)","v":42},{"$f":"MATCH(Calc2!AA$112,Trucks!$B$49:$B183,0)","v":42},{"$f":"MATCH(Calc2!AB$112,Trucks!$B$49:$B183,0)","v":42}]
[null,null,{"$f":"MATCH(Calc2!C$112,Trucks!$B$49:$B184,0)","v":6},{"$f":"MATCH(Calc2!D$112,Trucks!$B$49:$B184,0)","v":95},{"$f":"MATCH(Calc2!E$112,Trucks!$B$49:$B184,0)","v":103},{"$f":"MATCH(Calc2!F$112,Trucks!$B$49:$B184,0)","v":107},{"$f":"MATCH(Calc2!G$112,Trucks!$B$49:$B184,0)","v":42},{"$f":"MATCH(Calc2!H$112,Trucks!$B$49:$B184,0)","v":42},{"$f":"MATCH(Calc2!I$112,Trucks!$B$49:$B184,0)","v":42},{"$f":"MATCH(Calc2!J$112,Trucks!$B$49:$B184,0)","v":42},{"$f":"MATCH(Calc2!K$112,Trucks!$B$49:$B184,0)","v":42},{"$f":"MATCH(Calc2!L$112,Trucks!$B$49:$B184,0)","v":42},{"$f":"MATCH(Calc2!M$112,Trucks!$B$49:$B184,0)","v":42},{"$f":"MATCH(Calc2!N$112,Trucks!$B$49:$B184,0)","v":42},{"$f":"MATCH(Calc2!O$112,Trucks!$B$49:$B184,0)","v":42},{"$f":"MATCH(Calc2!P$112,Trucks!$B$49:$B184,0)","v":42},{"$f":"MATCH(Calc2!Q$112,Trucks!$B$49:$B184,0)","v":42},{"$f":"MATCH(Calc2!R$112,Trucks!$B$49:$B184,0)","v":42},{"$f":"MATCH(Calc2!S$112,Trucks!$B$49:$B184,0)","v":42},{"$f":"MATCH(Calc2!T$112,Trucks!$B$49:$B184,0)","v":42},{"$f":"MATCH(Calc2!U$112,Trucks!$B$49:$B184,0)","v":42},{"$f":"MATCH(Calc2!V$112,Trucks!$B$49:$B184,0)","v":42},{"$f":"MATCH(Calc2!W$112,Trucks!$B$49:$B184,0)","v":42},{"$f":"MATCH(Calc2!X$112,Trucks!$B$49:$B184,0)","v":42},{"$f":"MATCH(Calc2!Y$112,Trucks!$B$49:$B184,0)","v":42},{"$f":"MATCH(Calc2!Z$112,Trucks!$B$49:$B184,0)","v":42},{"$f":"MATCH(Calc2!AA$112,Trucks!$B$49:$B184,0)","v":42},{"$f":"MATCH(Calc2!AB$112,Trucks!$B$49:$B184,0)","v":42}]
[null,null,{"$f":"MATCH(Calc2!C$112,Trucks!$B$49:$B185,0)","v":6},{"$f":"MATCH(Calc2!D$112,Trucks!$B$49:$B185,0)","v":95},{"$f":"MATCH(Calc2!E$112,Trucks!$B$49:$B185,0)","v":103},{"$f":"MATCH(Calc2!F$112,Trucks!$B$49:$B185,0)","v":107},{"$f":"MATCH(Calc2!G$112,Trucks!$B$49:$B185,0)","v":42},{"$f":"MATCH(Calc2!H$112,Trucks!$B$49:$B185,0)","v":42},{"$f":"MATCH(Calc2!I$112,Trucks!$B$49:$B185,0)","v":42},{"$f":"MATCH(Calc2!J$112,Trucks!$B$49:$B185,0)","v":42},{"$f":"MATCH(Calc2!K$112,Trucks!$B$49:$B185,0)","v":42},{"$f":"MATCH(Calc2!L$112,Trucks!$B$49:$B185,0)","v":42},{"$f":"MATCH(Calc2!M$112,Trucks!$B$49:$B185,0)","v":42},{"$f":"MATCH(Calc2!N$112,Trucks!$B$49:$B185,0)","v":42},{"$f":"MATCH(Calc2!O$112,Trucks!$B$49:$B185,0)","v":42},{"$f":"MATCH(Calc2!P$112,Trucks!$B$49:$B185,0)","v":42},{"$f":"MATCH(Calc2!Q$112,Trucks!$B$49:$B185,0)","v":42},{"$f":"MATCH(Calc2!R$112,Trucks!$B$49:$B185,0)","v":42},{"$f":"MATCH(Calc2!S$112,Trucks!$B$49:$B185,0)","v":42},{"$f":"MATCH(Calc2!T$112,Trucks!$B$49:$B185,0)","v":42},{"$f":"MATCH(Calc2!U$112,Trucks!$B$49:$B185,0)","v":42},{"$f":"MATCH(Calc2!V$112,Trucks!$B$49:$B185,0)","v":42},{"$f":"MATCH(Calc2!W$112,Trucks!$B$49:$B185,0)","v":42},{"$f":"MATCH(Calc2!X$112,Trucks!$B$49:$B185,0)","v":42},{"$f":"MATCH(Calc2!Y$112,Trucks!$B$49:$B185,0)","v":42},{"$f":"MATCH(Calc2!Z$112,Trucks!$B$49:$B185,0)","v":42},{"$f":"MATCH(Calc2!AA$112,Trucks!$B$49:$B185,0)","v":42},{"$f":"MATCH(Calc2!AB$112,Trucks!$B$49:$B185,0)","v":42}]
[null,null,{"$f":"MATCH(Calc2!C$112,Trucks!$B$49:$B186,0)","v":6},{"$f":"MATCH(Calc2!D$112,Trucks!$B$49:$B186,0)","v":95},{"$f":"MATCH(Calc2!E$112,Trucks!$B$49:$B186,0)","v":103},{"$f":"MATCH(Calc2!F$112,Trucks!$B$49:$B186,0)","v":107},{"$f":"MATCH(Calc2!G$112,Trucks!$B$49:$B186,0)","v":42},{"$f":"MATCH(Calc2!H$112,Trucks!$B$49:$B186,0)","v":42},{"$f":"MATCH(Calc2!I$112,Trucks!$B$49:$B186,0)","v":42},{"$f":"MATCH(Calc2!J$112,Trucks!$B$49:$B186,0)","v":42},{"$f":"MATCH(Calc2!K$112,Trucks!$B$49:$B186,0)","v":42},{"$f":"MATCH(Calc2!L$112,Trucks!$B$49:$B186,0)","v":42},{"$f":"MATCH(Calc2!M$112,Trucks!$B$49:$B186,0)","v":42},{"$f":"MATCH(Calc2!N$112,Trucks!$B$49:$B186,0)","v":42},{"$f":"MATCH(Calc2!O$112,Trucks!$B$49:$B186,0)","v":42},{"$f":"MATCH(Calc2!P$112,Trucks!$B$49:$B186,0)","v":42},{"$f":"MATCH(Calc2!Q$112,Trucks!$B$49:$B186,0)","v":42},{"$f":"MATCH(Calc2!R$112,Trucks!$B$49:$B186,0)","v":42},{"$f":"MATCH(Calc2!S$112,Trucks!$B$49:$B186,0)","v":42},{"$f":"MATCH(Calc2!T$112,Trucks!$B$49:$B186,0)","v":42},{"$f":"MATCH(Calc2!U$112,Trucks!$B$49:$B186,0)","v":42},{"$f":"MATCH(Calc2!V$112,Trucks!$B$49:$B186,0)","v":42},{"$f":"MATCH(Calc2!W$112,Trucks!$B$49:$B186,0)","v":42},{"$f":"MATCH(Calc2!X$112,Trucks!$B$49:$B186,0)","v":42},{"$f":"MATCH(Calc2!Y$112,Trucks!$B$49:$B186,0)","v":42},{"$f":"MATCH(Calc2!Z$112,Trucks!$B$49:$B186,0)","v":42},{"$f":"MATCH(Calc2!AA$112,Trucks!$B$49:$B186,0)","v":42},{"$f":"MATCH(Calc2!AB$112,Trucks!$B$49:$B186,0)","v":42}]
[null,null,{"$f":"MATCH(Calc2!C$112,Trucks!$B$49:$B187,0)","v":6},{"$f":"MATCH(Calc2!D$112,Trucks!$B$49:$B187,0)","v":95},{"$f":"MATCH(Calc2!E$112,Trucks!$B$49:$B187,0)","v":103},{"$f":"MATCH(Calc2!F$112,Trucks!$B$49:$B187,0)","v":107},{"$f":"MATCH(Calc2!G$112,Trucks!$B$49:$B187,0)","v":42},{"$f":"MATCH(Calc2!H$112,Trucks!$B$49:$B187,0)","v":42},{"$f":"MATCH(Calc2!I$112,Trucks!$B$49:$B187,0)","v":42},{"$f":"MATCH(Calc2!J$112,Trucks!$B$49:$B187,0)","v":42},{"$f":"MATCH(Calc2!K$112,Trucks!$B$49:$B187,0)","v":42},{"$f":"MATCH(Calc2!L$112,Trucks!$B$49:$B187,0)","v":42},{"$f":"MATCH(Calc2!M$112,Trucks!$B$49:$B187,0)","v":42},{"$f":"MATCH(Calc2!N$112,Trucks!$B$49:$B187,0)","v":42},{"$f":"MATCH(Calc2!O$112,Trucks!$B$49:$B187,0)","v":42},{"$f":"MATCH(Calc2!P$112,Trucks!$B$49:$B187,0)","v":42},{"$f":"MATCH(Calc2!Q$112,Trucks!$B$49:$B187,0)","v":42},{"$f":"MATCH(Calc2!R$112,Trucks!$B$49:$B187,0)","v":42},{"$f":"MATCH(Calc2!S$112,Trucks!$B$49:$B187,0)","v":42},{"$f":"MATCH(Calc2!T$112,Trucks!$B$49:$B187,0)","v":42},{"$f":"MATCH(Calc2!U$112,Trucks!$B$49:$B187,0)","v":42},{"$f":"MATCH(Calc2!V$112,Trucks!$B$49:$B187,0)","v":42},{"$f":"MATCH(Calc2!W$112,Trucks!$B$49:$B187,0)","v":42},{"$f":"MATCH(Calc2!X$112,Trucks!$B$49:$B187,0)","v":42},{"$f":"MATCH(Calc2!Y$112,Trucks!$B$49:$B187,0)","v":42},{"$f":"MATCH(Calc2!Z$112,Trucks!$B$49:$B187,0)","v":42},{"$f":"MATCH(Calc2!AA$112,Trucks!$B$49:$B187,0)","v":42},{"$f":"MATCH(Calc2!AB$112,Trucks!$B$49:$B187,0)","v":42}]
[null,null,{"$f":"MATCH(Calc2!C$112,Trucks!$B$49:$B188,0)","v":6},{"$f":"MATCH(Calc2!D$112,Trucks!$B$49:$B188,0)","v":95},{"$f":"MATCH(Calc2!E$112,Trucks!$B$49:$B188,0)","v":103},{"$f":"MATCH(Calc2!F$112,Trucks!$B$49:$B188,0)","v":107},{"$f":"MATCH(Calc2!G$112,Trucks!$B$49:$B188,0)","v":42},{"$f":"MATCH(Calc2!H$112,Trucks!$B$49:$B188,0)","v":42},{"$f":"MATCH(Calc2!I$112,Trucks!$B$49:$B188,0)","v":42},{"$f":"MATCH(Calc2!J$112,Trucks!$B$49:$B188,0)","v":42},{"$f":"MATCH(Calc2!K$112,Trucks!$B$49:$B188,0)","v":42},{"$f":"MATCH(Calc2!L$112,Trucks!$B$49:$B188,0)","v":42},{"$f":"MATCH(Calc2!M$112,Trucks!$B$49:$B188,0)","v":42},{"$f":"MATCH(Calc2!N$112,Trucks!$B$49:$B188,0)","v":42},{"$f":"MATCH(Calc2!O$112,Trucks!$B$49:$B188,0)","v":42},{"$f":"MATCH(Calc2!P$112,Trucks!$B$49:$B188,0)","v":42},{"$f":"MATCH(Calc2!Q$112,Trucks!$B$49:$B188,0)","v":42},{"$f":"MATCH(Calc2!R$112,Trucks!$B$49:$B188,0)","v":42},{"$f":"MATCH(Calc2!S$112,Trucks!$B$49:$B188,0)","v":42},{"$f":"MATCH(Calc2!T$112,Trucks!$B$49:$B188,0)","v":42},{"$f":"MATCH(Calc2!U$112,Trucks!$B$49:$B188,0)","v":42},{"$f":"MATCH(Calc2!V$112,Trucks!$B$49:$B188,0)","v":42},{"$f":"MATCH(Calc2!W$112,Trucks!$B$49:$B188,0)","v":42},{"$f":"MATCH(Calc2!X$112,Trucks!$B$49:$B188,0)","v":42},{"$f":"MATCH(Calc2!Y$112,Trucks!$B$49:$B188,0)","v":42},{"$f":"MATCH(Calc2!Z$112,Trucks!$B$49:$B188,0)","v":42},{"$f":"MATCH(Calc2!AA$112,Trucks!$B$49:$B188,0)","v":42},{"$f":"MATCH(Calc2!AB$112,Trucks!$B$49:$B188,0)","v":42}]
[null,null,{"$f":"MATCH(Calc2!C$112,Trucks!$B$49:$B189,0)","v":6},{"$f":"MATCH(Calc2!D$112,Trucks!$B$49:$B189,0)","v":95},{"$f":"MATCH(Calc2!E$112,Trucks!$B$49:$B189,0)","v":103},{"$f":"MATCH(Calc2!F$112,Trucks!$B$49:$B189,0)","v":107},{"$f":"MATCH(Calc2!G$112,Trucks!$B$49:$B189,0)","v":42},{"$f":"MATCH(Calc2!H$112,Trucks!$B$49:$B189,0)","v":42},{"$f":"MATCH(Calc2!I$112,Trucks!$B$49:$B189,0)","v":42},{"$f":"MATCH(Calc2!J$112,Trucks!$B$49:$B189,0)","v":42},{"$f":"MATCH(Calc2!K$112,Trucks!$B$49:$B189,0)","v":42},{"$f":"MATCH(Calc2!L$112,Trucks!$B$49:$B189,0)","v":42},{"$f":"MATCH(Calc2!M$112,Trucks!$B$49:$B189,0)","v":42},{"$f":"MATCH(Calc2!N$112,Trucks!$B$49:$B189,0)","v":42},{"$f":"MATCH(Calc2!O$112,Trucks!$B$49:$B189,0)","v":42},{"$f":"MATCH(Calc2!P$112,Trucks!$B$49:$B189,0)","v":42},{"$f":"MATCH(Calc2!Q$112,Trucks!$B$49:$B189,0)","v":42},{"$f":"MATCH(Calc2!R$112,Trucks!$B$49:$B189,0)","v":42},{"$f":"MATCH(Calc2!S$112,Trucks!$B$49:$B189,0)","v":42},{"$f":"MATCH(Calc2!T$112,Trucks!$B$49:$B189,0)","v":42},{"$f":"MATCH(Calc2!U$112,Trucks!$B$49:$B189,0)","v":42},{"$f":"MATCH(Calc2!V$112,Trucks!$B$49:$B189,0)","v":42},{"$f":"MATCH(Calc2!W$112,Trucks!$B$49:$B189,0)","v":42},{"$f":"MATCH(Calc2!X$112,Trucks!$B$49:$B189,0)","v":42},{"$f":"MATCH(Calc2!Y$112,Trucks!$B$49:$B189,0)","v":42},{"$f":"MATCH(Calc2!Z$112,Trucks!$B$49:$B189,0)","v":42},{"$f":"MATCH(Calc2!AA$112,Trucks!$B$49:$B189,0)","v":42},{"$f":"MATCH(Calc2!AB$112,Trucks!$B$49:$B189,0)","v":42}]
[null,null,{"$f":"MATCH(Calc2!C$112,Trucks!$B$49:$B190,0)","v":6},{"$f":"MATCH(Calc2!D$112,Trucks!$B$49:$B190,0)","v":95},{"$f":"MATCH(Calc2!E$112,Trucks!$B$49:$B190,0)","v":103},{"$f":"MATCH(Calc2!F$112,Trucks!$B$49:$B190,0)","v":107},{"$f":"MATCH(Calc2!G$112,Trucks!$B$49:$B190,0)","v":42},{"$f":"MATCH(Calc2!H$112,Trucks!$B$49:$B190,0)","v":42},{"$f":"MATCH(Calc2!I$112,Trucks!$B$49:$B190,0)","v":42},{"$f":"MATCH(Calc2!J$112,Trucks!$B$49:$B190,0)","v":42},{"$f":"MATCH(Calc2!K$112,Trucks!$B$49:$B190,0)","v":42},{"$f":"MATCH(Calc2!L$112,Trucks!$B$49:$B190,0)","v":42},{"$f":"MATCH(Calc2!M$112,Trucks!$B$49:$B190,0)","v":42},{"$f":"MATCH(Calc2!N$112,Trucks!$B$49:$B190,0)","v":42},{"$f":"MATCH(Calc2!O$112,Trucks!$B$49:$B190,0)","v":42},{"$f":"MATCH(Calc2!P$112,Trucks!$B$49:$B190,0)","v":42},{"$f":"MATCH(Calc2!Q$112,Trucks!$B$49:$B190,0)","v":42},{"$f":"MATCH(Calc2!R$112,Trucks!$B$49:$B190,0)","v":42},{"$f":"MATCH(Calc2!S$112,Trucks!$B$49:$B190,0)","v":42},{"$f":"MATCH(Calc2!T$112,Trucks!$B$49:$B190,0)","v":42},{"$f":"MATCH(Calc2!U$112,Trucks!$B$49:$B190,0)","v":42},{"$f":"MATCH(Calc2!V$112,Trucks!$B$49:$B190,0)","v":42},{"$f":"MATCH(Calc2!W$112,Trucks!$B$49:$B190,0)","v":42},{"$f":"MATCH(Calc2!X$112,Trucks!$B$49:$B190,0)","v":42},{"$f":"MATCH(Calc2!Y$112,Trucks!$B$49:$B190,0)","v":42},{"$f":"MATCH(Calc2!Z$112,Trucks!$B$49:$B190,0)","v":42},{"$f":"MATCH(Calc2!AA$112,Trucks!$B$49:$B190,0)","v":42},{"$f":"MATCH(Calc2!AB$112,Trucks!$B$49:$B190,0)","v":42}]
[null,null,{"$f":"MATCH(Calc2!C$112,Trucks!$B$49:$B191,0)","v":6},{"$f":"MATCH(Calc2!D$112,Trucks!$B$49:$B191,0)","v":95},{"$f":"MATCH(Calc2!E$112,Trucks!$B$49:$B191,0)","v":103},{"$f":"MATCH(Calc2!F$112,Trucks!$B$49:$B191,0)","v":107},{"$f":"MATCH(Calc2!G$112,Trucks!$B$49:$B191,0)","v":42},{"$f":"MATCH(Calc2!H$112,Trucks!$B$49:$B191,0)","v":42},{"$f":"MATCH(Calc2!I$112,Trucks!$B$49:$B191,0)","v":42},{"$f":"MATCH(Calc2!J$112,Trucks!$B$49:$B191,0)","v":42},{"$f":"MATCH(Calc2!K$112,Trucks!$B$49:$B191,0)","v":42},{"$f":"MATCH(Calc2!L$112,Trucks!$B$49:$B191,0)","v":42},{"$f":"MATCH(Calc2!M$112,Trucks!$B$49:$B191,0)","v":42},{"$f":"MATCH(Calc2!N$112,Trucks!$B$49:$B191,0)","v":42},{"$f":"MATCH(Calc2!O$112,Trucks!$B$49:$B191,0)","v":42},{"$f":"MATCH(Calc2!P$112,Trucks!$B$49:$B191,0)","v":42},{"$f":"MATCH(Calc2!Q$112,Trucks!$B$49:$B191,0)","v":42},{"$f":"MATCH(Calc2!R$112,Trucks!$B$49:$B191,0)","v":42},{"$f":"MATCH(Calc2!S$112,Trucks!$B$49:$B191,0)","v":42},{"$f":"MATCH(Calc2!T$112,Trucks!$B$49:$B191,0)","v":42},{"$f":"MATCH(Calc2!U$112,Trucks!$B$49:$B191,0)","v":42},{"$f":"MATCH(Calc2!V$112,Trucks!$B$49:$B191,0)","v":42},{"$f":"MATCH(Calc2!W$112,Trucks!$B$49:$B191,0)","v":42},{"$f":"MATCH(Calc2!X$112,Trucks!$B$49:$B191,0)","v":42},{"$f":"MATCH(Calc2!Y$112,Trucks!$B$49:$B191,0)","v":42},{"$f":"MATCH(Calc2!Z$112,Trucks!$B$49:$B191,0)","v":42},{"$f":"MATCH(Calc2!AA$112,Trucks!$B$49:$B191,0)","v":42},{"$f":"MATCH(Calc2!AB$112,Trucks!$B$49:$B191,0)","v":42}]
[null,null,{"$f":"MATCH(Calc2!C$112,Trucks!$B$49:$B192,0)","v":6},{"$f":"MATCH(Calc2!D$112,Trucks!$B$49:$B192,0)","v":95},{"$f":"MATCH(Calc2!E$112,Trucks!$B$49:$B192,0)","v":103},{"$f":"MATCH(Calc2!F$112,Trucks!$B$49:$B192,0)","v":107},{"$f":"MATCH(Calc2!G$112,Trucks!$B$49:$B192,0)","v":42},{"$f":"MATCH(Calc2!H$112,Trucks!$B$49:$B192,0)","v":42},{"$f":"MATCH(Calc2!I$112,Trucks!$B$49:$B192,0)","v":42},{"$f":"MATCH(Calc2!J$112,Trucks!$B$49:$B192,0)","v":42},{"$f":"MATCH(Calc2!K$112,Trucks!$B$49:$B192,0)","v":42},{"$f":"MATCH(Calc2!L$112,Trucks!$B$49:$B192,0)","v":42},{"$f":"MATCH(Calc2!M$112,Trucks!$B$49:$B192,0)","v":42},{"$f":"MATCH(Calc2!N$112,Trucks!$B$49:$B192,0)","v":42},{"$f":"MATCH(Calc2!O$112,Trucks!$B$49:$B192,0)","v":42},{"$f":"MATCH(Calc2!P$112,Trucks!$B$49:$B192,0)","v":42},{"$f":"MATCH(Calc2!Q$112,Trucks!$B$49:$B192,0)","v":42},{"$f":"MATCH(Calc2!R$112,Trucks!$B$49:$B192,0)","v":42},{"$f":"MATCH(Calc2!S$112,Trucks!$B$49:$B192,0)","v":42},{"$f":"MATCH(Calc2!T$112,Trucks!$B$49:$B192,0)","v":42},{"$f":"MATCH(Calc2!U$112,Trucks!$B$49:$B192,0)","v":42},{"$f":"MATCH(Calc2!V$112,Trucks!$B$49:$B192,0)","v":42},{"$f":"MATCH(Calc2!W$112,Trucks!$B$49:$B192,0)","v":42},{"$f":"MATCH(Calc2!X$112,Trucks!$B$49:$B192,0)","v":42},{"$f":"MATCH(Calc2!Y$112,Trucks!$B$49:$B192,0)","v":42},{"$f":"MATCH(Calc2!Z$112,Trucks!$B$49:$B192,0)","v":42},{"$f":"MATCH(Calc2!AA$112,Trucks!$B$49:$B192,0)","v":42},{"$f":"MATCH(Calc2!AB$112,Trucks!$B$49:$B192,0)","v":42}]
[null,null,{"$f":"MATCH(Calc2!C$112,Trucks!$B$49:$B193,0)","v":6},{"$f":"MATCH(Calc2!D$112,Trucks!$B$49:$B193,0)","v":95},{"$f":"MATCH(Calc2!E$112,Trucks!$B$49:$B193,0)","v":103},{"$f":"MATCH(Calc2!F$112,Trucks!$B$49:$B193,0)","v":107},{"$f":"MATCH(Calc2!G$112,Trucks!$B$49:$B193,0)","v":42},{"$f":"MATCH(Calc2!H$112,Trucks!$B$49:$B193,0)","v":42},{"$f":"MATCH(Calc2!I$112,Trucks!$B$49:$B193,0)","v":42},{"$f":"MATCH(Calc2!J$112,Trucks!$B$49:$B193,0)","v":42},{"$f":"MATCH(Calc2!K$112,Trucks!$B$49:$B193,0)","v":42},{"$f":"MATCH(Calc2!L$112,Trucks!$B$49:$B193,0)","v":42},{"$f":"MATCH(Calc2!M$112,Trucks!$B$49:$B193,0)","v":42},{"$f":"MATCH(Calc2!N$112,Trucks!$B$49:$B193,0)","v":42},{"$f":"MATCH(Calc2!O$112,Trucks!$B$49:$B193,0)","v":42},{"$f":"MATCH(Calc2!P$112,Trucks!$B$49:$B193,0)","v":42},{"$f":"MATCH(Calc2!Q$112,Trucks!$B$49:$B193,0)","v":42},{"$f":"MATCH(Calc2!R$112,Trucks!$B$49:$B193,0)","v":42},{"$f":"MATCH(Calc2!S$112,Trucks!$B$49:$B193,0)","v":42},{"$f":"MATCH(Calc2!T$112,Trucks!$B$49:$B193,0)","v":42},{"$f":"MATCH(Calc2!U$112,Trucks!$B$49:$B193,0)","v":42},{"$f":"MATCH(Calc2!V$112,Trucks!$B$49:$B193,0)","v":42},{"$f":"MATCH(Calc2!W$112,Trucks!$B$49:$B193,0)","v":42},{"$f":"MATCH(Calc2!X$112,Trucks!$B$49:$B193,0)","v":42},{"$f":"MATCH(Calc2!Y$112,Trucks!$B$49:$B193,0)","v":42},{"$f":"MATCH(Calc2!Z$112,Trucks!$B$49:$B193,0)","v":42},{"$f":"MATCH(Calc2!AA$112,Trucks!$B$49:$B193,0)","v":42},{"$f":"MATCH(Calc2!AB$112,Trucks!$B$49:$B193,0)","v":42}]
[null,null,{"$f":"MATCH(Calc2!C$112,Trucks!$B$49:$B194,0)","v":6},{"$f":"MATCH(Calc2!D$112,Trucks!$B$49:$B194,0)","v":95},{"$f":"MATCH(Calc2!E$112,Trucks!$B$49:$B194,0)","v":103},{"$f":"MATCH(Calc2!F$112,Trucks!$B$49:$B194,0)","v":107},{"$f":"MATCH(Calc2!G$112,Trucks!$B$49:$B194,0)","v":42},{"$f":"MATCH(Calc2!H$112,Trucks!$B$49:$B194,0)","v":42},{"$f":"MATCH(Calc2!I$112,Trucks!$B$49:$B194,0)","v":42},{"$f":"MATCH(Calc2!J$112,Trucks!$B$49:$B194,0)","v":42},{"$f":"MATCH(Calc2!K$112,Trucks!$B$49:$B194,0)","v":42},{"$f":"MATCH(Calc2!L$112,Trucks!$B$49:$B194,0)","v":42},{"$f":"MATCH(Calc2!M$112,Trucks!$B$49:$B194,0)","v":42},{"$f":"MATCH(Calc2!N$112,Trucks!$B$49:$B194,0)","v":42},{"$f":"MATCH(Calc2!O$112,Trucks!$B$49:$B194,0)","v":42},{"$f":"MATCH(Calc2!P$112,Trucks!$B$49:$B194,0)","v":42},{"$f":"MATCH(Calc2!Q$112,Trucks!$B$49:$B194,0)","v":42},{"$f":"MATCH(Calc2!R$112,Trucks!$B$49:$B194,0)","v":42},{"$f":"MATCH(Calc2!S$112,Trucks!$B$49:$B194,0)","v":42},{"$f":"MATCH(Calc2!T$112,Trucks!$B$49:$B194,0)","v":42},{"$f":"MATCH(Calc2!U$112,Trucks!$B$49:$B194,0)","v":42},{"$f":"MATCH(Calc2!V$112,Trucks!$B$49:$B194,0)","v":42},{"$f":"MATCH(Calc2!W$112,Trucks!$B$49:$B194,0)","v":42},{"$f":"MATCH(Calc2!X$112,Trucks!$B$49:$B194,0)","v":42},{"$f":"MATCH(Calc2!Y$112,Trucks!$B$49:$B194,0)","v":42},{"$f":"MATCH(Calc2!Z$112,Trucks!$B$49:$B194,0)","v":42},{"$f":"MATCH(Calc2!AA$112,Trucks!$B$49:$B194,0)","v":42},{"$f":"MATCH(Calc2!AB$112,Trucks!$B$49:$B194,0)","v":42}]
[null,null,{"$f":"MATCH(Calc2!C$112,Trucks!$B$49:$B204,0)","v":6},{"$f":"MATCH(Calc2!D$112,Trucks!$B$49:$B204,0)","v":95},{"$f":"MATCH(Calc2!E$112,Trucks!$B$49:$B204,0)","v":103},{"$f":"MATCH(Calc2!F$112,Trucks!$B$49:$B204,0)","v":107},{"$f":"MATCH(Calc2!G$112,Trucks!$B$49:$B204,0)","v":42},{"$f":"MATCH(Calc2!H$112,Trucks!$B$49:$B204,0)","v":42},{"$f":"MATCH(Calc2!I$112,Trucks!$B$49:$B204,0)","v":42},{"$f":"MATCH(Calc2!J$112,Trucks!$B$49:$B204,0)","v":42},{"$f":"MATCH(Calc2!K$112,Trucks!$B$49:$B204,0)","v":42},{"$f":"MATCH(Calc2!L$112,Trucks!$B$49:$B204,0)","v":42},{"$f":"MATCH(Calc2!M$112,Trucks!$B$49:$B204,0)","v":42},{"$f":"MATCH(Calc2!N$112,Trucks!$B$49:$B204,0)","v":42},{"$f":"MATCH(Calc2!O$112,Trucks!$B$49:$B204,0)","v":42},{"$f":"MATCH(Calc2!P$112,Trucks!$B$49:$B204,0)","v":42},{"$f":"MATCH(Calc2!Q$112,Trucks!$B$49:$B204,0)","v":42},{"$f":"MATCH(Calc2!R$112,Trucks!$B$49:$B204,0)","v":42},{"$f":"MATCH(Calc2!S$112,Trucks!$B$49:$B204,0)","v":42},{"$f":"MATCH(Calc2!T$112,Trucks!$B$49:$B204,0)","v":42},{"$f":"MATCH(Calc2!U$112,Trucks!$B$49:$B204,0)","v":42},{"$f":"MATCH(Calc2!V$112,Trucks!$B$49:$B204,0)","v":42},{"$f":"MATCH(Calc2!W$112,Trucks!$B$49:$B204,0)","v":42},{"$f":"MATCH(Calc2!X$112,Trucks!$B$49:$B204,0)","v":42},{"$f":"MATCH(Calc2!Y$112,Trucks!$B$49:$B204,0)","v":42},{"$f":"MATCH(Calc2!Z$112,Trucks!$B$49:$B204,0)","v":42},{"$f":"MATCH(Calc2!AA$112,Trucks!$B$49:$B204,0)","v":42},{"$f":"MATCH(Calc2!AB$112,Trucks!$B$49:$B204,0)","v":42}]
[null,null,{"$f":"MATCH(Calc2!C$112,Trucks!$B$49:$B205,0)","v":6},{"$f":"MATCH(Calc2!D$112,Trucks!$B$49:$B205,0)","v":95},{"$f":"MATCH(Calc2!E$112,Trucks!$B$49:$B205,0)","v":103},{"$f":"MATCH(Calc2!F$112,Trucks!$B$49:$B205,0)","v":107},{"$f":"MATCH(Calc2!G$112,Trucks!$B$49:$B205,0)","v":42},{"$f":"MATCH(Calc2!H$112,Trucks!$B$49:$B205,0)","v":42},{"$f":"MATCH(Calc2!I$112,Trucks!$B$49:$B205,0)","v":42},{"$f":"MATCH(Calc2!J$112,Trucks!$B$49:$B205,0)","v":42},{"$f":"MATCH(Calc2!K$112,Trucks!$B$49:$B205,0)","v":42},{"$f":"MATCH(Calc2!L$112,Trucks!$B$49:$B205,0)","v":42},{"$f":"MATCH(Calc2!M$112,Trucks!$B$49:$B205,0)","v":42},{"$f":"MATCH(Calc2!N$112,Trucks!$B$49:$B205,0)","v":42},{"$f":"MATCH(Calc2!O$112,Trucks!$B$49:$B205,0)","v":42},{"$f":"MATCH(Calc2!P$112,Trucks!$B$49:$B205,0)","v":42},{"$f":"MATCH(Calc2!Q$112,Trucks!$B$49:$B205,0)","v":42},{"$f":"MATCH(Calc2!R$112,Trucks!$B$49:$B205,0)","v":42},{"$f":"MATCH(Calc2!S$112,Trucks!$B$49:$B205,0)","v":42},{"$f":"MATCH(Calc2!T$112,Trucks!$B$49:$B205,0)","v":42},{"$f":"MATCH(Calc2!U$112,Trucks!$B$49:$B205,0)","v":42},{"$f":"MATCH(Calc2!V$112,Trucks!$B$49:$B205,0)","v":42},{"$f":"MATCH(Calc2!W$112,Trucks!$B$49:$B205,0)","v":42},{"$f":"MATCH(Calc2!X$112,Trucks!$B$49:$B205,0)","v":42},{"$f":"MATCH(Calc2!Y$112,Trucks!$B$49:$B205,0)","v":42},{"$f":"MATCH(Calc2!Z$112,Trucks!$B$49:$B205,0)","v":42},{"$f":"MATCH(Calc2!AA$112,Trucks!$B$49:$B205,0)","v":42},{"$f":"MATCH(Calc2!AB$112,Trucks!$B$49:$B205,0)","v":42}]
[null,null,{"$f":"MATCH(Calc2!C$112,Trucks!$B$49:$B206,0)","v":6},{"$f":"MATCH(Calc2!D$112,Trucks!$B$49:$B206,0)","v":95},{"$f":"MATCH(Calc2!E$112,Trucks!$B$49:$B206,0)","v":103},{"$f":"MATCH(Calc2!F$112,Trucks!$B$49:$B206,0)","v":107},{"$f":"MATCH(Calc2!G$112,Trucks!$B$49:$B206,0)","v":42},{"$f":"MATCH(Calc2!H$112,Trucks!$B$49:$B206,0)","v":42},{"$f":"MATCH(Calc2!I$112,Trucks!$B$49:$B206,0)","v":42},{"$f":"MATCH(Calc2!J$112,Trucks!$B$49:$B206,0)","v":42},{"$f":"MATCH(Calc2!K$112,Trucks!$B$49:$B206,0)","v":42},{"$f":"MATCH(Calc2!L$112,Trucks!$B$49:$B206,0)","v":42},{"$f":"MATCH(Calc2!M$112,Trucks!$B$49:$B206,0)","v":42},{"$f":"MATCH(Calc2!N$112,Trucks!$B$49:$B206,0)","v":42},{"$f":"MATCH(Calc2!O$112,Trucks!$B$49:$B206,0)","v":42},{"$f":"MATCH(Calc2!P$112,Trucks!$B$49:$B206,0)","v":42},{"$f":"MATCH(Calc2!Q$112,Trucks!$B$49:$B206,0)","v":42},{"$f":"MATCH(Calc2!R$112,Trucks!$B$49:$B206,0)","v":42},{"$f":"MATCH(Calc2!S$112,Trucks!$B$49:$B206,0)","v":42},{"$f":"MATCH(Calc2!T$112,Trucks!$B$49:$B206,0)","v":42},{"$f":"MATCH(Calc2!U$112,Trucks!$B$49:$B206,0)","v":42},{"$f":"MATCH(Calc2!V$112,Trucks!$B$49:$B206,0)","v":42},{"$f":"MATCH(Calc2!W$112,Trucks!$B$49:$B206,0)","v":42},{"$f":"MATCH(Calc2!X$112,Trucks!$B$49:$B206,0)","v":42},{"$f":"MATCH(Calc2!Y$112,Trucks!$B$49:$B206,0)","v":42},{"$f":"MATCH(Calc2!Z$112,Trucks!$B$49:$B206,0)","v":42},{"$f":"MATCH(Calc2!AA$112,Trucks!$B$49:$B206,0)","v":42},{"$f":"MATCH(Calc2!AB$112,Trucks!$B$49:$B206,0)","v":42}]
[null,null,{"$f":"MATCH(Calc2!C$112,Trucks!$B$49:$B207,0)","v":6},{"$f":"MATCH(Calc2!D$112,Trucks!$B$49:$B207,0)","v":95},{"$f":"MATCH(Calc2!E$112,Trucks!$B$49:$B207,0)","v":103},{"$f":"MATCH(Calc2!F$112,Trucks!$B$49:$B207,0)","v":107},{"$f":"MATCH(Calc2!G$112,Trucks!$B$49:$B207,0)","v":42},{"$f":"MATCH(Calc2!H$112,Trucks!$B$49:$B207,0)","v":42},{"$f":"MATCH(Calc2!I$112,Trucks!$B$49:$B207,0)","v":42},{"$f":"MATCH(Calc2!J$112,Trucks!$B$49:$B207,0)","v":42},{"$f":"MATCH(Calc2!K$112,Trucks!$B$49:$B207,0)","v":42},{"$f":"MATCH(Calc2!L$112,Trucks!$B$49:$B207,0)","v":42},{"$f":"MATCH(Calc2!M$112,Trucks!$B$49:$B207,0)","v":42},{"$f":"MATCH(Calc2!N$112,Trucks!$B$49:$B207,0)","v":42},{"$f":"MATCH(Calc2!O$112,Trucks!$B$49:$B207,0)","v":42},{"$f":"MATCH(Calc2!P$112,Trucks!$B$49:$B207,0)","v":42},{"$f":"MATCH(Calc2!Q$112,Trucks!$B$49:$B207,0)","v":42},{"$f":"MATCH(Calc2!R$112,Trucks!$B$49:$B207,0)","v":42},{"$f":"MATCH(Calc2!S$112,Trucks!$B$49:$B207,0)","v":42},{"$f":"MATCH(Calc2!T$112,Trucks!$B$49:$B207,0)","v":42},{"$f":"MATCH(Calc2!U$112,Trucks!$B$49:$B207,0)","v":42},{"$f":"MATCH(Calc2!V$112,Trucks!$B$49:$B207,0)","v":42},{"$f":"MATCH(Calc2!W$112,Trucks!$B$49:$B207,0)","v":42},{"$f":"MATCH(Calc2!X$112,Trucks!$B$49:$B207,0)","v":42},{"$f":"MATCH(Calc2!Y$112,Trucks!$B$49:$B207,0)","v":42},{"$f":"MATCH(Calc2!Z$112,Trucks!$B$49:$B207,0)","v":42},{"$f":"MATCH(Calc2!AA$112,Trucks!$B$49:$B207,0)","v":42},{"$f":"MATCH(Calc2!AB$112,Trucks!$B$49:$B207,0)","v":42}]
[null,null,{"$f":"MATCH(Calc2!C$112,Trucks!$B$49:$B208,0)","v":6},{"$f":"MATCH(Calc2!D$112,Trucks!$B$49:$B208,0)","v":95},{"$f":"MATCH(Calc2!E$112,Trucks!$B$49:$B208,0)","v":103},{"$f":"MATCH(Calc2!F$112,Trucks!$B$49:$B208,0)","v":107},{"$f":"MATCH(Calc2!G$112,Trucks!$B$49:$B208,0)","v":42},{"$f":"MATCH(Calc2!H$112,Trucks!$B$49:$B208,0)","v":42},{"$f":"MATCH(Calc2!I$112,Trucks!$B$49:$B208,0)","v":42},{"$f":"MATCH(Calc2!J$112,Trucks!$B$49:$B208,0)","v":42},{"$f":"MATCH(Calc2!K$112,Trucks!$B$49:$B208,0)","v":42},{"$f":"MATCH(Calc2!L$112,Trucks!$B$49:$B208,0)","v":42},{"$f":"MATCH(Calc2!M$112,Trucks!$B$49:$B208,0)","v":42},{"$f":"MATCH(Calc2!N$112,Trucks!$B$49:$B208,0)","v":42},{"$f":"MATCH(Calc2!O$112,Trucks!$B$49:$B208,0)","v":42},{"$f":"MATCH(Calc2!P$112,Trucks!$B$49:$B208,0)","v":42},{"$f":"MATCH(Calc2!Q$112,Trucks!$B$49:$B208,0)","v":42},{"$f":"MATCH(Calc2!R$112,Trucks!$B$49:$B208,0)","v":42},{"$f":"MATCH(Calc2!S$112,Trucks!$B$49:$B208,0)","v":42},{"$f":"MATCH(Calc2!T$112,Trucks!$B$49:$B208,0)","v":42},{"$f":"MATCH(Calc2!U$112,Trucks!$B$49:$B208,0)","v":42},{"$f":"MATCH(Calc2!V$112,Trucks!$B$49:$B208,0)","v":42},{"$f":"MATCH(Calc2!W$112,Trucks!$B$49:$B208,0)","v":42},{"$f":"MATCH(Calc2!X$112,Trucks!$B$49:$B208,0)","v":42},{"$f":"MATCH(Calc2!Y$112,Trucks!$B$49:$B208,0)","v":42},{"$f":"MATCH(Calc2!Z$112,Trucks!$B$49:$B208,0)","v":42},{"$f":"MATCH(Calc2!AA$112,Trucks!$B$49:$B208,0)","v":42},{"$f":"MATCH(Calc2!AB$112,Trucks!$B$49:$B208,0)","v":42}]
[null,null,{"$f":"MATCH(Calc2!C$112,Trucks!$B$49:$B209,0)","v":6},{"$f":"MATCH(Calc2!D$112,Trucks!$B$49:$B209,0)","v":95},{"$f":"MATCH(Calc2!E$112,Trucks!$B$49:$B209,0)","v":103},{"$f":"MATCH(Calc2!F$112,Trucks!$B$49:$B209,0)","v":107},{"$f":"MATCH(Calc2!G$112,Trucks!$B$49:$B209,0)","v":42},{"$f":"MATCH(Calc2!H$112,Trucks!$B$49:$B209,0)","v":42},{"$f":"MATCH(Calc2!I$112,Trucks!$B$49:$B209,0)","v":42},{"$f":"MATCH(Calc2!J$112,Trucks!$B$49:$B209,0)","v":42},{"$f":"MATCH(Calc2!K$112,Trucks!$B$49:$B209,0)","v":42},{"$f":"MATCH(Calc2!L$112,Trucks!$B$49:$B209,0)","v":42},{"$f":"MATCH(Calc2!M$112,Trucks!$B$49:$B209,0)","v":42},{"$f":"MATCH(Calc2!N$112,Trucks!$B$49:$B209,0)","v":42},{"$f":"MATCH(Calc2!O$112,Trucks!$B$49:$B209,0)","v":42},{"$f":"MATCH(Calc2!P$112,Trucks!$B$49:$B209,0)","v":42},{"$f":"MATCH(Calc2!Q$112,Trucks!$B$49:$B209,0)","v":42},{"$f":"MATCH(Calc2!R$112,Trucks!$B$49:$B209,0)","v":42},{"$f":"MATCH(Calc2!S$112,Trucks!$B$49:$B209,0)","v":42},{"$f":"MATCH(Calc2!T$112,Trucks!$B$49:$B209,0)","v":42},{"$f":"MATCH(Calc2!U$112,Trucks!$B$49:$B209,0)","v":42},{"$f":"MATCH(Calc2!V$112,Trucks!$B$49:$B209,0)","v":42},{"$f":"MATCH(Calc2!W$112,Trucks!$B$49:$B209,0)","v":42},{"$f":"MATCH(Calc2!X$112,Trucks!$B$49:$B209,0)","v":42},{"$f":"MATCH(Calc2!Y$112,Trucks!$B$49:$B209,0)","v":42},{"$f":"MATCH(Calc2!Z$112,Trucks!$B$49:$B209,0)","v":42},{"$f":"MATCH(Calc2!AA$112,Trucks!$B$49:$B209,0)","v":42},{"$f":"MATCH(Calc2!AB$112,Trucks!$B$49:$B209,0)","v":42}]
[null,null,{"$f":"MATCH(Calc2!C$112,Trucks!$B$49:$B210,0)","v":6},{"$f":"MATCH(Calc2!D$112,Trucks!$B$49:$B210,0)","v":95},{"$f":"MATCH(Calc2!E$112,Trucks!$B$49:$B210,0)","v":103},{"$f":"MATCH(Calc2!F$112,Trucks!$B$49:$B210,0)","v":107},{"$f":"MATCH(Calc2!G$112,Trucks!$B$49:$B210,0)","v":42},{"$f":"MATCH(Calc2!H$112,Trucks!$B$49:$B210,0)","v":42},{"$f":"MATCH(Calc2!I$112,Trucks!$B$49:$B210,0)","v":42},{"$f":"MATCH(Calc2!J$112,Trucks!$B$49:$B210,0)","v":42},{"$f":"MATCH(Calc2!K$112,Trucks!$B$49:$B210,0)","v":42},{"$f":"MATCH(Calc2!L$112,Trucks!$B$49:$B210,0)","v":42},{"$f":"MATCH(Calc2!M$112,Trucks!$B$49:$B210,0)","v":42},{"$f":"MATCH(Calc2!N$112,Trucks!$B$49:$B210,0)","v":42},{"$f":"MATCH(Calc2!O$112,Trucks!$B$49:$B210,0)","v":42},{"$f":"MATCH(Calc2!P$112,Trucks!$B$49:$B210,0)","v":42},{"$f":"MATCH(Calc2!Q$112,Trucks!$B$49:$B210,0)","v":42},{"$f":"MATCH(Calc2!R$112,Trucks!$B$49:$B210,0)","v":42},{"$f":"MATCH(Calc2!S$112,Trucks!$B$49:$B210,0)","v":42},{"$f":"MATCH(Calc2!T$112,Trucks!$B$49:$B210,0)","v":42},{"$f":"MATCH(Calc2!U$112,Trucks!$B$49:$B210,0)","v":42},{"$f":"MATCH(Calc2!V$112,Trucks!$B$49:$B210,0)","v":42},{"$f":"MATCH(Calc2!W$112,Trucks!$B$49:$B210,0)","v":42},{"$f":"MATCH(Calc2!X$112,Trucks!$B$49:$B210,0)","v":42},{"$f":"MATCH(Calc2!Y$112,Trucks!$B$49:$B210,0)","v":42},{"$f":"MATCH(Calc2!Z$112,Trucks!$B$49:$B210,0)","v":42},{"$f":"MATCH(Calc2!AA$112,Trucks!$B$49:$B210,0)","v":42},{"$f":"MATCH(Calc2!AB$112,Trucks!$B$49:$B210,0)","v":42}]
[null,null,{"$f":"MATCH(Calc2!C$112,Trucks!$B$49:$B211,0)","v":6},{"$f":"MATCH(Calc2!D$112,Trucks!$B$49:$B211,0)","v":95},{"$f":"MATCH(Calc2!E$112,Trucks!$B$49:$B211,0)","v":103},{"$f":"MATCH(Calc2!F$112,Trucks!$B$49:$B211,0)","v":107},{"$f":"MATCH(Calc2!G$112,Trucks!$B$49:$B211,0)","v":42},{"$f":"MATCH(Calc2!H$112,Trucks!$B$49:$B211,0)","v":42},{"$f":"MATCH(Calc2!I$112,Trucks!$B$49:$B211,0)","v":42},{"$f":"MATCH(Calc2!J$112,Trucks!$B$49:$B211,0)","v":42},{"$f":"MATCH(Calc2!K$112,Trucks!$B$49:$B211,0)","v":42},{"$f":"MATCH(Calc2!L$112,Trucks!$B$49:$B211,0)","v":42},{"$f":"MATCH(Calc2!M$112,Trucks!$B$49:$B211,0)","v":42},{"$f":"MATCH(Calc2!N$112,Trucks!$B$49:$B211,0)","v":42},{"$f":"MATCH(Calc2!O$112,Trucks!$B$49:$B211,0)","v":42},{"$f":"MATCH(Calc2!P$112,Trucks!$B$49:$B211,0)","v":42},{"$f":"MATCH(Calc2!Q$112,Trucks!$B$49:$B211,0)","v":42},{"$f":"MATCH(Calc2!R$112,Trucks!$B$49:$B211,0)","v":42},{"$f":"MATCH(Calc2!S$112,Trucks!$B$49:$B211,0)","v":42},{"$f":"MATCH(Calc2!T$112,Trucks!$B$49:$B211,0)","v":42},{"$f":"MATCH(Calc2!U$112,Trucks!$B$49:$B211,0)","v":42},{"$f":"MATCH(Calc2!V$112,Trucks!$B$49:$B211,0)","v":42},{"$f":"MATCH(Calc2!W$112,Trucks!$B$49:$B211,0)","v":42},{"$f":"MATCH(Calc2!X$112,Trucks!$B$49:$B211,0)","v":42},{"$f":"MATCH(Calc2!Y$112,Trucks!$B$49:$B211,0)","v":42},{"$f":"MATCH(Calc2!Z$112,Trucks!$B$49:$B211,0)","v":42},{"$f":"MATCH(Calc2!AA$112,Trucks!$B$49:$B211,0)","v":42},{"$f":"MATCH(Calc2!AB$112,Trucks!$B$49:$B211,0)","v":42}]
[null,null,{"$f":"MATCH(Calc2!C$112,Trucks!$B$49:$B212,0)","v":6},{"$f":"MATCH(Calc2!D$112,Trucks!$B$49:$B212,0)","v":95},{"$f":"MATCH(Calc2!E$112,Trucks!$B$49:$B212,0)","v":103},{"$f":"MATCH(Calc2!F$112,Trucks!$B$49:$B212,0)","v":107},{"$f":"MATCH(Calc2!G$112,Trucks!$B$49:$B212,0)","v":42},{"$f":"MATCH(Calc2!H$112,Trucks!$B$49:$B212,0)","v":42},{"$f":"MATCH(Calc2!I$112,Trucks!$B$49:$B212,0)","v":42},{"$f":"MATCH(Calc2!J$112,Trucks!$B$49:$B212,0)","v":42},{"$f":"MATCH(Calc2!K$112,Trucks!$B$49:$B212,0)","v":42},{"$f":"MATCH(Calc2!L$112,Trucks!$B$49:$B212,0)","v":42},{"$f":"MATCH(Calc2!M$112,Trucks!$B$49:$B212,0)","v":42},{"$f":"MATCH(Calc2!N$112,Trucks!$B$49:$B212,0)","v":42},{"$f":"MATCH(Calc2!O$112,Trucks!$B$49:$B212,0)","v":42},{"$f":"MATCH(Calc2!P$112,Trucks!$B$49:$B212,0)","v":42},{"$f":"MATCH(Calc2!Q$112,Trucks!$B$49:$B212,0)","v":42},{"$f":"MATCH(Calc2!R$112,Trucks!$B$49:$B212,0)","v":42},{"$f":"MATCH(Calc2!S$112,Trucks!$B$49:$B212,0)","v":42},{"$f":"MATCH(Calc2!T$112,Trucks!$B$49:$B212,0)","v":42},{"$f":"MATCH(Calc2!U$112,Trucks!$B$49:$B212,0)","v":42},{"$f":"MATCH(Calc2!V$112,Trucks!$B$49:$B212,0)","v":42},{"$f":"MATCH(Calc2!W$112,Trucks!$B$49:$B212,0)","v":42},{"$f":"MATCH(Calc2!X$112,Trucks!$B$49:$B212,0)","v":42},{"$f":"MATCH(Calc2!Y$112,Trucks!$B$49:$B212,0)","v":42},{"$f":"MATCH(Calc2!Z$112,Trucks!$B$49:$B212,0)","v":42},{"$f":"MATCH(Calc2!AA$112,Trucks!$B$49:$B212,0)","v":42},{"$f":"MATCH(Calc2!AB$112,Trucks!$B$49:$B212,0)","v":42}]
[null,null,{"$f":"MATCH(Calc2!C$112,Trucks!$B$49:$B213,0)","v":6},{"$f":"MATCH(Calc2!D$112,Trucks!$B$49:$B213,0)","v":95},{"$f":"MATCH(Calc2!E$112,Trucks!$B$49:$B213,0)","v":103},{"$f":"MATCH(Calc2!F$112,Trucks!$B$49:$B213,0)","v":107},{"$f":"MATCH(Calc2!G$112,Trucks!$B$49:$B213,0)","v":42},{"$f":"MATCH(Calc2!H$112,Trucks!$B$49:$B213,0)","v":42},{"$f":"MATCH(Calc2!I$112,Trucks!$B$49:$B213,0)","v":42},{"$f":"MATCH(Calc2!J$112,Trucks!$B$49:$B213,0)","v":42},{"$f":"MATCH(Calc2!K$112,Trucks!$B$49:$B213,0)","v":42},{"$f":"MATCH(Calc2!L$112,Trucks!$B$49:$B213,0)","v":42},{"$f":"MATCH(Calc2!M$112,Trucks!$B$49:$B213,0)","v":42},{"$f":"MATCH(Calc2!N$112,Trucks!$B$49:$B213,0)","v":42},{"$f":"MATCH(Calc2!O$112,Trucks!$B$49:$B213,0)","v":42},{"$f":"MATCH(Calc2!P$112,Trucks!$B$49:$B213,0)","v":42},{"$f":"MATCH(Calc2!Q$112,Trucks!$B$49:$B213,0)","v":42},{"$f":"MATCH(Calc2!R$112,Trucks!$B$49:$B213,0)","v":42},{"$f":"MATCH(Calc2!S$112,Trucks!$B$49:$B213,0)","v":42},{"$f":"MATCH(Calc2!T$112,Trucks!$B$49:$B213,0)","v":42},{"$f":"MATCH(Calc2!U$112,Trucks!$B$49:$B213,0)","v":42},{"$f":"MATCH(Calc2!V$112,Trucks!$B$49:$B213,0)","v":42},{"$f":"MATCH(Calc2!W$112,Trucks!$B$49:$B213,0)","v":42},{"$f":"MATCH(Calc2!X$112,Trucks!$B$49:$B213,0)","v":42},{"$f":"MATCH(Calc2!Y$112,Trucks!$B$49:$B213,0)","v":42},{"$f":"MATCH(Calc2!Z$112,Trucks!$B$49:$B213,0)","v":42},{"$f":"MATCH(Calc2!AA$112,Trucks!$B$49:$B213,0)","v":42},{"$f":"MATCH(Calc2!AB$112,Trucks!$B$49:$B213,0)","v":42}]
[null,null,{"$f":"MATCH(Calc2!C$112,Trucks!$B$49:$B214,0)","v":6},{"$f":"MATCH(Calc2!D$112,Trucks!$B$49:$B214,0)","v":95},{"$f":"MATCH(Calc2!E$112,Trucks!$B$49:$B214,0)","v":103},{"$f":"MATCH(Calc2!F$112,Trucks!$B$49:$B214,0)","v":107},{"$f":"MATCH(Calc2!G$112,Trucks!$B$49:$B214,0)","v":42},{"$f":"MATCH(Calc2!H$112,Trucks!$B$49:$B214,0)","v":42},{"$f":"MATCH(Calc2!I$112,Trucks!$B$49:$B214,0)","v":42},{"$f":"MATCH(Calc2!J$112,Trucks!$B$49:$B214,0)","v":42},{"$f":"MATCH(Calc2!K$112,Trucks!$B$49:$B214,0)","v":42},{"$f":"MATCH(Calc2!L$112,Trucks!$B$49:$B214,0)","v":42},{"$f":"MATCH(Calc2!M$112,Trucks!$B$49:$B214,0)","v":42},{"$f":"MATCH(Calc2!N$112,Trucks!$B$49:$B214,0)","v":42},{"$f":"MATCH(Calc2!O$112,Trucks!$B$49:$B214,0)","v":42},{"$f":"MATCH(Calc2!P$112,Trucks!$B$49:$B214,0)","v":42},{"$f":"MATCH(Calc2!Q$112,Trucks!$B$49:$B214,0)","v":42},{"$f":"MATCH(Calc2!R$112,Trucks!$B$49:$B214,0)","v":42},{"$f":"MATCH(Calc2!S$112,Trucks!$B$49:$B214,0)","v":42},{"$f":"MATCH(Calc2!T$112,Trucks!$B$49:$B214,0)","v":42},{"$f":"MATCH(Calc2!U$112,Trucks!$B$49:$B214,0)","v":42},{"$f":"MATCH(Calc2!V$112,Trucks!$B$49:$B214,0)","v":42},{"$f":"MATCH(Calc2!W$112,Trucks!$B$49:$B214,0)","v":42},{"$f":"MATCH(Calc2!X$112,Trucks!$B$49:$B214,0)","v":42},{"$f":"MATCH(Calc2!Y$112,Trucks!$B$49:$B214,0)","v":42},{"$f":"MATCH(Calc2!Z$112,Trucks!$B$49:$B214,0)","v":42},{"$f":"MATCH(Calc2!AA$112,Trucks!$B$49:$B214,0)","v":42},{"$f":"MATCH(Calc2!AB$112,Trucks!$B$49:$B214,0)","v":42}]
[null,null,{"$f":"MATCH(Calc2!C$112,Trucks!$B$49:$B215,0)","v":6},{"$f":"MATCH(Calc2!D$112,Trucks!$B$49:$B215,0)","v":95},{"$f":"MATCH(Calc2!E$112,Trucks!$B$49:$B215,0)","v":103},{"$f":"MATCH(Calc2!F$112,Trucks!$B$49:$B215,0)","v":107},{"$f":"MATCH(Calc2!G$112,Trucks!$B$49:$B215,0)","v":42},{"$f":"MATCH(Calc2!H$112,Trucks!$B$49:$B215,0)","v":42},{"$f":"MATCH(Calc2!I$112,Trucks!$B$49:$B215,0)","v":42},{"$f":"MATCH(Calc2!J$112,Trucks!$B$49:$B215,0)","v":42},{"$f":"MATCH(Calc2!K$112,Trucks!$B$49:$B215,0)","v":42},{"$f":"MATCH(Calc2!L$112,Trucks!$B$49:$B215,0)","v":42},{"$f":"MATCH(Calc2!M$112,Trucks!$B$49:$B215,0)","v":42},{"$f":"MATCH(Calc2!N$112,Trucks!$B$49:$B215,0)","v":42},{"$f":"MATCH(Calc2!O$112,Trucks!$B$49:$B215,0)","v":42},{"$f":"MATCH(Calc2!P$112,Trucks!$B$49:$B215,0)","v":42},{"$f":"MATCH(Calc2!Q$112,Trucks!$B$49:$B215,0)","v":42},{"$f":"MATCH(Calc2!R$112,Trucks!$B$49:$B215,0)","v":42},{"$f":"MATCH(Calc2!S$112,Trucks!$B$49:$B215,0)","v":42},{"$f":"MATCH(Calc2!T$112,Trucks!$B$49:$B215,0)","v":42},{"$f":"MATCH(Calc2!U$112,Trucks!$B$49:$B215,0)","v":42},{"$f":"MATCH(Calc2!V$112,Trucks!$B$49:$B215,0)","v":42},{"$f":"MATCH(Calc2!W$112,Trucks!$B$49:$B215,0)","v":42},{"$f":"MATCH(Calc2!X$112,Trucks!$B$49:$B215,0)","v":42},{"$f":"MATCH(Calc2!Y$112,Trucks!$B$49:$B215,0)","v":42},{"$f":"MATCH(Calc2!Z$112,Trucks!$B$49:$B215,0)","v":42},{"$f":"MATCH(Calc2!AA$112,Trucks!$B$49:$B215,0)","v":42},{"$f":"MATCH(Calc2!AB$112,Trucks!$B$49:$B215,0)","v":42}]
[null,null,{"$f":"MATCH(Calc2!C$112,Trucks!$B$49:$B216,0)","v":6},{"$f":"MATCH(Calc2!D$112,Trucks!$B$49:$B216,0)","v":95},{"$f":"MATCH(Calc2!E$112,Trucks!$B$49:$B216,0)","v":103},{"$f":"MATCH(Calc2!F$112,Trucks!$B$49:$B216,0)","v":107},{"$f":"MATCH(Calc2!G$112,Trucks!$B$49:$B216,0)","v":42},{"$f":"MATCH(Calc2!H$112,Trucks!$B$49:$B216,0)","v":42},{"$f":"MATCH(Calc2!I$112,Trucks!$B$49:$B216,0)","v":42},{"$f":"MATCH(Calc2!J$112,Trucks!$B$49:$B216,0)","v":42},{"$f":"MATCH(Calc2!K$112,Trucks!$B$49:$B216,0)","v":42},{"$f":"MATCH(Calc2!L$112,Trucks!$B$49:$B216,0)","v":42},{"$f":"MATCH(Calc2!M$112,Trucks!$B$49:$B216,0)","v":42},{"$f":"MATCH(Calc2!N$112,Trucks!$B$49:$B216,0)","v":42},{"$f":"MATCH(Calc2!O$112,Trucks!$B$49:$B216,0)","v":42},{"$f":"MATCH(Calc2!P$112,Trucks!$B$49:$B216,0)","v":42},{"$f":"MATCH(Calc2!Q$112,Trucks!$B$49:$B216,0)","v":42},{"$f":"MATCH(Calc2!R$112,Trucks!$B$49:$B216,0)","v":42},{"$f":"MATCH(Calc2!S$112,Trucks!$B$49:$B216,0)","v":42},{"$f":"MATCH(Calc2!T$112,Trucks!$B$49:$B216,0)","v":42},{"$f":"MATCH(Calc2!U$112,Trucks!$B$49:$B216,0)","v":42},{"$f":"MATCH(Calc2!V$112,Trucks!$B$49:$B216,0)","v":42},{"$f":"MATCH(Calc2!W$112,Trucks!$B$49:$B216,0)","v":42},{"$f":"MATCH(Calc2!X$112,Trucks!$B$49:$B216,0)","v":42},{"$f":"MATCH(Calc2!Y$112,Trucks!$B$49:$B216,0)","v":42},{"$f":"MATCH(Calc2!Z$112,Trucks!$B$49:$B216,0)","v":42},{"$f":"MATCH(Calc2!AA$112,Trucks!$B$49:$B216,0)","v":42},{"$f":"MATCH(Calc2!AB$112,Trucks!$B$49:$B216,0)","v":42}]
[null,null,{"$f":"MATCH(Calc2!C$112,Trucks!$B$49:$B217,0)","v":6},{"$f":"MATCH(Calc2!D$112,Trucks!$B$49:$B217,0)","v":95},{"$f":"MATCH(Calc2!E$112,Trucks!$B$49:$B217,0)","v":103},{"$f":"MATCH(Calc2!F$112,Trucks!$B$49:$B217,0)","v":107},{"$f":"MATCH(Calc2!G$112,Trucks!$B$49:$B217,0)","v":42},{"$f":"MATCH(Calc2!H$112,Trucks!$B$49:$B217,0)","v":42},{"$f":"MATCH(Calc2!I$112,Trucks!$B$49:$B217,0)","v":42},{"$f":"MATCH(Calc2!J$112,Trucks!$B$49:$B217,0)","v":42},{"$f":"MATCH(Calc2!K$112,Trucks!$B$49:$B217,0)","v":42},{"$f":"MATCH(Calc2!L$112,Trucks!$B$49:$B217,0)","v":42},{"$f":"MATCH(Calc2!M$112,Trucks!$B$49:$B217,0)","v":42},{"$f":"MATCH(Calc2!N$112,Trucks!$B$49:$B217,0)","v":42},{"$f":"MATCH(Calc2!O$112,Trucks!$B$49:$B217,0)","v":42},{"$f":"MATCH(Calc2!P$112,Trucks!$B$49:$B217,0)","v":42},{"$f":"MATCH(Calc2!Q$112,Trucks!$B$49:$B217,0)","v":42},{"$f":"MATCH(Calc2!R$112,Trucks!$B$49:$B217,0)","v":42},{"$f":"MATCH(Calc2!S$112,Trucks!$B$49:$B217,0)","v":42},{"$f":"MATCH(Calc2!T$112,Trucks!$B$49:$B217,0)","v":42},{"$f":"MATCH(Calc2!U$112,Trucks!$B$49:$B217,0)","v":42},{"$f":"MATCH(Calc2!V$112,Trucks!$B$49:$B217,0)","v":42},{"$f":"MATCH(Calc2!W$112,Trucks!$B$49:$B217,0)","v":42},{"$f":"MATCH(Calc2!X$112,Trucks!$B$49:$B217,0)","v":42},{"$f":"MATCH(Calc2!Y$112,Trucks!$B$49:$B217,0)","v":42},{"$f":"MATCH(Calc2!Z$112,Trucks!$B$49:$B217,0)","v":42},{"$f":"MATCH(Calc2!AA$112,Trucks!$B$49:$B217,0)","v":42},{"$f":"MATCH(Calc2!AB$112,Trucks!$B$49:$B217,0)","v":42}]
[null,null,{"$f":"MATCH(Calc2!C$112,Trucks!$B$49:$B218,0)","v":6},{"$f":"MATCH(Calc2!D$112,Trucks!$B$49:$B218,0)","v":95},{"$f":"MATCH(Calc2!E$112,Trucks!$B$49:$B218,0)","v":103},{"$f":"MATCH(Calc2!F$112,Trucks!$B$49:$B218,0)","v":107},{"$f":"MATCH(Calc2!G$112,Trucks!$B$49:$B218,0)","v":42},{"$f":"MATCH(Calc2!H$112,Trucks!$B$49:$B218,0)","v":42},{"$f":"MATCH(Calc2!I$112,Trucks!$B$49:$B218,0)","v":42},{"$f":"MATCH(Calc2!J$112,Trucks!$B$49:$B218,0)","v":42},{"$f":"MATCH(Calc2!K$112,Trucks!$B$49:$B218,0)","v":42},{"$f":"MATCH(Calc2!L$112,Trucks!$B$49:$B218,0)","v":42},{"$f":"MATCH(Calc2!M$112,Trucks!$B$49:$B218,0)","v":42},{"$f":"MATCH(Calc2!N$112,Trucks!$B$49:$B218,0)","v":42},{"$f":"MATCH(Calc2!O$112,Trucks!$B$49:$B218,0)","v":42},{"$f":"MATCH(Calc2!P$112,Trucks!$B$49:$B218,0)","v":42},{"$f":"MATCH(Calc2!Q$112,Trucks!$B$49:$B218,0)","v":42},{"$f":"MATCH(Calc2!R$112,Trucks!$B$49:$B218,0)","v":42},{"$f":"MATCH(Calc2!S$112,Trucks!$B$49:$B218,0)","v":42},{"$f":"MATCH(Calc2!T$112,Trucks!$B$49:$B218,0)","v":42},{"$f":"MATCH(Calc2!U$112,Trucks!$B$49:$B218,0)","v":42},{"$f":"MATCH(Calc2!V$112,Trucks!$B$49:$B218,0)","v":42},{"$f":"MATCH(Calc2!W$112,Trucks!$B$49:$B218,0)","v":42},{"$f":"MATCH(Calc2!X$112,Trucks!$B$49:$B218,0)","v":42},{"$f":"MATCH(Calc2!Y$112,Trucks!$B$49:$B218,0)","v":42},{"$f":"MATCH(Calc2!Z$112,Trucks!$B$49:$B218,0)","v":42},{"$f":"MATCH(Calc2!AA$112,Trucks!$B$49:$B218,0)","v":42},{"$f":"MATCH(Calc2!AB$112,Trucks!$B$49:$B218,0)","v":42}]
[null,null,{"$f":"MATCH(Calc2!C$112,Trucks!$B$49:$B219,0)","v":6},{"$f":"MATCH(Calc2!D$112,Trucks!$B$49:$B219,0)","v":95},{"$f":"MATCH(Calc2!E$112,Trucks!$B$49:$B219,0)","v":103},{"$f":"MATCH(Calc2!F$112,Trucks!$B$49:$B219,0)","v":107},{"$f":"MATCH(Calc2!G$112,Trucks!$B$49:$B219,0)","v":42},{"$f":"MATCH(Calc2!H$112,Trucks!$B$49:$B219,0)","v":42},{"$f":"MATCH(Calc2!I$112,Trucks!$B$49:$B219,0)","v":42},{"$f":"MATCH(Calc2!J$112,Trucks!$B$49:$B219,0)","v":42},{"$f":"MATCH(Calc2!K$112,Trucks!$B$49:$B219,0)","v":42},{"$f":"MATCH(Calc2!L$112,Trucks!$B$49:$B219,0)","v":42},{"$f":"MATCH(Calc2!M$112,Trucks!$B$49:$B219,0)","v":42},{"$f":"MATCH(Calc2!N$112,Trucks!$B$49:$B219,0)","v":42},{"$f":"MATCH(Calc2!O$112,Trucks!$B$49:$B219,0)","v":42},{"$f":"MATCH(Calc2!P$112,Trucks!$B$49:$B219,0)","v":42},{"$f":"MATCH(Calc2!Q$112,Trucks!$B$49:$B219,0)","v":42},{"$f":"MATCH(Calc2!R$112,Trucks!$B$49:$B219,0)","v":42},{"$f":"MATCH(Calc2!S$112,Trucks!$B$49:$B219,0)","v":42},{"$f":"MATCH(Calc2!T$112,Trucks!$B$49:$B219,0)","v":42},{"$f":"MATCH(Calc2!U$112,Trucks!$B$49:$B219,0)","v":42},{"$f":"MATCH(Calc2!V$112,Trucks!$B$49:$B219,0)","v":42},{"$f":"MATCH(Calc2!W$112,Trucks!$B$49:$B219,0)","v":42},{"$f":"MATCH(Calc2!X$112,Trucks!$B$49:$B219,0)","v":42},{"$f":"MATCH(Calc2!Y$112,Trucks!$B$49:$B219,0)","v":42},{"$f":"MATCH(Calc2!Z$112,Trucks!$B$49:$B219,0)","v":42},{"$f":"MATCH(Calc2!AA$112,Trucks!$B$49:$B219,0)","v":42},{"$f":"MATCH(Calc2!AB$112,Trucks!$B$49:$B219,0)","v":42}]
[null,null,{"$f":"MATCH(Calc2!C$112,Trucks!$B$49:$B220,0)","v":6},{"$f":"MATCH(Calc2!D$112,Trucks!$B$49:$B220,0)","v":95},{"$f":"MATCH(Calc2!E$112,Trucks!$B$49:$B220,0)","v":103},{"$f":"MATCH(Calc2!F$112,Trucks!$B$49:$B220,0)","v":107},{"$f":"MATCH(Calc2!G$112,Trucks!$B$49:$B220,0)","v":42},{"$f":"MATCH(Calc2!H$112,Trucks!$B$49:$B220,0)","v":42},{"$f":"MATCH(Calc2!I$112,Trucks!$B$49:$B220,0)","v":42},{"$f":"MATCH(Calc2!J$112,Trucks!$B$49:$B220,0)","v":42},{"$f":"MATCH(Calc2!K$112,Trucks!$B$49:$B220,0)","v":42},{"$f":"MATCH(Calc2!L$112,Trucks!$B$49:$B220,0)","v":42},{"$f":"MATCH(Calc2!M$112,Trucks!$B$49:$B220,0)","v":42},{"$f":"MATCH(Calc2!N$112,Trucks!$B$49:$B220,0)","v":42},{"$f":"MATCH(Calc2!O$112,Trucks!$B$49:$B220,0)","v":42},{"$f":"MATCH(Calc2!P$112,Trucks!$B$49:$B220,0)","v":42},{"$f":"MATCH(Calc2!Q$112,Trucks!$B$49:$B220,0)","v":42},{"$f":"MATCH(Calc2!R$112,Trucks!$B$49:$B220,0)","v":42},{"$f":"MATCH(Calc2!S$112,Trucks!$B$49:$B220,0)","v":42},{"$f":"MATCH(Calc2!T$112,Trucks!$B$49:$B220,0)","v":42},{"$f":"MATCH(Calc2!U$112,Trucks!$B$49:$B220,0)","v":42},{"$f":"MATCH(Calc2!V$112,Trucks!$B$49:$B220,0)","v":42},{"$f":"MATCH(Calc2!W$112,Trucks!$B$49:$B220,0)","v":42},{"$f":"MATCH(Calc2!X$112,Trucks!$B$49:$B220,0)","v":42},{"$f":"MATCH(Calc2!Y$112,Trucks!$B$49:$B220,0)","v":42},{"$f":"MATCH(Calc2!Z$112,Trucks!$B$49:$B220,0)","v":42},{"$f":"MATCH(Calc2!AA$112,Trucks!$B$49:$B220,0)","v":42},{"$f":"MATCH(Calc2!AB$112,Trucks!$B$49:$B220,0)","v":42}]
[null,null,{"$f":"MATCH(Calc2!C$112,Trucks!$B$49:$B221,0)","v":6},{"$f":"MATCH(Calc2!D$112,Trucks!$B$49:$B221,0)","v":95},{"$f":"MATCH(Calc2!E$112,Trucks!$B$49:$B221,0)","v":103},{"$f":"MATCH(Calc2!F$112,Trucks!$B$49:$B221,0)","v":107},{"$f":"MATCH(Calc2!G$112,Trucks!$B$49:$B221,0)","v":42},{"$f":"MATCH(Calc2!H$112,Trucks!$B$49:$B221,0)","v":42},{"$f":"MATCH(Calc2!I$112,Trucks!$B$49:$B221,0)","v":42},{"$f":"MATCH(Calc2!J$112,Trucks!$B$49:$B221,0)","v":42},{"$f":"MATCH(Calc2!K$112,Trucks!$B$49:$B221,0)","v":42},{"$f":"MATCH(Calc2!L$112,Trucks!$B$49:$B221,0)","v":42},{"$f":"MATCH(Calc2!M$112,Trucks!$B$49:$B221,0)","v":42},{"$f":"MATCH(Calc2!N$112,Trucks!$B$49:$B221,0)","v":42},{"$f":"MATCH(Calc2!O$112,Trucks!$B$49:$B221,0)","v":42},{"$f":"MATCH(Calc2!P$112,Trucks!$B$49:$B221,0)","v":42},{"$f":"MATCH(Calc2!Q$112,Trucks!$B$49:$B221,0)","v":42},{"$f":"MATCH(Calc2!R$112,Trucks!$B$49:$B221,0)","v":42},{"$f":"MATCH(Calc2!S$112,Trucks!$B$49:$B221,0)","v":42},{"$f":"MATCH(Calc2!T$112,Trucks!$B$49:$B221,0)","v":42},{"$f":"MATCH(Calc2!U$112,Trucks!$B$49:$B221,0)","v":42},{"$f":"MATCH(Calc2!V$112,Trucks!$B$49:$B221,0)","v":42},{"$f":"MATCH(Calc2!W$112,Trucks!$B$49:$B221,0)","v":42},{"$f":"MATCH(Calc2!X$112,Trucks!$B$49:$B221,0)","v":42},{"$f":"MATCH(Calc2!Y$112,Trucks!$B$49:$B221,0)","v":42},{"$f":"MATCH(Calc2!Z$112,Trucks!$B$49:$B221,0)","v":42},{"$f":"MATCH(Calc2!AA$112,Trucks!$B$49:$B221,0)","v":42},{"$f":"MATCH(Calc2!AB$112,Trucks!$B$49:$B221,0)","v":42}]
[null,null,{"$f":"MATCH(Calc2!C$112,Trucks!$B$49:$B222,0)","v":6},{"$f":"MATCH(Calc2!D$112,Trucks!$B$49:$B222,0)","v":95},{"$f":"MATCH(Calc2!E$112,Trucks!$B$49:$B222,0)","v":103},{"$f":"MATCH(Calc2!F$112,Trucks!$B$49:$B222,0)","v":107},{"$f":"MATCH(Calc2!G$112,Trucks!$B$49:$B222,0)","v":42},{"$f":"MATCH(Calc2!H$112,Trucks!$B$49:$B222,0)","v":42},{"$f":"MATCH(Calc2!I$112,Trucks!$B$49:$B222,0)","v":42},{"$f":"MATCH(Calc2!J$112,Trucks!$B$49:$B222,0)","v":42},{"$f":"MATCH(Calc2!K$112,Trucks!$B$49:$B222,0)","v":42},{"$f":"MATCH(Calc2!L$112,Trucks!$B$49:$B222,0)","v":42},{"$f":"MATCH(Calc2!M$112,Trucks!$B$49:$B222,0)","v":42},{"$f":"MATCH(Calc2!N$112,Trucks!$B$49:$B222,0)","v":42},{"$f":"MATCH(Calc2!O$112,Trucks!$B$49:$B222,0)","v":42},{"$f":"MATCH(Calc2!P$112,Trucks!$B$49:$B222,0)","v":42},{"$f":"MATCH(Calc2!Q$112,Trucks!$B$49:$B222,0)","v":42},{"$f":"MATCH(Calc2!R$112,Trucks!$B$49:$B222,0)","v":42},{"$f":"MATCH(Calc2!S$112,Trucks!$B$49:$B222,0)","v":42},{"$f":"MATCH(Calc2!T$112,Trucks!$B$49:$B222,0)","v":42},{"$f":"MATCH(Calc2!U$112,Trucks!$B$49:$B222,0)","v":42},{"$f":"MATCH(Calc2!V$112,Trucks!$B$49:$B222,0)","v":42},{"$f":"MATCH(Calc2!W$112,Trucks!$B$49:$B222,0)","v":42},{"$f":"MATCH(Calc2!X$112,Trucks!$B$49:$B222,0)","v":42},{"$f":"MATCH(Calc2!Y$112,Trucks!$B$49:$B222,0)","v":42},{"$f":"MATCH(Calc2!Z$112,Trucks!$B$49:$B222,0)","v":42},{"$f":"MATCH(Calc2!AA$112,Trucks!$B$49:$B222,0)","v":42},{"$f":"MATCH(Calc2!AB$112,Trucks!$B$49:$B222,0)","v":42}]
[null,null,{"$f":"MATCH(Calc2!C$112,Trucks!$B$49:$B223,0)","v":6},{"$f":"MATCH(Calc2!D$112,Trucks!$B$49:$B223,0)","v":95},{"$f":"MATCH(Calc2!E$112,Trucks!$B$49:$B223,0)","v":103},{"$f":"MATCH(Calc2!F$112,Trucks!$B$49:$B223,0)","v":107},{"$f":"MATCH(Calc2!G$112,Trucks!$B$49:$B223,0)","v":42},{"$f":"MATCH(Calc2!H$112,Trucks!$B$49:$B223,0)","v":42},{"$f":"MATCH(Calc2!I$112,Trucks!$B$49:$B223,0)","v":42},{"$f":"MATCH(Calc2!J$112,Trucks!$B$49:$B223,0)","v":42},{"$f":"MATCH(Calc2!K$112,Trucks!$B$49:$B223,0)","v":42},{"$f":"MATCH(Calc2!L$112,Trucks!$B$49:$B223,0)","v":42},{"$f":"MATCH(Calc2!M$112,Trucks!$B$49:$B223,0)","v":42},{"$f":"MATCH(Calc2!N$112,Trucks!$B$49:$B223,0)","v":42},{"$f":"MATCH(Calc2!O$112,Trucks!$B$49:$B223,0)","v":42},{"$f":"MATCH(Calc2!P$112,Trucks!$B$49:$B223,0)","v":42},{"$f":"MATCH(Calc2!Q$112,Trucks!$B$49:$B223,0)","v":42},{"$f":"MATCH(Calc2!R$112,Trucks!$B$49:$B223,0)","v":42},{"$f":"MATCH(Calc2!S$112,Trucks!$B$49:$B223,0)","v":42},{"$f":"MATCH(Calc2!T$112,Trucks!$B$49:$B223,0)","v":42},{"$f":"MATCH(Calc2!U$112,Trucks!$B$49:$B223,0)","v":42},{"$f":"MATCH(Calc2!V$112,Trucks!$B$49:$B223,0)","v":42},{"$f":"MATCH(Calc2!W$112,Trucks!$B$49:$B223,0)","v":42},{"$f":"MATCH(Calc2!X$112,Trucks!$B$49:$B223,0)","v":42},{"$f":"MATCH(Calc2!Y$112,Trucks!$B$49:$B223,0)","v":42},{"$f":"MATCH(Calc2!Z$112,Trucks!$B$49:$B223,0)","v":42},{"$f":"MATCH(Calc2!AA$112,Trucks!$B$49:$B223,0)","v":42},{"$f":"MATCH(Calc2!AB$112,Trucks!$B$49:$B223,0)","v":42}]
[null,null,{"$f":"MATCH(Calc2!C$112,Trucks!$B$49:$B224,0)","v":6},{"$f":"MATCH(Calc2!D$112,Trucks!$B$49:$B224,0)","v":95},{"$f":"MATCH(Calc2!E$112,Trucks!$B$49:$B224,0)","v":103},{"$f":"MATCH(Calc2!F$112,Trucks!$B$49:$B224,0)","v":107},{"$f":"MATCH(Calc2!G$112,Trucks!$B$49:$B224,0)","v":42},{"$f":"MATCH(Calc2!H$112,Trucks!$B$49:$B224,0)","v":42},{"$f":"MATCH(Calc2!I$112,Trucks!$B$49:$B224,0)","v":42},{"$f":"MATCH(Calc2!J$112,Trucks!$B$49:$B224,0)","v":42},{"$f":"MATCH(Calc2!K$112,Trucks!$B$49:$B224,0)","v":42},{"$f":"MATCH(Calc2!L$112,Trucks!$B$49:$B224,0)","v":42},{"$f":"MATCH(Calc2!M$112,Trucks!$B$49:$B224,0)","v":42},{"$f":"MATCH(Calc2!N$112,Trucks!$B$49:$B224,0)","v":42},{"$f":"MATCH(Calc2!O$112,Trucks!$B$49:$B224,0)","v":42},{"$f":"MATCH(Calc2!P$112,Trucks!$B$49:$B224,0)","v":42},{"$f":"MATCH(Calc2!Q$112,Trucks!$B$49:$B224,0)","v":42},{"$f":"MATCH(Calc2!R$112,Trucks!$B$49:$B224,0)","v":42},{"$f":"MATCH(Calc2!S$112,Trucks!$B$49:$B224,0)","v":42},{"$f":"MATCH(Calc2!T$112,Trucks!$B$49:$B224,0)","v":42},{"$f":"MATCH(Calc2!U$112,Trucks!$B$49:$B224,0)","v":42},{"$f":"MATCH(Calc2!V$112,Trucks!$B$49:$B224,0)","v":42},{"$f":"MATCH(Calc2!W$112,Trucks!$B$49:$B224,0)","v":42},{"$f":"MATCH(Calc2!X$112,Trucks!$B$49:$B224,0)","v":42},{"$f":"MATCH(Calc2!Y$112,Trucks!$B$49:$B224,0)","v":42},{"$f":"MATCH(Calc2!Z$112,Trucks!$B$49:$B224,0)","v":42},{"$f":"MATCH(Calc2!AA$112,Trucks!$B$49:$B224,0)","v":42},{"$f":"MATCH(Calc2!AB$112,Trucks!$B$49:$B224,0)","v":42}]
[null,null,{"$f":"MATCH(Calc2!C$112,Trucks!$B$49:$B225,0)","v":6},{"$f":"MATCH(Calc2!D$112,Trucks!$B$49:$B225,0)","v":95},{"$f":"MATCH(Calc2!E$112,Trucks!$B$49:$B225,0)","v":103},{"$f":"MATCH(Calc2!F$112,Trucks!$B$49:$B225,0)","v":107},{"$f":"MATCH(Calc2!G$112,Trucks!$B$49:$B225,0)","v":42},{"$f":"MATCH(Calc2!H$112,Trucks!$B$49:$B225,0)","v":42},{"$f":"MATCH(Calc2!I$112,Trucks!$B$49:$B225,0)","v":42},{"$f":"MATCH(Calc2!J$112,Trucks!$B$49:$B225,0)","v":42},{"$f":"MATCH(Calc2!K$112,Trucks!$B$49:$B225,0)","v":42},{"$f":"MATCH(Calc2!L$112,Trucks!$B$49:$B225,0)","v":42},{"$f":"MATCH(Calc2!M$112,Trucks!$B$49:$B225,0)","v":42},{"$f":"MATCH(Calc2!N$112,Trucks!$B$49:$B225,0)","v":42},{"$f":"MATCH(Calc2!O$112,Trucks!$B$49:$B225,0)","v":42},{"$f":"MATCH(Calc2!P$112,Trucks!$B$49:$B225,0)","v":42},{"$f":"MATCH(Calc2!Q$112,Trucks!$B$49:$B225,0)","v":42},{"$f":"MATCH(Calc2!R$112,Trucks!$B$49:$B225,0)","v":42},{"$f":"MATCH(Calc2!S$112,Trucks!$B$49:$B225,0)","v":42},{"$f":"MATCH(Calc2!T$112,Trucks!$B$49:$B225,0)","v":42},{"$f":"MATCH(Calc2!U$112,Trucks!$B$49:$B225,0)","v":42},{"$f":"MATCH(Calc2!V$112,Trucks!$B$49:$B225,0)","v":42},{"$f":"MATCH(Calc2!W$112,Trucks!$B$49:$B225,0)","v":42},{"$f":"MATCH(Calc2!X$112,Trucks!$B$49:$B225,0)","v":42},{"$f":"MATCH(Calc2!Y$112,Trucks!$B$49:$B225,0)","v":42},{"$f":"MATCH(Calc2!Z$112,Trucks!$B$49:$B225,0)","v":42},{"$f":"MATCH(Calc2!AA$112,Trucks!$B$49:$B225,0)","v":42},{"$f":"MATCH(Calc2!AB$112,Trucks!$B$49:$B225,0)","v":42}]
[null,null,{"$f":"MATCH(Calc2!C$112,Trucks!$B$49:$B226,0)","v":6},{"$f":"MATCH(Calc2!D$112,Trucks!$B$49:$B226,0)","v":95},{"$f":"MATCH(Calc2!E$112,Trucks!$B$49:$B226,0)","v":103},{"$f":"MATCH(Calc2!F$112,Trucks!$B$49:$B226,0)","v":107},{"$f":"MATCH(Calc2!G$112,Trucks!$B$49:$B226,0)","v":42},{"$f":"MATCH(Calc2!H$112,Trucks!$B$49:$B226,0)","v":42},{"$f":"MATCH(Calc2!I$112,Trucks!$B$49:$B226,0)","v":42},{"$f":"MATCH(Calc2!J$112,Trucks!$B$49:$B226,0)","v":42},{"$f":"MATCH(Calc2!K$112,Trucks!$B$49:$B226,0)","v":42},{"$f":"MATCH(Calc2!L$112,Trucks!$B$49:$B226,0)","v":42},{"$f":"MATCH(Calc2!M$112,Trucks!$B$49:$B226,0)","v":42},{"$f":"MATCH(Calc2!N$112,Trucks!$B$49:$B226,0)","v":42},{"$f":"MATCH(Calc2!O$112,Trucks!$B$49:$B226,0)","v":42},{"$f":"MATCH(Calc2!P$112,Trucks!$B$49:$B226,0)","v":42},{"$f":"MATCH(Calc2!Q$112,Trucks!$B$49:$B226,0)","v":42},{"$f":"MATCH(Calc2!R$112,Trucks!$B$49:$B226,0)","v":42},{"$f":"MATCH(Calc2!S$112,Trucks!$B$49:$B226,0)","v":42},{"$f":"MATCH(Calc2!T$112,Trucks!$B$49:$B226,0)","v":42},{"$f":"MATCH(Calc2!U$112,Trucks!$B$49:$B226,0)","v":42},{"$f":"MATCH(Calc2!V$112,Trucks!$B$49:$B226,0)","v":42},{"$f":"MATCH(Calc2!W$112,Trucks!$B$49:$B226,0)","v":42},{"$f":"MATCH(Calc2!X$112,Trucks!$B$49:$B226,0)","v":42},{"$f":"MATCH(Calc2!Y$112,Trucks!$B$49:$B226,0)","v":42},{"$f":"MATCH(Calc2!Z$112,Trucks!$B$49:$B226,0)","v":42},{"$f":"MATCH(Calc2!AA$112,Trucks!$B$49:$B226,0)","v":42},{"$f":"MATCH(Calc2!AB$112,Trucks!$B$49:$B226,0)","v":42}]
[null,null,{"$f":"MATCH(Calc2!C$112,Trucks!$B$49:$B227,0)","v":6},{"$f":"MATCH(Calc2!D$112,Trucks!$B$49:$B227,0)","v":95},{"$f":"MATCH(Calc2!E$112,Trucks!$B$49:$B227,0)","v":103},{"$f":"MATCH(Calc2!F$112,Trucks!$B$49:$B227,0)","v":107},{"$f":"MATCH(Calc2!G$112,Trucks!$B$49:$B227,0)","v":42},{"$f":"MATCH(Calc2!H$112,Trucks!$B$49:$B227,0)","v":42},{"$f":"MATCH(Calc2!I$112,Trucks!$B$49:$B227,0)","v":42},{"$f":"MATCH(Calc2!J$112,Trucks!$B$49:$B227,0)","v":42},{"$f":"MATCH(Calc2!K$112,Trucks!$B$49:$B227,0)","v":42},{"$f":"MATCH(Calc2!L$112,Trucks!$B$49:$B227,0)","v":42},{"$f":"MATCH(Calc2!M$112,Trucks!$B$49:$B227,0)","v":42},{"$f":"MATCH(Calc2!N$112,Trucks!$B$49:$B227,0)","v":42},{"$f":"MATCH(Calc2!O$112,Trucks!$B$49:$B227,0)","v":42},{"$f":"MATCH(Calc2!P$112,Trucks!$B$49:$B227,0)","v":42},{"$f":"MATCH(Calc2!Q$112,Trucks!$B$49:$B227,0)","v":42},{"$f":"MATCH(Calc2!R$112,Trucks!$B$49:$B227,0)","v":42},{"$f":"MATCH(Calc2!S$112,Trucks!$B$49:$B227,0)","v":42},{"$f":"MATCH(Calc2!T$112,Trucks!$B$49:$B227,0)","v":42},{"$f":"MATCH(Calc2!U$112,Trucks!$B$49:$B227,0)","v":42},{"$f":"MATCH(Calc2!V$112,Trucks!$B$49:$B227,0)","v":42},{"$f":"MATCH(Calc2!W$112,Trucks!$B$49:$B227,0)","v":42},{"$f":"MATCH(Calc2!X$112,Trucks!$B$49:$B227,0)","v":42},{"$f":"MATCH(Calc2!Y$112,Trucks!$B$49:$B227,0)","v":42},{"$f":"MATCH(Calc2!Z$112,Trucks!$B$49:$B227,0)","v":42},{"$f":"MATCH(Calc2!AA$112,Trucks!$B$49:$B227,0)","v":42},{"$f":"MATCH(Calc2!AB$112,Trucks!$B$49:$B227,0)","v":42}]
[null,null,{"$f":"MATCH(Calc2!C$112,Trucks!$B$49:$B228,0)","v":6},{"$f":"MATCH(Calc2!D$112,Trucks!$B$49:$B228,0)","v":95},{"$f":"MATCH(Calc2!E$112,Trucks!$B$49:$B228,0)","v":103},{"$f":"MATCH(Calc2!F$112,Trucks!$B$49:$B228,0)","v":107},{"$f":"MATCH(Calc2!G$112,Trucks!$B$49:$B228,0)","v":42},{"$f":"MATCH(Calc2!H$112,Trucks!$B$49:$B228,0)","v":42},{"$f":"MATCH(Calc2!I$112,Trucks!$B$49:$B228,0)","v":42},{"$f":"MATCH(Calc2!J$112,Trucks!$B$49:$B228,0)","v":42},{"$f":"MATCH(Calc2!K$112,Trucks!$B$49:$B228,0)","v":42},{"$f":"MATCH(Calc2!L$112,Trucks!$B$49:$B228,0)","v":42},{"$f":"MATCH(Calc2!M$112,Trucks!$B$49:$B228,0)","v":42},{"$f":"MATCH(Calc2!N$112,Trucks!$B$49:$B228,0)","v":42},{"$f":"MATCH(Calc2!O$112,Trucks!$B$49:$B228,0)","v":42},{"$f":"MATCH(Calc2!P$112,Trucks!$B$49:$B228,0)","v":42},{"$f":"MATCH(Calc2!Q$112,Trucks!$B$49:$B228,0)","v":42},{"$f":"MATCH(Calc2!R$112,Trucks!$B$49:$B228,0)","v":42},{"$f":"MATCH(Calc2!S$112,Trucks!$B$49:$B228,0)","v":42},{"$f":"MATCH(Calc2!T$112,Trucks!$B$49:$B228,0)","v":42},{"$f":"MATCH(Calc2!U$112,Trucks!$B$49:$B228,0)","v":42},{"$f":"MATCH(Calc2!V$112,Trucks!$B$49:$B228,0)","v":42},{"$f":"MATCH(Calc2!W$112,Trucks!$B$49:$B228,0)","v":42},{"$f":"MATCH(Calc2!X$112,Trucks!$B$49:$B228,0)","v":42},{"$f":"MATCH(Calc2!Y$112,Trucks!$B$49:$B228,0)","v":42},{"$f":"MATCH(Calc2!Z$112,Trucks!$B$49:$B228,0)","v":42},{"$f":"MATCH(Calc2!AA$112,Trucks!$B$49:$B228,0)","v":42},{"$f":"MATCH(Calc2!AB$112,Trucks!$B$49:$B228,0)","v":42}]
[null,null,{"$f":"MATCH(Calc2!C$112,Trucks!$B$49:$B229,0)","v":6},{"$f":"MATCH(Calc2!D$112,Trucks!$B$49:$B229,0)","v":95},{"$f":"MATCH(Calc2!E$112,Trucks!$B$49:$B229,0)","v":103},{"$f":"MATCH(Calc2!F$112,Trucks!$B$49:$B229,0)","v":107},{"$f":"MATCH(Calc2!G$112,Trucks!$B$49:$B229,0)","v":42},{"$f":"MATCH(Calc2!H$112,Trucks!$B$49:$B229,0)","v":42},{"$f":"MATCH(Calc2!I$112,Trucks!$B$49:$B229,0)","v":42},{"$f":"MATCH(Calc2!J$112,Trucks!$B$49:$B229,0)","v":42},{"$f":"MATCH(Calc2!K$112,Trucks!$B$49:$B229,0)","v":42},{"$f":"MATCH(Calc2!L$112,Trucks!$B$49:$B229,0)","v":42},{"$f":"MATCH(Calc2!M$112,Trucks!$B$49:$B229,0)","v":42},{"$f":"MATCH(Calc2!N$112,Trucks!$B$49:$B229,0)","v":42},{"$f":"MATCH(Calc2!O$112,Trucks!$B$49:$B229,0)","v":42},{"$f":"MATCH(Calc2!P$112,Trucks!$B$49:$B229,0)","v":42},{"$f":"MATCH(Calc2!Q$112,Trucks!$B$49:$B229,0)","v":42},{"$f":"MATCH(Calc2!R$112,Trucks!$B$49:$B229,0)","v":42},{"$f":"MATCH(Calc2!S$112,Trucks!$B$49:$B229,0)","v":42},{"$f":"MATCH(Calc2!T$112,Trucks!$B$49:$B229,0)","v":42},{"$f":"MATCH(Calc2!U$112,Trucks!$B$49:$B229,0)","v":42},{"$f":"MATCH(Calc2!V$112,Trucks!$B$49:$B229,0)","v":42},{"$f":"MATCH(Calc2!W$112,Trucks!$B$49:$B229,0)","v":42},{"$f":"MATCH(Calc2!X$112,Trucks!$B$49:$B229,0)","v":42},{"$f":"MATCH(Calc2!Y$112,Trucks!$B$49:$B229,0)","v":42},{"$f":"MATCH(Calc2!Z$112,Trucks!$B$49:$B229,0)","v":42},{"$f":"MATCH(Calc2!AA$112,Trucks!$B$49:$B229,0)","v":42},{"$f":"MATCH(Calc2!AB$112,Trucks!$B$49:$B229,0)","v":42}]
[null,null,{"$f":"MATCH(Calc2!C$112,Trucks!$B$49:$B230,0)","v":6},{"$f":"MATCH(Calc2!D$112,Trucks!$B$49:$B230,0)","v":95},{"$f":"MATCH(Calc2!E$112,Trucks!$B$49:$B230,0)","v":103},{"$f":"MATCH(Calc2!F$112,Trucks!$B$49:$B230,0)","v":107},{"$f":"MATCH(Calc2!G$112,Trucks!$B$49:$B230,0)","v":42},{"$f":"MATCH(Calc2!H$112,Trucks!$B$49:$B230,0)","v":42},{"$f":"MATCH(Calc2!I$112,Trucks!$B$49:$B230,0)","v":42},{"$f":"MATCH(Calc2!J$112,Trucks!$B$49:$B230,0)","v":42},{"$f":"MATCH(Calc2!K$112,Trucks!$B$49:$B230,0)","v":42},{"$f":"MATCH(Calc2!L$112,Trucks!$B$49:$B230,0)","v":42},{"$f":"MATCH(Calc2!M$112,Trucks!$B$49:$B230,0)","v":42},{"$f":"MATCH(Calc2!N$112,Trucks!$B$49:$B230,0)","v":42},{"$f":"MATCH(Calc2!O$112,Trucks!$B$49:$B230,0)","v":42},{"$f":"MATCH(Calc2!P$112,Trucks!$B$49:$B230,0)","v":42},{"$f":"MATCH(Calc2!Q$112,Trucks!$B$49:$B230,0)","v":42},{"$f":"MATCH(Calc2!R$112,Trucks!$B$49:$B230,0)","v":42},{"$f":"MATCH(Calc2!S$112,Trucks!$B$49:$B230,0)","v":42},{"$f":"MATCH(Calc2!T$112,Trucks!$B$49:$B230,0)","v":42},{"$f":"MATCH(Calc2!U$112,Trucks!$B$49:$B230,0)","v":42},{"$f":"MATCH(Calc2!V$112,Trucks!$B$49:$B230,0)","v":42},{"$f":"MATCH(Calc2!W$112,Trucks!$B$49:$B230,0)","v":42},{"$f":"MATCH(Calc2!X$112,Trucks!$B$49:$B230,0)","v":42},{"$f":"MATCH(Calc2!Y$112,Trucks!$B$49:$B230,0)","v":42},{"$f":"MATCH(Calc2!Z$112,Trucks!$B$49:$B230,0)","v":42},{"$f":"MATCH(Calc2!AA$112,Trucks!$B$49:$B230,0)","v":42},{"$f":"MATCH(Calc2!AB$112,Trucks!$B$49:$B230,0)","v":42}]
[null,null,{"$f":"MATCH(Calc2!C$112,Trucks!$B$49:$B231,0)","v":6},{"$f":"MATCH(Calc2!D$112,Trucks!$B$49:$B231,0)","v":95},{"$f":"MATCH(Calc2!E$112,Trucks!$B$49:$B231,0)","v":103},{"$f":"MATCH(Calc2!F$112,Trucks!$B$49:$B231,0)","v":107},{"$f":"MATCH(Calc2!G$112,Trucks!$B$49:$B231,0)","v":42},{"$f":"MATCH(Calc2!H$112,Trucks!$B$49:$B231,0)","v":42},{"$f":"MATCH(Calc2!I$112,Trucks!$B$49:$B231,0)","v":42},{"$f":"MATCH(Calc2!J$112,Trucks!$B$49:$B231,0)","v":42},{"$f":"MATCH(Calc2!K$112,Trucks!$B$49:$B231,0)","v":42},{"$f":"MATCH(Calc2!L$112,Trucks!$B$49:$B231,0)","v":42},{"$f":"MATCH(Calc2!M$112,Trucks!$B$49:$B231,0)","v":42},{"$f":"MATCH(Calc2!N$112,Trucks!$B$49:$B231,0)","v":42},{"$f":"MATCH(Calc2!O$112,Trucks!$B$49:$B231,0)","v":42},{"$f":"MATCH(Calc2!P$112,Trucks!$B$49:$B231,0)","v":42},{"$f":"MATCH(Calc2!Q$112,Trucks!$B$49:$B231,0)","v":42},{"$f":"MATCH(Calc2!R$112,Trucks!$B$49:$B231,0)","v":42},{"$f":"MATCH(Calc2!S$112,Trucks!$B$49:$B231,0)","v":42},{"$f":"MATCH(Calc2!T$112,Trucks!$B$49:$B231,0)","v":42},{"$f":"MATCH(Calc2!U$112,Trucks!$B$49:$B231,0)","v":42},{"$f":"MATCH(Calc2!V$112,Trucks!$B$49:$B231,0)","v":42},{"$f":"MATCH(Calc2!W$112,Trucks!$B$49:$B231,0)","v":42},{"$f":"MATCH(Calc2!X$112,Trucks!$B$49:$B231,0)","v":42},{"$f":"MATCH(Calc2!Y$112,Trucks!$B$49:$B231,0)","v":42},{"$f":"MATCH(Calc2!Z$112,Trucks!$B$49:$B231,0)","v":42},{"$f":"MATCH(Calc2!AA$112,Trucks!$B$49:$B231,0)","v":42},{"$f":"MATCH(Calc2!AB$112,Trucks!$B$49:$B231,0)","v":42}]
[null,null,{"$f":"MATCH(Calc2!C$112,Trucks!$B$49:$B232,0)","v":6},{"$f":"MATCH(Calc2!D$112,Trucks!$B$49:$B232,0)","v":95},{"$f":"MATCH(Calc2!E$112,Trucks!$B$49:$B232,0)","v":103},{"$f":"MATCH(Calc2!F$112,Trucks!$B$49:$B232,0)","v":107},{"$f":"MATCH(Calc2!G$112,Trucks!$B$49:$B232,0)","v":42},{"$f":"MATCH(Calc2!H$112,Trucks!$B$49:$B232,0)","v":42},{"$f":"MATCH(Calc2!I$112,Trucks!$B$49:$B232,0)","v":42},{"$f":"MATCH(Calc2!J$112,Trucks!$B$49:$B232,0)","v":42},{"$f":"MATCH(Calc2!K$112,Trucks!$B$49:$B232,0)","v":42},{"$f":"MATCH(Calc2!L$112,Trucks!$B$49:$B232,0)","v":42},{"$f":"MATCH(Calc2!M$112,Trucks!$B$49:$B232,0)","v":42},{"$f":"MATCH(Calc2!N$112,Trucks!$B$49:$B232,0)","v":42},{"$f":"MATCH(Calc2!O$112,Trucks!$B$49:$B232,0)","v":42},{"$f":"MATCH(Calc2!P$112,Trucks!$B$49:$B232,0)","v":42},{"$f":"MATCH(Calc2!Q$112,Trucks!$B$49:$B232,0)","v":42},{"$f":"MATCH(Calc2!R$112,Trucks!$B$49:$B232,0)","v":42},{"$f":"MATCH(Calc2!S$112,Trucks!$B$49:$B232,0)","v":42},{"$f":"MATCH(Calc2!T$112,Trucks!$B$49:$B232,0)","v":42},{"$f":"MATCH(Calc2!U$112,Trucks!$B$49:$B232,0)","v":42},{"$f":"MATCH(Calc2!V$112,Trucks!$B$49:$B232,0)","v":42},{"$f":"MATCH(Calc2!W$112,Trucks!$B$49:$B232,0)","v":42},{"$f":"MATCH(Calc2!X$112,Trucks!$B$49:$B232,0)","v":42},{"$f":"MATCH(Calc2!Y$112,Trucks!$B$49:$B232,0)","v":42},{"$f":"MATCH(Calc2!Z$112,Trucks!$B$49:$B232,0)","v":42},{"$f":"MATCH(Calc2!AA$112,Trucks!$B$49:$B232,0)","v":42},{"$f":"MATCH(Calc2!AB$112,Trucks!$B$49:$B232,0)","v":42}]
[null,null,{"$f":"MATCH(Calc2!C$112,Trucks!$B$49:$B233,0)","v":6},{"$f":"MATCH(Calc2!D$112,Trucks!$B$49:$B233,0)","v":95},{"$f":"MATCH(Calc2!E$112,Trucks!$B$49:$B233,0)","v":103},{"$f":"MATCH(Calc2!F$112,Trucks!$B$49:$B233,0)","v":107},{"$f":"MATCH(Calc2!G$112,Trucks!$B$49:$B233,0)","v":42},{"$f":"MATCH(Calc2!H$112,Trucks!$B$49:$B233,0)","v":42},{"$f":"MATCH(Calc2!I$112,Trucks!$B$49:$B233,0)","v":42},{"$f":"MATCH(Calc2!J$112,Trucks!$B$49:$B233,0)","v":42},{"$f":"MATCH(Calc2!K$112,Trucks!$B$49:$B233,0)","v":42},{"$f":"MATCH(Calc2!L$112,Trucks!$B$49:$B233,0)","v":42},{"$f":"MATCH(Calc2!M$112,Trucks!$B$49:$B233,0)","v":42},{"$f":"MATCH(Calc2!N$112,Trucks!$B$49:$B233,0)","v":42},{"$f":"MATCH(Calc2!O$112,Trucks!$B$49:$B233,0)","v":42},{"$f":"MATCH(Calc2!P$112,Trucks!$B$49:$B233,0)","v":42},{"$f":"MATCH(Calc2!Q$112,Trucks!$B$49:$B233,0)","v":42},{"$f":"MATCH(Calc2!R$112,Trucks!$B$49:$B233,0)","v":42},{"$f":"MATCH(Calc2!S$112,Trucks!$B$49:$B233,0)","v":42},{"$f":"MATCH(Calc2!T$112,Trucks!$B$49:$B233,0)","v":42},{"$f":"MATCH(Calc2!U$112,Trucks!$B$49:$B233,0)","v":42},{"$f":"MATCH(Calc2!V$112,Trucks!$B$49:$B233,0)","v":42},{"$f":"MATCH(Calc2!W$112,Trucks!$B$49:$B233,0)","v":42},{"$f":"MATCH(Calc2!X$112,Trucks!$B$49:$B233,0)","v":42},{"$f":"MATCH(Calc2!Y$112,Trucks!$B$49:$B233,0)","v":42},{"$f":"MATCH(Calc2!Z$112,Trucks!$B$49:$B233,0)","v":42},{"$f":"MATCH(Calc2!AA$112,Trucks!$B$49:$B233,0)","v":42},{"$f":"MATCH(Calc2!AB$112,Trucks!$B$49:$B233,0)","v":42}]
[null,null,{"$f":"MATCH(Calc2!C$112,Trucks!$B$49:$B234,0)","v":6},{"$f":"MATCH(Calc2!D$112,Trucks!$B$49:$B234,0)","v":95},{"$f":"MATCH(Calc2!E$112,Trucks!$B$49:$B234,0)","v":103},{"$f":"MATCH(Calc2!F$112,Trucks!$B$49:$B234,0)","v":107},{"$f":"MATCH(Calc2!G$112,Trucks!$B$49:$B234,0)","v":42},{"$f":"MATCH(Calc2!H$112,Trucks!$B$49:$B234,0)","v":42},{"$f":"MATCH(Calc2!I$112,Trucks!$B$49:$B234,0)","v":42},{"$f":"MATCH(Calc2!J$112,Trucks!$B$49:$B234,0)","v":42},{"$f":"MATCH(Calc2!K$112,Trucks!$B$49:$B234,0)","v":42},{"$f":"MATCH(Calc2!L$112,Trucks!$B$49:$B234,0)","v":42},{"$f":"MATCH(Calc2!M$112,Trucks!$B$49:$B234,0)","v":42},{"$f":"MATCH(Calc2!N$112,Trucks!$B$49:$B234,0)","v":42},{"$f":"MATCH(Calc2!O$112,Trucks!$B$49:$B234,0)","v":42},{"$f":"MATCH(Calc2!P$112,Trucks!$B$49:$B234,0)","v":42},{"$f":"MATCH(Calc2!Q$112,Trucks!$B$49:$B234,0)","v":42},{"$f":"MATCH(Calc2!R$112,Trucks!$B$49:$B234,0)","v":42},{"$f":"MATCH(Calc2!S$112,Trucks!$B$49:$B234,0)","v":42},{"$f":"MATCH(Calc2!T$112,Trucks!$B$49:$B234,0)","v":42},{"$f":"MATCH(Calc2!U$112,Trucks!$B$49:$B234,0)","v":42},{"$f":"MATCH(Calc2!V$112,Trucks!$B$49:$B234,0)","v":42},{"$f":"MATCH(Calc2!W$112,Trucks!$B$49:$B234,0)","v":42},{"$f":"MATCH(Calc2!X$112,Trucks!$B$49:$B234,0)","v":42},{"$f":"MATCH(Calc2!Y$112,Trucks!$B$49:$B234,0)","v":42},{"$f":"MATCH(Calc2!Z$112,Trucks!$B$49:$B234,0)","v":42},{"$f":"MATCH(Calc2!AA$112,Trucks!$B$49:$B234,0)","v":42},{"$f":"MATCH(Calc2!AB$112,Trucks!$B$49:$B234,0)","v":42}]
[null,null,{"$f":"MATCH(Calc2!C$112,Trucks!$B$49:$B235,0)","v":6},{"$f":"MATCH(Calc2!D$112,Trucks!$B$49:$B235,0)","v":95},{"$f":"MATCH(Calc2!E$112,Trucks!$B$49:$B235,0)","v":103},{"$f":"MATCH(Calc2!F$112,Trucks!$B$49:$B235,0)","v":107},{"$f":"MATCH(Calc2!G$112,Trucks!$B$49:$B235,0)","v":42},{"$f":"MATCH(Calc2!H$112,Trucks!$B$49:$B235,0)","v":42},{"$f":"MATCH(Calc2!I$112,Trucks!$B$49:$B235,0)","v":42},{"$f":"MATCH(Calc2!J$112,Trucks!$B$49:$B235,0)","v":42},{"$f":"MATCH(Calc2!K$112,Trucks!$B$49:$B235,0)","v":42},{"$f":"MATCH(Calc2!L$112,Trucks!$B$49:$B235,0)","v":42},{"$f":"MATCH(Calc2!M$112,Trucks!$B$49:$B235,0)","v":42},{"$f":"MATCH(Calc2!N$112,Trucks!$B$49:$B235,0)","v":42},{"$f":"MATCH(Calc2!O$112,Trucks!$B$49:$B235,0)","v":42},{"$f":"MATCH(Calc2!P$112,Trucks!$B$49:$B235,0)","v":42},{"$f":"MATCH(Calc2!Q$112,Trucks!$B$49:$B235,0)","v":42},{"$f":"MATCH(Calc2!R$112,Trucks!$B$49:$B235,0)","v":42},{"$f":"MATCH(Calc2!S$112,Trucks!$B$49:$B235,0)","v":42},{"$f":"MATCH(Calc2!T$112,Trucks!$B$49:$B235,0)","v":42},{"$f":"MATCH(Calc2!U$112,Trucks!$B$49:$B235,0)","v":42},{"$f":"MATCH(Calc2!V$112,Trucks!$B$49:$B235,0)","v":42},{"$f":"MATCH(Calc2!W$112,Trucks!$B$49:$B235,0)","v":42},{"$f":"MATCH(Calc2!X$112,Trucks!$B$49:$B235,0)","v":42},{"$f":"MATCH(Calc2!Y$112,Trucks!$B$49:$B235,0)","v":42},{"$f":"MATCH(Calc2!Z$112,Trucks!$B$49:$B235,0)","v":42},{"$f":"MATCH(Calc2!AA$112,Trucks!$B$49:$B235,0)","v":42},{"$f":"MATCH(Calc2!AB$112,Trucks!$B$49:$B235,0)","v":42}]
[null,null,{"$f":"MATCH(Calc2!C$112,Trucks!$B$49:$B236,0)","v":6},{"$f":"MATCH(Calc2!D$112,Trucks!$B$49:$B236,0)","v":95},{"$f":"MATCH(Calc2!E$112,Trucks!$B$49:$B236,0)","v":103},{"$f":"MATCH(Calc2!F$112,Trucks!$B$49:$B236,0)","v":107},{"$f":"MATCH(Calc2!G$112,Trucks!$B$49:$B236,0)","v":42},{"$f":"MATCH(Calc2!H$112,Trucks!$B$49:$B236,0)","v":42},{"$f":"MATCH(Calc2!I$112,Trucks!$B$49:$B236,0)","v":42},{"$f":"MATCH(Calc2!J$112,Trucks!$B$49:$B236,0)","v":42},{"$f":"MATCH(Calc2!K$112,Trucks!$B$49:$B236,0)","v":42},{"$f":"MATCH(Calc2!L$112,Trucks!$B$49:$B236,0)","v":42},{"$f":"MATCH(Calc2!M$112,Trucks!$B$49:$B236,0)","v":42},{"$f":"MATCH(Calc2!N$112,Trucks!$B$49:$B236,0)","v":42},{"$f":"MATCH(Calc2!O$112,Trucks!$B$49:$B236,0)","v":42},{"$f":"MATCH(Calc2!P$112,Trucks!$B$49:$B236,0)","v":42},{"$f":"MATCH(Calc2!Q$112,Trucks!$B$49:$B236,0)","v":42},{"$f":"MATCH(Calc2!R$112,Trucks!$B$49:$B236,0)","v":42},{"$f":"MATCH(Calc2!S$112,Trucks!$B$49:$B236,0)","v":42},{"$f":"MATCH(Calc2!T$112,Trucks!$B$49:$B236,0)","v":42},{"$f":"MATCH(Calc2!U$112,Trucks!$B$49:$B236,0)","v":42},{"$f":"MATCH(Calc2!V$112,Trucks!$B$49:$B236,0)","v":42},{"$f":"MATCH(Calc2!W$112,Trucks!$B$49:$B236,0)","v":42},{"$f":"MATCH(Calc2!X$112,Trucks!$B$49:$B236,0)","v":42},{"$f":"MATCH(Calc2!Y$112,Trucks!$B$49:$B236,0)","v":42},{"$f":"MATCH(Calc2!Z$112,Trucks!$B$49:$B236,0)","v":42},{"$f":"MATCH(Calc2!AA$112,Trucks!$B$49:$B236,0)","v":42},{"$f":"MATCH(Calc2!AB$112,Trucks!$B$49:$B236,0)","v":42}]
[null,null,{"$f":"MATCH(Calc2!C$112,Trucks!$B$49:$B237,0)","v":6},{"$f":"MATCH(Calc2!D$112,Trucks!$B$49:$B237,0)","v":95},{"$f":"MATCH(Calc2!E$112,Trucks!$B$49:$B237,0)","v":103},{"$f":"MATCH(Calc2!F$112,Trucks!$B$49:$B237,0)","v":107},{"$f":"MATCH(Calc2!G$112,Trucks!$B$49:$B237,0)","v":42},{"$f":"MATCH(Calc2!H$112,Trucks!$B$49:$B237,0)","v":42},{"$f":"MATCH(Calc2!I$112,Trucks!$B$49:$B237,0)","v":42},{"$f":"MATCH(Calc2!J$112,Trucks!$B$49:$B237,0)","v":42},{"$f":"MATCH(Calc2!K$112,Trucks!$B$49:$B237,0)","v":42},{"$f":"MATCH(Calc2!L$112,Trucks!$B$49:$B237,0)","v":42},{"$f":"MATCH(Calc2!M$112,Trucks!$B$49:$B237,0)","v":42},{"$f":"MATCH(Calc2!N$112,Trucks!$B$49:$B237,0)","v":42},{"$f":"MATCH(Calc2!O$112,Trucks!$B$49:$B237,0)","v":42},{"$f":"MATCH(Calc2!P$112,Trucks!$B$49:$B237,0)","v":42},{"$f":"MATCH(Calc2!Q$112,Trucks!$B$49:$B237,0)","v":42},{"$f":"MATCH(Calc2!R$112,Trucks!$B$49:$B237,0)","v":42},{"$f":"MATCH(Calc2!S$112,Trucks!$B$49:$B237,0)","v":42},{"$f":"MATCH(Calc2!T$112,Trucks!$B$49:$B237,0)","v":42},{"$f":"MATCH(Calc2!U$112,Trucks!$B$49:$B237,0)","v":42},{"$f":"MATCH(Calc2!V$112,Trucks!$B$49:$B237,0)","v":42},{"$f":"MATCH(Calc2!W$112,Trucks!$B$49:$B237,0)","v":42},{"$f":"MATCH(Calc2!X$112,Trucks!$B$49:$B237,0)","v":42},{"$f":"MATCH(Calc2!Y$112,Trucks!$B$49:$B237,0)","v":42},{"$f":"MATCH(Calc2!Z$112,Trucks!$B$49:$B237,0)","v":42},{"$f":"MATCH(Calc2!AA$112,Trucks!$B$49:$B237,0)","v":42},{"$f":"MATCH(Calc2!AB$112,Trucks!$B$49:$B237,0)","v":42}]
[null,null,{"$f":"MATCH(Calc2!C$112,Trucks!$B$49:$B238,0)","v":6},{"$f":"MATCH(Calc2!D$112,Trucks!$B$49:$B238,0)","v":95},{"$f":"MATCH(Calc2!E$112,Trucks!$B$49:$B238,0)","v":103},{"$f":"MATCH(Calc2!F$112,Trucks!$B$49:$B238,0)","v":107},{"$f":"MATCH(Calc2!G$112,Trucks!$B$49:$B238,0)","v":42},{"$f":"MATCH(Calc2!H$112,Trucks!$B$49:$B238,0)","v":42},{"$f":"MATCH(Calc2!I$112,Trucks!$B$49:$B238,0)","v":42},{"$f":"MATCH(Calc2!J$112,Trucks!$B$49:$B238,0)","v":42},{"$f":"MATCH(Calc2!K$112,Trucks!$B$49:$B238,0)","v":42},{"$f":"MATCH(Calc2!L$112,Trucks!$B$49:$B238,0)","v":42},{"$f":"MATCH(Calc2!M$112,Trucks!$B$49:$B238,0)","v":42},{"$f":"MATCH(Calc2!N$112,Trucks!$B$49:$B238,0)","v":42},{"$f":"MATCH(Calc2!O$112,Trucks!$B$49:$B238,0)","v":42},{"$f":"MATCH(Calc2!P$112,Trucks!$B$49:$B238,0)","v":42},{"$f":"MATCH(Calc2!Q$112,Trucks!$B$49:$B238,0)","v":42},{"$f":"MATCH(Calc2!R$112,Trucks!$B$49:$B238,0)","v":42},{"$f":"MATCH(Calc2!S$112,Trucks!$B$49:$B238,0)","v":42},{"$f":"MATCH(Calc2!T$112,Trucks!$B$49:$B238,0)","v":42},{"$f":"MATCH(Calc2!U$112,Trucks!$B$49:$B238,0)","v":42},{"$f":"MATCH(Calc2!V$112,Trucks!$B$49:$B238,0)","v":42},{"$f":"MATCH(Calc2!W$112,Trucks!$B$49:$B238,0)","v":42},{"$f":"MATCH(Calc2!X$112,Trucks!$B$49:$B238,0)","v":42},{"$f":"MATCH(Calc2!Y$112,Trucks!$B$49:$B238,0)","v":42},{"$f":"MATCH(Calc2!Z$112,Trucks!$B$49:$B238,0)","v":42},{"$f":"MATCH(Calc2!AA$112,Trucks!$B$49:$B238,0)","v":42},{"$f":"MATCH(Calc2!AB$112,Trucks!$B$49:$B238,0)","v":42}]
[null,null,{"$f":"MATCH(Calc2!C$112,Trucks!$B$49:$B239,0)","v":6},{"$f":"MATCH(Calc2!D$112,Trucks!$B$49:$B239,0)","v":95},{"$f":"MATCH(Calc2!E$112,Trucks!$B$49:$B239,0)","v":103},{"$f":"MATCH(Calc2!F$112,Trucks!$B$49:$B239,0)","v":107},{"$f":"MATCH(Calc2!G$112,Trucks!$B$49:$B239,0)","v":42},{"$f":"MATCH(Calc2!H$112,Trucks!$B$49:$B239,0)","v":42},{"$f":"MATCH(Calc2!I$112,Trucks!$B$49:$B239,0)","v":42},{"$f":"MATCH(Calc2!J$112,Trucks!$B$49:$B239,0)","v":42},{"$f":"MATCH(Calc2!K$112,Trucks!$B$49:$B239,0)","v":42},{"$f":"MATCH(Calc2!L$112,Trucks!$B$49:$B239,0)","v":42},{"$f":"MATCH(Calc2!M$112,Trucks!$B$49:$B239,0)","v":42},{"$f":"MATCH(Calc2!N$112,Trucks!$B$49:$B239,0)","v":42},{"$f":"MATCH(Calc2!O$112,Trucks!$B$49:$B239,0)","v":42},{"$f":"MATCH(Calc2!P$112,Trucks!$B$49:$B239,0)","v":42},{"$f":"MATCH(Calc2!Q$112,Trucks!$B$49:$B239,0)","v":42},{"$f":"MATCH(Calc2!R$112,Trucks!$B$49:$B239,0)","v":42},{"$f":"MATCH(Calc2!S$112,Trucks!$B$49:$B239,0)","v":42},{"$f":"MATCH(Calc2!T$112,Trucks!$B$49:$B239,0)","v":42},{"$f":"MATCH(Calc2!U$112,Trucks!$B$49:$B239,0)","v":42},{"$f":"MATCH(Calc2!V$112,Trucks!$B$49:$B239,0)","v":42},{"$f":"MATCH(Calc2!W$112,Trucks!$B$49:$B239,0)","v":42},{"$f":"MATCH(Calc2!X$112,Trucks!$B$49:$B239,0)","v":42},{"$f":"MATCH(Calc2!Y$112,Trucks!$B$49:$B239,0)","v":42},{"$f":"MATCH(Calc2!Z$112,Trucks!$B$49:$B239,0)","v":42},{"$f":"MATCH(Calc2!AA$112,Trucks!$B$49:$B239,0)","v":42},{"$f":"MATCH(Calc2!AB$112,Trucks!$B$49:$B239,0)","v":42}]
[null,null,{"$f":"MATCH(Calc2!C$112,Trucks!$B$49:$B240,0)","v":6},{"$f":"MATCH(Calc2!D$112,Trucks!$B$49:$B240,0)","v":95},{"$f":"MATCH(Calc2!E$112,Trucks!$B$49:$B240,0)","v":103},{"$f":"MATCH(Calc2!F$112,Trucks!$B$49:$B240,0)","v":107},{"$f":"MATCH(Calc2!G$112,Trucks!$B$49:$B240,0)","v":42},{"$f":"MATCH(Calc2!H$112,Trucks!$B$49:$B240,0)","v":42},{"$f":"MATCH(Calc2!I$112,Trucks!$B$49:$B240,0)","v":42},{"$f":"MATCH(Calc2!J$112,Trucks!$B$49:$B240,0)","v":42},{"$f":"MATCH(Calc2!K$112,Trucks!$B$49:$B240,0)","v":42},{"$f":"MATCH(Calc2!L$112,Trucks!$B$49:$B240,0)","v":42},{"$f":"MATCH(Calc2!M$112,Trucks!$B$49:$B240,0)","v":42},{"$f":"MATCH(Calc2!N$112,Trucks!$B$49:$B240,0)","v":42},{"$f":"MATCH(Calc2!O$112,Trucks!$B$49:$B240,0)","v":42},{"$f":"MATCH(Calc2!P$112,Trucks!$B$49:$B240,0)","v":42},{"$f":"MATCH(Calc2!Q$112,Trucks!$B$49:$B240,0)","v":42},{"$f":"MATCH(Calc2!R$112,Trucks!$B$49:$B240,0)","v":42},{"$f":"MATCH(Calc2!S$112,Trucks!$B$49:$B240,0)","v":42},{"$f":"MATCH(Calc2!T$112,Trucks!$B$49:$B240,0)","v":42},{"$f":"MATCH(Calc2!U$112,Trucks!$B$49:$B240,0)","v":42},{"$f":"MATCH(Calc2!V$112,Trucks!$B$49:$B240,0)","v":42},{"$f":"MATCH(Calc2!W$112,Trucks!$B$49:$B240,0)","v":42},{"$f":"MATCH(Calc2!X$112,Trucks!$B$49:$B240,0)","v":42},{"$f":"MATCH(Calc2!Y$112,Trucks!$B$49:$B240,0)","v":42},{"$f":"MATCH(Calc2!Z$112,Trucks!$B$49:$B240,0)","v":42},{"$f":"MATCH(Calc2!AA$112,Trucks!$B$49:$B240,0)","v":42},{"$f":"MATCH(Calc2!AB$112,Trucks!$B$49:$B240,0)","v":42}]
[null,null,{"$f":"MATCH(Calc2!C$112,Trucks!$B$49:$B241,0)","v":6},{"$f":"MATCH(Calc2!D$112,Trucks!$B$49:$B241,0)","v":95},{"$f":"MATCH(Calc2!E$112,Trucks!$B$49:$B241,0)","v":103},{"$f":"MATCH(Calc2!F$112,Trucks!$B$49:$B241,0)","v":107},{"$f":"MATCH(Calc2!G$112,Trucks!$B$49:$B241,0)","v":42},{"$f":"MATCH(Calc2!H$112,Trucks!$B$49:$B241,0)","v":42},{"$f":"MATCH(Calc2!I$112,Trucks!$B$49:$B241,0)","v":42},{"$f":"MATCH(Calc2!J$112,Trucks!$B$49:$B241,0)","v":42},{"$f":"MATCH(Calc2!K$112,Trucks!$B$49:$B241,0)","v":42},{"$f":"MATCH(Calc2!L$112,Trucks!$B$49:$B241,0)","v":42},{"$f":"MATCH(Calc2!M$112,Trucks!$B$49:$B241,0)","v":42},{"$f":"MATCH(Calc2!N$112,Trucks!$B$49:$B241,0)","v":42},{"$f":"MATCH(Calc2!O$112,Trucks!$B$49:$B241,0)","v":42},{"$f":"MATCH(Calc2!P$112,Trucks!$B$49:$B241,0)","v":42},{"$f":"MATCH(Calc2!Q$112,Trucks!$B$49:$B241,0)","v":42},{"$f":"MATCH(Calc2!R$112,Trucks!$B$49:$B241,0)","v":42},{"$f":"MATCH(Calc2!S$112,Trucks!$B$49:$B241,0)","v":42},{"$f":"MATCH(Calc2!T$112,Trucks!$B$49:$B241,0)","v":42},{"$f":"MATCH(Calc2!U$112,Trucks!$B$49:$B241,0)","v":42},{"$f":"MATCH(Calc2!V$112,Trucks!$B$49:$B241,0)","v":42},{"$f":"MATCH(Calc2!W$112,Trucks!$B$49:$B241,0)","v":42},{"$f":"MATCH(Calc2!X$112,Trucks!$B$49:$B241,0)","v":42},{"$f":"MATCH(Calc2!Y$112,Trucks!$B$49:$B241,0)","v":42},{"$f":"MATCH(Calc2!Z$112,Trucks!$B$49:$B241,0)","v":42},{"$f":"MATCH(Calc2!AA$112,Trucks!$B$49:$B241,0)","v":42},{"$f":"MATCH(Calc2!AB$112,Trucks!$B$49:$B241,0)","v":42}]
[null,null,{"$f":"MATCH(Calc2!C$112,Trucks!$B$49:$B242,0)","v":6},{"$f":"MATCH(Calc2!D$112,Trucks!$B$49:$B242,0)","v":95},{"$f":"MATCH(Calc2!E$112,Trucks!$B$49:$B242,0)","v":103},{"$f":"MATCH(Calc2!F$112,Trucks!$B$49:$B242,0)","v":107},{"$f":"MATCH(Calc2!G$112,Trucks!$B$49:$B242,0)","v":42},{"$f":"MATCH(Calc2!H$112,Trucks!$B$49:$B242,0)","v":42},{"$f":"MATCH(Calc2!I$112,Trucks!$B$49:$B242,0)","v":42},{"$f":"MATCH(Calc2!J$112,Trucks!$B$49:$B242,0)","v":42},{"$f":"MATCH(Calc2!K$112,Trucks!$B$49:$B242,0)","v":42},{"$f":"MATCH(Calc2!L$112,Trucks!$B$49:$B242,0)","v":42},{"$f":"MATCH(Calc2!M$112,Trucks!$B$49:$B242,0)","v":42},{"$f":"MATCH(Calc2!N$112,Trucks!$B$49:$B242,0)","v":42},{"$f":"MATCH(Calc2!O$112,Trucks!$B$49:$B242,0)","v":42},{"$f":"MATCH(Calc2!P$112,Trucks!$B$49:$B242,0)","v":42},{"$f":"MATCH(Calc2!Q$112,Trucks!$B$49:$B242,0)","v":42},{"$f":"MATCH(Calc2!R$112,Trucks!$B$49:$B242,0)","v":42},{"$f":"MATCH(Calc2!S$112,Trucks!$B$49:$B242,0)","v":42},{"$f":"MATCH(Calc2!T$112,Trucks!$B$49:$B242,0)","v":42},{"$f":"MATCH(Calc2!U$112,Trucks!$B$49:$B242,0)","v":42},{"$f":"MATCH(Calc2!V$112,Trucks!$B$49:$B242,0)","v":42},{"$f":"MATCH(Calc2!W$112,Trucks!$B$49:$B242,0)","v":42},{"$f":"MATCH(Calc2!X$112,Trucks!$B$49:$B242,0)","v":42},{"$f":"MATCH(Calc2!Y$112,Trucks!$B$49:$B242,0)","v":42},{"$f":"MATCH(Calc2!Z$112,Trucks!$B$49:$B242,0)","v":42},{"$f":"MATCH(Calc2!AA$112,Trucks!$B$49:$B242,0)","v":42},{"$f":"MATCH(Calc2!AB$112,Trucks!$B$49:$B242,0)","v":42}]
[null,null,{"$f":"MATCH(Calc2!C$112,Trucks!$B$49:$B243,0)","v":6},{"$f":"MATCH(Calc2!D$112,Trucks!$B$49:$B243,0)","v":95},{"$f":"MATCH(Calc2!E$112,Trucks!$B$49:$B243,0)","v":103},{"$f":"MATCH(Calc2!F$112,Trucks!$B$49:$B243,0)","v":107},{"$f":"MATCH(Calc2!G$112,Trucks!$B$49:$B243,0)","v":42},{"$f":"MATCH(Calc2!H$112,Trucks!$B$49:$B243,0)","v":42},{"$f":"MATCH(Calc2!I$112,Trucks!$B$49:$B243,0)","v":42},{"$f":"MATCH(Calc2!J$112,Trucks!$B$49:$B243,0)","v":42},{"$f":"MATCH(Calc2!K$112,Trucks!$B$49:$B243,0)","v":42},{"$f":"MATCH(Calc2!L$112,Trucks!$B$49:$B243,0)","v":42},{"$f":"MATCH(Calc2!M$112,Trucks!$B$49:$B243,0)","v":42},{"$f":"MATCH(Calc2!N$112,Trucks!$B$49:$B243,0)","v":42},{"$f":"MATCH(Calc2!O$112,Trucks!$B$49:$B243,0)","v":42},{"$f":"MATCH(Calc2!P$112,Trucks!$B$49:$B243,0)","v":42},{"$f":"MATCH(Calc2!Q$112,Trucks!$B$49:$B243,0)","v":42},{"$f":"MATCH(Calc2!R$112,Trucks!$B$49:$B243,0)","v":42},{"$f":"MATCH(Calc2!S$112,Trucks!$B$49:$B243,0)","v":42},{"$f":"MATCH(Calc2!T$112,Trucks!$B$49:$B243,0)","v":42},{"$f":"MATCH(Calc2!U$112,Trucks!$B$49:$B243,0)","v":42},{"$f":"MATCH(Calc2!V$112,Trucks!$B$49:$B243,0)","v":42},{"$f":"MATCH(Calc2!W$112,Trucks!$B$49:$B243,0)","v":42},{"$f":"MATCH(Calc2!X$112,Trucks!$B$49:$B243,0)","v":42},{"$f":"MATCH(Calc2!Y$112,Trucks!$B$49:$B243,0)","v":42},{"$f":"MATCH(Calc2!Z$112,Trucks!$B$49:$B243,0)","v":42},{"$f":"MATCH(Calc2!AA$112,Trucks!$B$49:$B243,0)","v":42},{"$f":"MATCH(Calc2!AB$112,Trucks!$B$49:$B243,0)","v":42}]
[null,null,{"$f":"MATCH(Calc2!C$112,Trucks!$B$49:$B244,0)","v":6},{"$f":"MATCH(Calc2!D$112,Trucks!$B$49:$B244,0)","v":95},{"$f":"MATCH(Calc2!E$112,Trucks!$B$49:$B244,0)","v":103},{"$f":"MATCH(Calc2!F$112,Trucks!$B$49:$B244,0)","v":107},{"$f":"MATCH(Calc2!G$112,Trucks!$B$49:$B244,0)","v":42},{"$f":"MATCH(Calc2!H$112,Trucks!$B$49:$B244,0)","v":42},{"$f":"MATCH(Calc2!I$112,Trucks!$B$49:$B244,0)","v":42},{"$f":"MATCH(Calc2!J$112,Trucks!$B$49:$B244,0)","v":42},{"$f":"MATCH(Calc2!K$112,Trucks!$B$49:$B244,0)","v":42},{"$f":"MATCH(Calc2!L$112,Trucks!$B$49:$B244,0)","v":42},{"$f":"MATCH(Calc2!M$112,Trucks!$B$49:$B244,0)","v":42},{"$f":"MATCH(Calc2!N$112,Trucks!$B$49:$B244,0)","v":42},{"$f":"MATCH(Calc2!O$112,Trucks!$B$49:$B244,0)","v":42},{"$f":"MATCH(Calc2!P$112,Trucks!$B$49:$B244,0)","v":42},{"$f":"MATCH(Calc2!Q$112,Trucks!$B$49:$B244,0)","v":42},{"$f":"MATCH(Calc2!R$112,Trucks!$B$49:$B244,0)","v":42},{"$f":"MATCH(Calc2!S$112,Trucks!$B$49:$B244,0)","v":42},{"$f":"MATCH(Calc2!T$112,Trucks!$B$49:$B244,0)","v":42},{"$f":"MATCH(Calc2!U$112,Trucks!$B$49:$B244,0)","v":42},{"$f":"MATCH(Calc2!V$112,Trucks!$B$49:$B244,0)","v":42},{"$f":"MATCH(Calc2!W$112,Trucks!$B$49:$B244,0)","v":42},{"$f":"MATCH(Calc2!X$112,Trucks!$B$49:$B244,0)","v":42},{"$f":"MATCH(Calc2!Y$112,Trucks!$B$49:$B244,0)","v":42},{"$f":"MATCH(Calc2!Z$112,Trucks!$B$49:$B244,0)","v":42},{"$f":"MATCH(Calc2!AA$112,Trucks!$B$49:$B244,0)","v":42},{"$f":"MATCH(Calc2!AB$112,Trucks!$B$49:$B244,0)","v":42}]
[null,null,{"$f":"MATCH(Calc2!C$112,Trucks!$B$49:$B245,0)","v":6},{"$f":"MATCH(Calc2!D$112,Trucks!$B$49:$B245,0)","v":95},{"$f":"MATCH(Calc2!E$112,Trucks!$B$49:$B245,0)","v":103},{"$f":"MATCH(Calc2!F$112,Trucks!$B$49:$B245,0)","v":107},{"$f":"MATCH(Calc2!G$112,Trucks!$B$49:$B245,0)","v":42},{"$f":"MATCH(Calc2!H$112,Trucks!$B$49:$B245,0)","v":42},{"$f":"MATCH(Calc2!I$112,Trucks!$B$49:$B245,0)","v":42},{"$f":"MATCH(Calc2!J$112,Trucks!$B$49:$B245,0)","v":42},{"$f":"MATCH(Calc2!K$112,Trucks!$B$49:$B245,0)","v":42},{"$f":"MATCH(Calc2!L$112,Trucks!$B$49:$B245,0)","v":42},{"$f":"MATCH(Calc2!M$112,Trucks!$B$49:$B245,0)","v":42},{"$f":"MATCH(Calc2!N$112,Trucks!$B$49:$B245,0)","v":42},{"$f":"MATCH(Calc2!O$112,Trucks!$B$49:$B245,0)","v":42},{"$f":"MATCH(Calc2!P$112,Trucks!$B$49:$B245,0)","v":42},{"$f":"MATCH(Calc2!Q$112,Trucks!$B$49:$B245,0)","v":42},{"$f":"MATCH(Calc2!R$112,Trucks!$B$49:$B245,0)","v":42},{"$f":"MATCH(Calc2!S$112,Trucks!$B$49:$B245,0)","v":42},{"$f":"MATCH(Calc2!T$112,Trucks!$B$49:$B245,0)","v":42},{"$f":"MATCH(Calc2!U$112,Trucks!$B$49:$B245,0)","v":42},{"$f":"MATCH(Calc2!V$112,Trucks!$B$49:$B245,0)","v":42},{"$f":"MATCH(Calc2!W$112,Trucks!$B$49:$B245,0)","v":42},{"$f":"MATCH(Calc2!X$112,Trucks!$B$49:$B245,0)","v":42},{"$f":"MATCH(Calc2!Y$112,Trucks!$B$49:$B245,0)","v":42},{"$f":"MATCH(Calc2!Z$112,Trucks!$B$49:$B245,0)","v":42},{"$f":"MATCH(Calc2!AA$112,Trucks!$B$49:$B245,0)","v":42},{"$f":"MATCH(Calc2!AB$112,Trucks!$B$49:$B245,0)","v":42}]
[null,null,{"$f":"MATCH(Calc2!C$112,Trucks!$B$49:$B246,0)","v":6},{"$f":"MATCH(Calc2!D$112,Trucks!$B$49:$B246,0)","v":95},{"$f":"MATCH(Calc2!E$112,Trucks!$B$49:$B246,0)","v":103},{"$f":"MATCH(Calc2!F$112,Trucks!$B$49:$B246,0)","v":107},{"$f":"MATCH(Calc2!G$112,Trucks!$B$49:$B246,0)","v":42},{"$f":"MATCH(Calc2!H$112,Trucks!$B$49:$B246,0)","v":42},{"$f":"MATCH(Calc2!I$112,Trucks!$B$49:$B246,0)","v":42},{"$f":"MATCH(Calc2!J$112,Trucks!$B$49:$B246,0)","v":42},{"$f":"MATCH(Calc2!K$112,Trucks!$B$49:$B246,0)","v":42},{"$f":"MATCH(Calc2!L$112,Trucks!$B$49:$B246,0)","v":42},{"$f":"MATCH(Calc2!M$112,Trucks!$B$49:$B246,0)","v":42},{"$f":"MATCH(Calc2!N$112,Trucks!$B$49:$B246,0)","v":42},{"$f":"MATCH(Calc2!O$112,Trucks!$B$49:$B246,0)","v":42},{"$f":"MATCH(Calc2!P$112,Trucks!$B$49:$B246,0)","v":42},{"$f":"MATCH(Calc2!Q$112,Trucks!$B$49:$B246,0)","v":42},{"$f":"MATCH(Calc2!R$112,Trucks!$B$49:$B246,0)","v":42},{"$f":"MATCH(Calc2!S$112,Trucks!$B$49:$B246,0)","v":42},{"$f":"MATCH(Calc2!T$112,Trucks!$B$49:$B246,0)","v":42},{"$f":"MATCH(Calc2!U$112,Trucks!$B$49:$B246,0)","v":42},{"$f":"MATCH(Calc2!V$112,Trucks!$B$49:$B246,0)","v":42},{"$f":"MATCH(Calc2!W$112,Trucks!$B$49:$B246,0)","v":42},{"$f":"MATCH(Calc2!X$112,Trucks!$B$49:$B246,0)","v":42},{"$f":"MATCH(Calc2!Y$112,Trucks!$B$49:$B246,0)","v":42},{"$f":"MATCH(Calc2!Z$112,Trucks!$B$49:$B246,0)","v":42},{"$f":"MATCH(Calc2!AA$112,Trucks!$B$49:$B246,0)","v":42},{"$f":"MATCH(Calc2!AB$112,Trucks!$B$49:$B246,0)","v":42}]
[null,null,{"$f":"MATCH(Calc2!C$112,Trucks!$B$49:$B247,0)","v":6},{"$f":"MATCH(Calc2!D$112,Trucks!$B$49:$B247,0)","v":95},{"$f":"MATCH(Calc2!E$112,Trucks!$B$49:$B247,0)","v":103},{"$f":"MATCH(Calc2!F$112,Trucks!$B$49:$B247,0)","v":107},{"$f":"MATCH(Calc2!G$112,Trucks!$B$49:$B247,0)","v":42},{"$f":"MATCH(Calc2!H$112,Trucks!$B$49:$B247,0)","v":42},{"$f":"MATCH(Calc2!I$112,Trucks!$B$49:$B247,0)","v":42},{"$f":"MATCH(Calc2!J$112,Trucks!$B$49:$B247,0)","v":42},{"$f":"MATCH(Calc2!K$112,Trucks!$B$49:$B247,0)","v":42},{"$f":"MATCH(Calc2!L$112,Trucks!$B$49:$B247,0)","v":42},{"$f":"MATCH(Calc2!M$112,Trucks!$B$49:$B247,0)","v":42},{"$f":"MATCH(Calc2!N$112,Trucks!$B$49:$B247,0)","v":42},{"$f":"MATCH(Calc2!O$112,Trucks!$B$49:$B247,0)","v":42},{"$f":"MATCH(Calc2!P$112,Trucks!$B$49:$B247,0)","v":42},{"$f":"MATCH(Calc2!Q$112,Trucks!$B$49:$B247,0)","v":42},{"$f":"MATCH(Calc2!R$112,Trucks!$B$49:$B247,0)","v":42},{"$f":"MATCH(Calc2!S$112,Trucks!$B$49:$B247,0)","v":42},{"$f":"MATCH(Calc2!T$112,Trucks!$B$49:$B247,0)","v":42},{"$f":"MATCH(Calc2!U$112,Trucks!$B$49:$B247,0)","v":42},{"$f":"MATCH(Calc2!V$112,Trucks!$B$49:$B247,0)","v":42},{"$f":"MATCH(Calc2!W$112,Trucks!$B$49:$B247,0)","v":42},{"$f":"MATCH(Calc2!X$112,Trucks!$B$49:$B247,0)","v":42},{"$f":"MATCH(Calc2!Y$112,Trucks!$B$49:$B247,0)","v":42},{"$f":"MATCH(Calc2!Z$112,Trucks!$B$49:$B247,0)","v":42},{"$f":"MATCH(Calc2!AA$112,Trucks!$B$49:$B247,0)","v":42},{"$f":"MATCH(Calc2!AB$112,Trucks!$B$49:$B247,0)","v":42}]
[null,null,{"$f":"MATCH(Calc2!C$112,Trucks!$B$49:$B248,0)","v":6},{"$f":"MATCH(Calc2!D$112,Trucks!$B$49:$B248,0)","v":95},{"$f":"MATCH(Calc2!E$112,Trucks!$B$49:$B248,0)","v":103},{"$f":"MATCH(Calc2!F$112,Trucks!$B$49:$B248,0)","v":107},{"$f":"MATCH(Calc2!G$112,Trucks!$B$49:$B248,0)","v":42},{"$f":"MATCH(Calc2!H$112,Trucks!$B$49:$B248,0)","v":42},{"$f":"MATCH(Calc2!I$112,Trucks!$B$49:$B248,0)","v":42},{"$f":"MATCH(Calc2!J$112,Trucks!$B$49:$B248,0)","v":42},{"$f":"MATCH(Calc2!K$112,Trucks!$B$49:$B248,0)","v":42},{"$f":"MATCH(Calc2!L$112,Trucks!$B$49:$B248,0)","v":42},{"$f":"MATCH(Calc2!M$112,Trucks!$B$49:$B248,0)","v":42},{"$f":"MATCH(Calc2!N$112,Trucks!$B$49:$B248,0)","v":42},{"$f":"MATCH(Calc2!O$112,Trucks!$B$49:$B248,0)","v":42},{"$f":"MATCH(Calc2!P$112,Trucks!$B$49:$B248,0)","v":42},{"$f":"MATCH(Calc2!Q$112,Trucks!$B$49:$B248,0)","v":42},{"$f":"MATCH(Calc2!R$112,Trucks!$B$49:$B248,0)","v":42},{"$f":"MATCH(Calc2!S$112,Trucks!$B$49:$B248,0)","v":42},{"$f":"MATCH(Calc2!T$112,Trucks!$B$49:$B248,0)","v":42},{"$f":"MATCH(Calc2!U$112,Trucks!$B$49:$B248,0)","v":42},{"$f":"MATCH(Calc2!V$112,Trucks!$B$49:$B248,0)","v":42},{"$f":"MATCH(Calc2!W$112,Trucks!$B$49:$B248,0)","v":42},{"$f":"MATCH(Calc2!X$112,Trucks!$B$49:$B248,0)","v":42},{"$f":"MATCH(Calc2!Y$112,Trucks!$B$49:$B248,0)","v":42},{"$f":"MATCH(Calc2!Z$112,Trucks!$B$49:$B248,0)","v":42},{"$f":"MATCH(Calc2!AA$112,Trucks!$B$49:$B248,0)","v":42},{"$f":"MATCH(Calc2!AB$112,Trucks!$B$49:$B248,0)","v":42}]
[null,null,{"$f":"MATCH(Calc2!C$112,Trucks!$B$49:$B249,0)","v":6},{"$f":"MATCH(Calc2!D$112,Trucks!$B$49:$B249,0)","v":95},{"$f":"MATCH(Calc2!E$112,Trucks!$B$49:$B249,0)","v":103},{"$f":"MATCH(Calc2!F$112,Trucks!$B$49:$B249,0)","v":107},{"$f":"MATCH(Calc2!G$112,Trucks!$B$49:$B249,0)","v":42},{"$f":"MATCH(Calc2!H$112,Trucks!$B$49:$B249,0)","v":42},{"$f":"MATCH(Calc2!I$112,Trucks!$B$49:$B249,0)","v":42},{"$f":"MATCH(Calc2!J$112,Trucks!$B$49:$B249,0)","v":42},{"$f":"MATCH(Calc2!K$112,Trucks!$B$49:$B249,0)","v":42},{"$f":"MATCH(Calc2!L$112,Trucks!$B$49:$B249,0)","v":42},{"$f":"MATCH(Calc2!M$112,Trucks!$B$49:$B249,0)","v":42},{"$f":"MATCH(Calc2!N$112,Trucks!$B$49:$B249,0)","v":42},{"$f":"MATCH(Calc2!O$112,Trucks!$B$49:$B249,0)","v":42},{"$f":"MATCH(Calc2!P$112,Trucks!$B$49:$B249,0)","v":42},{"$f":"MATCH(Calc2!Q$112,Trucks!$B$49:$B249,0)","v":42},{"$f":"MATCH(Calc2!R$112,Trucks!$B$49:$B249,0)","v":42},{"$f":"MATCH(Calc2!S$112,Trucks!$B$49:$B249,0)","v":42},{"$f":"MATCH(Calc2!T$112,Trucks!$B$49:$B249,0)","v":42},{"$f":"MATCH(Calc2!U$112,Trucks!$B$49:$B249,0)","v":42},{"$f":"MATCH(Calc2!V$112,Trucks!$B$49:$B249,0)","v":42},{"$f":"MATCH(Calc2!W$112,Trucks!$B$49:$B249,0)","v":42},{"$f":"MATCH(Calc2!X$112,Trucks!$B$49:$B249,0)","v":42},{"$f":"MATCH(Calc2!Y$112,Trucks!$B$49:$B249,0)","v":42},{"$f":"MATCH(Calc2!Z$112,Trucks!$B$49:$B249,0)","v":42},{"$f":"MATCH(Calc2!AA$112,Trucks!$B$49:$B249,0)","v":42},{"$f":"MATCH(Calc2!AB$112,Trucks!$B$49:$B249,0)","v":42}]
[null,null,{"$f":"MATCH(Calc2!C$112,Trucks!$B$49:$B250,0)","v":6},{"$f":"MATCH(Calc2!D$112,Trucks!$B$49:$B250,0)","v":95},{"$f":"MATCH(Calc2!E$112,Trucks!$B$49:$B250,0)","v":103},{"$f":"MATCH(Calc2!F$112,Trucks!$B$49:$B250,0)","v":107},{"$f":"MATCH(Calc2!G$112,Trucks!$B$49:$B250,0)","v":42},{"$f":"MATCH(Calc2!H$112,Trucks!$B$49:$B250,0)","v":42},{"$f":"MATCH(Calc2!I$112,Trucks!$B$49:$B250,0)","v":42},{"$f":"MATCH(Calc2!J$112,Trucks!$B$49:$B250,0)","v":42},{"$f":"MATCH(Calc2!K$112,Trucks!$B$49:$B250,0)","v":42},{"$f":"MATCH(Calc2!L$112,Trucks!$B$49:$B250,0)","v":42},{"$f":"MATCH(Calc2!M$112,Trucks!$B$49:$B250,0)","v":42},{"$f":"MATCH(Calc2!N$112,Trucks!$B$49:$B250,0)","v":42},{"$f":"MATCH(Calc2!O$112,Trucks!$B$49:$B250,0)","v":42},{"$f":"MATCH(Calc2!P$112,Trucks!$B$49:$B250,0)","v":42},{"$f":"MATCH(Calc2!Q$112,Trucks!$B$49:$B250,0)","v":42},{"$f":"MATCH(Calc2!R$112,Trucks!$B$49:$B250,0)","v":42},{"$f":"MATCH(Calc2!S$112,Trucks!$B$49:$B250,0)","v":42},{"$f":"MATCH(Calc2!T$112,Trucks!$B$49:$B250,0)","v":42},{"$f":"MATCH(Calc2!U$112,Trucks!$B$49:$B250,0)","v":42},{"$f":"MATCH(Calc2!V$112,Trucks!$B$49:$B250,0)","v":42},{"$f":"MATCH(Calc2!W$112,Trucks!$B$49:$B250,0)","v":42},{"$f":"MATCH(Calc2!X$112,Trucks!$B$49:$B250,0)","v":42},{"$f":"MATCH(Calc2!Y$112,Trucks!$B$49:$B250,0)","v":42},{"$f":"MATCH(Calc2!Z$112,Trucks!$B$49:$B250,0)","v":42},{"$f":"MATCH(Calc2!AA$112,Trucks!$B$49:$B250,0)","v":42},{"$f":"MATCH(Calc2!AB$112,Trucks!$B$49:$B250,0)","v":42}]
[null,null,{"$f":"MATCH(Calc2!C$112,Trucks!$B$49:$B251,0)","v":6},{"$f":"MATCH(Calc2!D$112,Trucks!$B$49:$B251,0)","v":95},{"$f":"MATCH(Calc2!E$112,Trucks!$B$49:$B251,0)","v":103},{"$f":"MATCH(Calc2!F$112,Trucks!$B$49:$B251,0)","v":107},{"$f":"MATCH(Calc2!G$112,Trucks!$B$49:$B251,0)","v":42},{"$f":"MATCH(Calc2!H$112,Trucks!$B$49:$B251,0)","v":42},{"$f":"MATCH(Calc2!I$112,Trucks!$B$49:$B251,0)","v":42},{"$f":"MATCH(Calc2!J$112,Trucks!$B$49:$B251,0)","v":42},{"$f":"MATCH(Calc2!K$112,Trucks!$B$49:$B251,0)","v":42},{"$f":"MATCH(Calc2!L$112,Trucks!$B$49:$B251,0)","v":42},{"$f":"MATCH(Calc2!M$112,Trucks!$B$49:$B251,0)","v":42},{"$f":"MATCH(Calc2!N$112,Trucks!$B$49:$B251,0)","v":42},{"$f":"MATCH(Calc2!O$112,Trucks!$B$49:$B251,0)","v":42},{"$f":"MATCH(Calc2!P$112,Trucks!$B$49:$B251,0)","v":42},{"$f":"MATCH(Calc2!Q$112,Trucks!$B$49:$B251,0)","v":42},{"$f":"MATCH(Calc2!R$112,Trucks!$B$49:$B251,0)","v":42},{"$f":"MATCH(Calc2!S$112,Trucks!$B$49:$B251,0)","v":42},{"$f":"MATCH(Calc2!T$112,Trucks!$B$49:$B251,0)","v":42},{"$f":"MATCH(Calc2!U$112,Trucks!$B$49:$B251,0)","v":42},{"$f":"MATCH(Calc2!V$112,Trucks!$B$49:$B251,0)","v":42},{"$f":"MATCH(Calc2!W$112,Trucks!$B$49:$B251,0)","v":42},{"$f":"MATCH(Calc2!X$112,Trucks!$B$49:$B251,0)","v":42},{"$f":"MATCH(Calc2!Y$112,Trucks!$B$49:$B251,0)","v":42},{"$f":"MATCH(Calc2!Z$112,Trucks!$B$49:$B251,0)","v":42},{"$f":"MATCH(Calc2!AA$112,Trucks!$B$49:$B251,0)","v":42},{"$f":"MATCH(Calc2!AB$112,Trucks!$B$49:$B251,0)","v":42}]
[null,null,{"$f":"MATCH(Calc2!C$112,Trucks!$B$49:$B252,0)","v":6},{"$f":"MATCH(Calc2!D$112,Trucks!$B$49:$B252,0)","v":95},{"$f":"MATCH(Calc2!E$112,Trucks!$B$49:$B252,0)","v":103},{"$f":"MATCH(Calc2!F$112,Trucks!$B$49:$B252,0)","v":107},{"$f":"MATCH(Calc2!G$112,Trucks!$B$49:$B252,0)","v":42},{"$f":"MATCH(Calc2!H$112,Trucks!$B$49:$B252,0)","v":42},{"$f":"MATCH(Calc2!I$112,Trucks!$B$49:$B252,0)","v":42},{"$f":"MATCH(Calc2!J$112,Trucks!$B$49:$B252,0)","v":42},{"$f":"MATCH(Calc2!K$112,Trucks!$B$49:$B252,0)","v":42},{"$f":"MATCH(Calc2!L$112,Trucks!$B$49:$B252,0)","v":42},{"$f":"MATCH(Calc2!M$112,Trucks!$B$49:$B252,0)","v":42},{"$f":"MATCH(Calc2!N$112,Trucks!$B$49:$B252,0)","v":42},{"$f":"MATCH(Calc2!O$112,Trucks!$B$49:$B252,0)","v":42},{"$f":"MATCH(Calc2!P$112,Trucks!$B$49:$B252,0)","v":42},{"$f":"MATCH(Calc2!Q$112,Trucks!$B$49:$B252,0)","v":42},{"$f":"MATCH(Calc2!R$112,Trucks!$B$49:$B252,0)","v":42},{"$f":"MATCH(Calc2!S$112,Trucks!$B$49:$B252,0)","v":42},{"$f":"MATCH(Calc2!T$112,Trucks!$B$49:$B252,0)","v":42},{"$f":"MATCH(Calc2!U$112,Trucks!$B$49:$B252,0)","v":42},{"$f":"MATCH(Calc2!V$112,Trucks!$B$49:$B252,0)","v":42},{"$f":"MATCH(Calc2!W$112,Trucks!$B$49:$B252,0)","v":42},{"$f":"MATCH(Calc2!X$112,Trucks!$B$49:$B252,0)","v":42},{"$f":"MATCH(Calc2!Y$112,Trucks!$B$49:$B252,0)","v":42},{"$f":"MATCH(Calc2!Z$112,Trucks!$B$49:$B252,0)","v":42},{"$f":"MATCH(Calc2!AA$112,Trucks!$B$49:$B252,0)","v":42},{"$f":"MATCH(Calc2!AB$112,Trucks!$B$49:$B252,0)","v":42}]
[null,null,{"$f":"MATCH(Calc2!C$112,Trucks!$B$49:$B253,0)","v":6},{"$f":"MATCH(Calc2!D$112,Trucks!$B$49:$B253,0)","v":95},{"$f":"MATCH(Calc2!E$112,Trucks!$B$49:$B253,0)","v":103},{"$f":"MATCH(Calc2!F$112,Trucks!$B$49:$B253,0)","v":107},{"$f":"MATCH(Calc2!G$112,Trucks!$B$49:$B253,0)","v":42},{"$f":"MATCH(Calc2!H$112,Trucks!$B$49:$B253,0)","v":42},{"$f":"MATCH(Calc2!I$112,Trucks!$B$49:$B253,0)","v":42},{"$f":"MATCH(Calc2!J$112,Trucks!$B$49:$B253,0)","v":42},{"$f":"MATCH(Calc2!K$112,Trucks!$B$49:$B253,0)","v":42},{"$f":"MATCH(Calc2!L$112,Trucks!$B$49:$B253,0)","v":42},{"$f":"MATCH(Calc2!M$112,Trucks!$B$49:$B253,0)","v":42},{"$f":"MATCH(Calc2!N$112,Trucks!$B$49:$B253,0)","v":42},{"$f":"MATCH(Calc2!O$112,Trucks!$B$49:$B253,0)","v":42},{"$f":"MATCH(Calc2!P$112,Trucks!$B$49:$B253,0)","v":42},{"$f":"MATCH(Calc2!Q$112,Trucks!$B$49:$B253,0)","v":42},{"$f":"MATCH(Calc2!R$112,Trucks!$B$49:$B253,0)","v":42},{"$f":"MATCH(Calc2!S$112,Trucks!$B$49:$B253,0)","v":42},{"$f":"MATCH(Calc2!T$112,Trucks!$B$49:$B253,0)","v":42},{"$f":"MATCH(Calc2!U$112,Trucks!$B$49:$B253,0)","v":42},{"$f":"MATCH(Calc2!V$112,Trucks!$B$49:$B253,0)","v":42},{"$f":"MATCH(Calc2!W$112,Trucks!$B$49:$B253,0)","v":42},{"$f":"MATCH(Calc2!X$112,Trucks!$B$49:$B253,0)","v":42},{"$f":"MATCH(Calc2!Y$112,Trucks!$B$49:$B253,0)","v":42},{"$f":"MATCH(Calc2!Z$112,Trucks!$B$49:$B253,0)","v":42},{"$f":"MATCH(Calc2!AA$112,Trucks!$B$49:$B253,0)","v":42},{"$f":"MATCH(Calc2!AB$112,Trucks!$B$49:$B253,0)","v":42}]
[]
[]
[null,"Phase Current ± 10% (A)",{"$f":"IF(Calc2!$C$17=24,VLOOKUP(Inputs!F63,Sheet1!H6:K14,3,FALSE),IF(Calc2!$C$17=48,VLOOKUP(Inputs!F63,Sheet1!H15:K24,3,FALSE),IF(Calc2!$C$17=80,VLOOKUP(Inputs!F63,Sheet1!H25:K33,3,FALSE),\"\")))","v":""}]
[null,"Max Input Power (kVA)",{"$f":"IF(Calc2!$C$17=24,VLOOKUP(Inputs!F63,Sheet1!H6:K14,4,FALSE),IF(Calc2!$C$17=48,VLOOKUP(Inputs!F63,Sheet1!H15:K24,4,FALSE),IF(Calc2!$C$17=80,VLOOKUP(Inputs!F63,Sheet1!H25:K33,4,FALSE),\"\")))","v":""}]
[]
[]
[null,"Battery Degrogation","Over 5 years","Nominal Av ov 5 yrs"]
[null,"LA",0.15,3.2000000000000001E-2]
[null,"LIB",0.1,2.0899999999999998E-2]
[]
[null,"Depreciation","Over 5 years","Nominal Av ov 5 yrs"]
[null,"LA Battery/chrger",0.9,0.36899999999999999]
[null,"LIB Battery/charger",0.8,0.27500000000000002]

{"sheet":"Sheet1","index":6,"n_rows":36,"n_cols":20,"rows_kept":36,"cut":false,"hidden":true,"merged":[[1,1,37,1],[1,2,4,2],[1,9,3,9],[1,10,3,10],[36,2,36,19],[37,2,37,19],[1,12,2,16],[1,17,2,18],[1,19,3,19],[3,3,3,5],[4,3,4,5]]}
[]
[null,"IP 54 MODELS","Type","Output",null,null,null,null,null,"Phase Current","Max Input Power","Input Protection","Housing Dimensions",null,null,null,null,"Mandatory Space",null,"Weight"]
[null,null,null,null,null,null,null,null,null,null,null,"Breaker Curve [D]"]
[null,null,null,"U Range",null,null,null,"I max","Pout max",null,null,"Input Fuse gG Type","L","W","H","D","E","M","S"]
[null,null,null,"V",null,null,"V","A","kW","A (±10%)","kVA","Rated AMP (1)","mm","mm","mm","mm","mm","mm","mm","kg"]
[null,null,"HE Li-Ion 0-A M*",6,null,33,24,60,"1,7",8.3000000000000007,2,15,171,111,420,425,70,null,100,5]
[null,null,"HE Li-Ion 1-A M IP54* ",6,"-",33,24,100,"2,9",13.7,3.2,25,410,234,716,582,243,150,150,26]
[null,null,"HE Li-Ion 1-B M IP54* ",18,"-",70,24,70,"3,2",15.1,3.5,40,410,234,716,582,243,150,150,26]
[null,null,"HE Li-Ion 1-B2 M IP54* ",18,"-",70,24,140,"5,8",30,7,25,410,234,716,582,243,150,150,46]
[null,null,"HE Li-Ion 3-A 24 T IP54*",6,"-",33,24,150,"4,3",7.2,5,10,410,234,716,582,243,150,150,42]
[null,null,"HE Li-Ion 12/24-200 T IP54 ",6,"-",33,24,200,"5,8",9.4,6.5,15,487,555,1001,582,243,150,150,165]
[null,null,"HE Li-Ion 12/24-250 T IP54 ",6,"-",33,24,250,"7,2",11.8,8.1999999999999993,20,487,555,1001,"-","-",150,460,185]
[null,null,"HE Li-Ion 12/24-320 T IP54 ",6,"-",33,24,320,"9,2",15.1,10.4,25,811,503,1801,"-","-",150,460,365]
[null,null,"HE Li-Ion 12/24-500 T IP54 ",6,"-",33,24,500,"14,4",23.6,16.3,40,811,503,1801,"-","-",150,460,400]
[null,null,"HE Li-Ion 0-B M*",30,null,70,48,40,"1,7",8.3000000000000007,2,15,171,111,420,425,70,null,100,5]
[null,null,"HE Li-Ion 1-B M IP54* ",18,"-",70,24,70,"3,2",15.1,3.5,40,410,234,716,582,243,150,150,26]
[null,null,"HE Li-Ion 1-B2 M IP54* ",18,"-",70,48,140,"5,8",30,7,25,410,234,716,582,243,150,150,46]
[null,null,"HE Li-Ion 3-S T IP54* ",18,"-",70,48,100,"5,8",9.6,6.7,15,410,234,716,582,243,150,150,44]
[null,null,"HE Li-Ion 3-A T IP54* ",18,"-",70,48,150,"8,6",14.4,10,20,410,234,716,582,243,150,150,44]
[null,null,"HE Li-Ion 12/48-200 T IP54 ",6,"-",70,48,200,"11,5",18.7,12.9,25,811,503,1801,"-","-",150,460,360]
[null,null,"HE Li-Ion 12/48-250 T IP54 ",6,"-",70,48,250,"14,4",23.3,16.100000000000001,40,811,503,1801,"-","-",150,460,380]
[null,null,"HE Li-Ion 12/48-320 T IP54 ",6,"-",70,48,320,"18,4",29.9,20.7,40,811,503,1801,"-","-",150,460,425]
[null,null,"HE Li-Ion 12/48-500 T IP54 ",6,"-",70,48,500,"28,8",46.7,32.299999999999997,70,1626,503,1801,"-","-",150,460,760]
[null,null,"HE Li-Ion 12/48-600 T IP54 ",6,"-",70,48,600,"34,6",56,38.799999999999997,80,1626,503,1801,"-","-",150,460,790]
[null,null,"HE Li-Ion 1-C M IP54* ",60,"-",130,80,35,"2,9",13.7,3.2,25,410,234,716,582,243,150,150,26]
[null,null,"HE Li-Ion 1-C2 M IP54* ",60,"-",130,80,70,"5,8",30,7,40,410,234,716,582,243,150,150,46]
[null,null,"HE Li-Ion 3-B T IP54* ",60,"-",130,80,90,"7,7",12.8,8.9,20,410,234,716,582,243,150,150,44]
[null,null,"HE Li-Ion 12/80-120 T IP54 ",6,"-",130,80,120,"11,5",18.5,12.8,25,487,555,1001,"-","-",150,460,190]
[null,null,"HE Li-Ion 12/80-160 T IP54 ",6,"-",130,80,160,"15,4",24.6,17,40,811,503,1801,"-","-",150,460,365]
[null,null,"HE Li-Ion 12/80-200 T IP54 ",6,"-",130,80,200,"19,2",30.8,21.3,50,811,503,1801,"-","-",150,460,440]
[null,null,"HE Li-Ion 12/80-250 T IP54 ",6,"-",130,80,250,24,38.5,26.6,60,811,503,1801,"-","-",150,460,455]
[null,null,"HE Li-Ion 12/80-320 T IP54 ",6,"-",130,80,320,"30,7",49.2,34.1,70,811,503,1801,"-","-",150,460,460]
[null,null,"HE Li-Ion 12/80-500 T IP54 ",6,"-",130,80,500,48,76.900000000000006,53.2,110,1626,503,1801,"-","-",150,460,930]
[null,null,"HE Li-Ion 12/120-100 T IP54 ",6,"-",150,120,100,"11,5",23.1,16,40,811,503,1801,"-","-",150,460,365]
[null,null,"HE Li-Ion 12/120-150 T IP54 ",6,"-",150,120,150,"17,3",34.6,24,55,811,503,1801,"-","-",150,460,440]
[null,null,"HE Li-Ion 12/120-200 T IP54 ",6,"-",150,120,200,23,46.2,32,70,811,503,1801,"-","-",150,460,455]

{"sheet":"Sheet2","index":7,"n_rows":0,"n_cols":0,"rows_kept":0,"cut":false,"hidden":true,"merged":[]}