{"text_format":"1","workbook":"xlsx","n_sheets":8,"sheets":["Inputs","Output","Trucks","Variables","Calc1","Calc2","Sheet1","Sheet2"],"not_rendered":{"charts":3,"images":2,"macros":1,"external_links":2,"defined_names":1,"comments":0,"pivot_tables":0},"unopened":[],"bounds":{"document_bytes":16777216,"sheet_cells":100000,"rows_first":2000,"rows_last":500,"rows_between":2000,"halvings":0,"cell_chars":16384,"cell_head_chars":4096},"cells_cut":0,"cells_raw":0,"read":"whole","date_system":"1900"}

{"sheet":"Inputs","index":0,"n_rows":172,"n_cols":14,"rows_kept":172,"cut":false,"hidden":false,"merged":[[140,3,140,5],[179,2,190,7],[59,1,59,14],[1,1,1,14],[5,1,5,14],[37,10,40,13],[161,1,161,10],[138,1,138,10],[9,7,10,7],[128,1,128,10],[116,1,116,10],[95,1,95,10],[12,1,12,14],[91,3,93,5],[152,4,152,6],[28,9,29,13],[150,2,150,7],[0,2,0,11],[42,1,42,14],[164,10,164,12],[166,10,167,10],[166,11,167,11],[166,12,167,12],[163,10,163,12],[142,3,142,5],[142,7,142,9],[143,7,143,9],[152,2,152,3],[77,1,87,10],[35,9,35,13],[61,9,65,13],[155,2,155,7],[158,1,158,9]]}
[null,null,"\nFor Internal Use Only – Not for Distribution\n\nDo not use if training has not been received or the tutorial available in the Download Section of the Lithium-ion Sales Tool has not been seen, as improper use could lead to miscalculation.\n\nTo be used in combination with Lithium-ion Application Sheet available in the Download Section of the Lithium-ion Sales Tool.\n"]
[null,"Lithium-ion Battery Calculator Tool"]
[]
[null,null,null,null,null,null,null,null,null,null,null,null,null,"English"]
[]
[null,"Truck"]
[]
[null,null,null,null,"Truck Category","Select"]
[]
[null,null,null,null,"Truck Model","Select"]
[]
[]
[null,"Application and Daily Schedule"]
[]
[null,null,null,null,"Start Time","00:00:00",null,"select"]
[]
[null,null,null,"Break 1",null,"Break 2",null,"Break 3",null,"Break 4",null,"Break 5",null,"Break 6"]
[null,null,"Break Start Time","00:30:00",null,"No Break",null,"No Break",null,"No Break",null,"No Break",null,"No Break"]
[null,null,"Break Duration (mins)",0,null,0,null,0,null,0,null,0,null,0]
[]
{"$rows_left_out":153}
{"sheet":"Output","index":1,"n_rows":101,"n_cols":7,"rows_kept":101,"cut":false,"hidden":false,"merged":[[93,1,93,5],[100,1,114,6],[0,5,10,5],[0,6,10,6],[57,1,57,6],[68,1,68,6],[78,1,78,6],[44,1,44,6],[80,3,80,5],[27,1,27,2]]}
[{"$f":"\"Lithium-ion Battery Calculator Tool Output Page \"&TEXT(TODAY(),\"dd-mmm-yy\")","v":"Lithium-ion Battery Calculator Tool Output Page 17-Sep-19"},null,null,null,null,{"$f":"IF(Calc1!Q57=\"EXCEEDED\",\"Warning: the combination of shift pattern and Li-ion battery chosen does not allow for opportunity charging of Li-ion battery. Please reselect break pattern options\",\"\")","v":{"$error":"#VALUE!"}},{"$f":"IF(Calc1!$O$56=1,\"Warning: Chosen end Time is before end of final break period. Please check the shift pattern\",\"\")","v":""}]
[null,"Truck type",null,{"$f":"Inputs!F10","v":"Select"}]
[null,{"$f":"Inputs!E15","v":"Start Time"},null,{"$f":"Inputs!F15","v":"00:00:00"}]
[null,"End Time",null,{"$f":"Inputs!F29","v":"01:00:00"}]
[null,"Operating time per day (hh:mm)",null,{"$f":"Calc1!N57","v":"01:00:00"}]
[null,"Idle time (hh:mm)",null,{"$f":"Inputs!F35/100*Output!D5","v":"00:00:00"}]
[null,"Number of breaks per day",null,{"$f":"(Calc1!D11)","v":1}]
[null,"Break time during shift per day (hh:mm)",null,{"$f":"(Calc1!D10)/24","v":"00:00:00"}]
[null,{"$f":"Inputs!E39","v":"Operator hourly rate (€)"},null,{"$f":"Calc2!C33","v":30}]
[null,{"$f":"Inputs!E40","v":"Electricity cost (€/kWh)"},null,{"$f":"Calc2!C35","v":0.12}]
[]
[null,"Energy",null,"Lead Acid",null,"Lithium-ion"]
[null,"Voltage (V)",null,{"$f":"Calc1!D14","v":"Select"},null,{"$f":"Calc1!G14","v":"Select"}]
[null,"Capacity (Ah)",null,{"$f":"Inputs!F45","v":"Select"},null,{"$f":"Inputs!F62","v":"Select"}]
[null,"Charger Phase Current ± 10% (A)",null,null,null,{"$f":"Calc2!C306","v":""}]
[null,"Charger Max Input Power (kVA)",null,null,null,{"$f":"Calc2!C307","v":""}]
[null,{"$f":"Calc1!C19","v":"Charge rate (kWh/hour)"},null,"n/a",null,{"$f":"Calc1!G19","v":{"$error":"#VALUE!"}}]
[null,"Useable energy per battery (kWh)",null,{"$f":"Calc1!D23","v":{"$error":"#VALUE!"}},null,{"$f":"Calc1!G23","v":{"$error":"#VALUE!"}}]
[]
[null,"Used energy per day (kWh)",null,{"$f":"Calc1!D27","v":0},null,{"$f":"Calc1!G27","v":0}]
{"$rows_left_out":82}
{"sheet":"Trucks","index":2,"n_rows":187,"n_cols":16,"rows_kept":187,"cut":false,"hidden":true,"merged":[[7,1,7,2],[51,3,51,6],[139,4,139,6]]}
[]
[]
[null,null,null,"only amend with improved figures"]
[null,null,null,"can add rows/columns as described"]
[]
[]
[null,null,"Truck, Battery and Application combinations"]
[]
[null,null,null,"Add each truck names and Lead batteries that are available for each truck. "]
[null,"Table 1: Truck and Lead batteries",null,"Keep the blank grey rows to a minimum or the truck names on the user interface will include blank spaces. "]
[null,null,null,"Order the truck names logically - the truck names will appear in the user interface in the same order as they appear in this table . "]
[null,null,"Truck Model                                       (write exactly as you wish the names to appear to the user) - write each truck model only once","Voltage (V)                      (keep similar voltages in the same section","VDI","Recommended idle time (%)","Available Pb batteries (Ah)",null,null,null,null,null,null,null,"to insert new Pb battery columns to the tool, insert to the left of this column"]
[null,"Select","Select","Select",null,null,"Select",null,null,null,null,null,null,null,null,"do not delete row"]
[null,"WH Pedestrian","P1.6-1.8",24,"0,384",30,150,210,250]
[null,"WH Pedestrian","P2.0",24,"0,384",30,150,210,250,315,375]
[null,"WH Pedestrian","LO2.0-2.0S",24,"1,13",35,465]
[null,"WH Pedestrian","LO2.5",24,"1,13",35,620]
[null,"WH Pedestrian","LO5.0T",24,"1,82",35,465,620]
[null,"WH Pedestrian","LO7.0T",24,"1,82",35,465,620]
[null,"WH Pedestrian","P2.0S",24,"0,47",30,210,250,300,400,500]
{"$rows_left_out":168}
{"sheet":"Variables","index":3,"n_rows":88,"n_cols":9,"rows_kept":88,"cut":false,"hidden":true,"merged":[]}
[]
[]
[null,null,null,"only amend with improved figures"]
[null,null,null,"DO NOT AMEND"]
[]
[]
[null,null,null,"Application"]
[]
[null,"Hourly rate driver (EUR)","default","lowest allowed","greatest allowed"]
[null,null,30,2,100]
[]
[null,"Cost electricity ","Default"]
[null,"(€/kWh)",0.12]
[]
[null,"Weeks per year",48]
[]
[null,"CO2 production per energy from grid (kg/kWh)",0.54030800000000001,"As per standard EN 16796.  - is German reference and based on the mix of the German different electricity generation systems."]
[null,null,null,"note - Department for Business, Energy & Industrial Strategy (UK) uses 0.34885kg/kWh at 2017. Midac use 0.33kg/kWh"]
[null,null,null,"Lead acid "]
[]
{"$rows_left_out":69}
{"sheet":"Calc1","index":4,"n_rows":126,"n_cols":39,"rows_kept":126,"cut":false,"hidden":true,"merged":[[85,7,101,7],[10,31,10,35],[11,1,11,7],[45,1,45,7],[14,18,14,20],[14,22,14,24],[14,25,14,27],[11,34,11,35]]}
[]
[]
[]
[]
[]
[null,null,"Operating hours per annum (decimal)",{"$f":"(Calc1!D9*Inputs!F31*Variables!C15)","v":{"$error":"#VALUE!"}}]
[null,null,"Estimated idle time %",{"$f":"(1-Inputs!F33/(Calc1!D9*Inputs!F31*Variables!C15))","v":{"$error":"#VALUE!"}}]
[null,null,"Charging time per day",{"$f":"N58","v":"23:00:00"}]
[null,null,"Operating hours per day (decimal)",{"$f":"N57*24","v":1}]
[null,null,"Break Hours per day (decimal)",{"$f":"N59*24","v":0},null,null,null,null,null,null,"LI-ion Energy useage based on shift patterns"]
[null,null,"Number of breaks ",{"$f":"COUNT(L19,L21,L23,L25,L27,L29,L31,L33,L35,L37,L39,L41,L43,L45,L47,L49,L51,L53)","v":1},null,null,null,null,null,null,null,null,null,null,null,null,null,null,null,null,null,null,null,null,null,null,null,null,null,null,null,"Graph"]
[null,"Battery and charger",null,null,null,null,null,null,null,null,null,"Availiable Capacity (kWh)",{"$f":"G22","v":{"$error":"#VALUE!"}},null,null,null,null,"battery balancing time SOC threshold  (%)",{"$f":"Variables!C77","v":80},null,null,null,null,null,null,null,null,null,null,null,null,"Period end","SOC (kWh)","SOC (%)","DOD line"]
[null,null,null,"Lead Acid",null,null,"lithium ion",null,null,null,null,"consumption rate (kWh/h)",{"$f":"D26","v":0},null,null,null,null,"battery balancing time SOC threshold (kWh))",{"$f":"S12/100*M12","v":{"$error":"#VALUE!"}},null,{"$f":"Variables!C78","v":20},"added mins for balancing",null,null,null,null,null,null,null,null,null,{"$f":"AA17","v":"00:00:00"},{"$f":"AB17","v":{"$error":"#VALUE!"}},{"$f":"AG13/$M$12","v":{"$error":"#VALUE!"}},null,null,null,null,1]
[null,null,"Voltage",{"$f":"VLOOKUP(Inputs!F10,Trucks!C13:D49,2,FALSE)","v":"Select"},null,null,{"$f":"VLOOKUP(D14,Trucks!B173:C180,2,FALSE)","v":"Select"},null,null,null,null,"charge rate (kWh/h)",{"$f":"G19","v":{"$error":"#VALUE!"}},null,null,null,null,"Charge rate during balancing (kWh/h)",{"$f":"(M12-S13)/(((M12-S13)/M14)+U13/60)","v":{"$error":"#VALUE!"}},null,null,null,null,null,null,null,null,null,null,null,"discharge",{"$f":"AA18","v":"00:30:00"},{"$f":"AB18","v":{"$error":"#VALUE!"}},{"$f":"AG14/$M$12","v":{"$error":"#VALUE!"}},{"$f":"AF13","v":"00:00:00"},{"$f":"Q59","v":0},null,null,0.89276960784313431]
[null,null,"Battery Capacity (Ah)",{"$f":"Inputs!F45","v":"Select"},null,null,{"$f":"Inputs!F62","v":"Select"},null,null,null,null,null,null,null,null,null,null,null,null,null,null,null,null,null,null,null,null,null,null,null,null,{"$f":"T19","v":{"$error":"#VALUE!"}},{"$f":"U19","v":{"$error":"#VALUE!"}},{"$f":"AG15/$M$12","v":{"$error":"#VALUE!"}},{"$f":"AF89","v":"01:00:00"},{"$f":"AJ14","v":0},null,null,0.89276960784313431]
[null,null,"Charger (A)",null,null,null,{"$f":"Inputs!F63","v":"Select"},null,null,null,"charge/discharge","start time","end time","duration ","[for Warning] check end time after finish time (1=warning)","Consumption (kWh) for total per day","[For warning] Max DOD been exceeded? (Yes=1)","[logic for table] is end SOC < threshold?","start","end","SOC","[logic for table] will it go over 100%?","start","end","SOC","start","end","SOC",null,null,null,{"$f":"X19","v":{"$error":"#VALUE!"}},{"$f":"Y19","v":{"$error":"#VALUE!"}},{"$f":"AG16/$M$12","v":{"$error":"#VALUE!"}},null,null,null,null,0.99999999999999944]
[null,null,"Cells",{"$f":"D14/2","v":{"$error":"#VALUE!"}},null,null,null,null,null,null,null,null,null,null,null,null,null,null,null,null,null,null,null,null,null,null,{"$f":"Inputs!F15","v":"00:00:00"},{"$f":"M12","v":{"$error":"#VALUE!"}},null,null,null,{"$f":"AA19","v":"00:30:00"},{"$f":"AB19","v":{"$error":"#VALUE!"}},{"$f":"AG17/$M$12","v":{"$error":"#VALUE!"}},null,null,null,null,0.99999999999999944]
[null,null,"Hours to Charge",null,null,null,{"$f":"Inputs!F62/Inputs!F63","v":{"$error":"#VALUE!"}},null,null,null,"discharge",{"$f":"Inputs!F15","v":"00:00:00"},{"$f":"IF(L19=\"No Break\",L20,L19)","v":"00:30:00"},{"$f":"M18-L18","v":"00:30:00"},null,{"$f":"N18*24*$M$13","v":0},{"$f":"IF(AB18<$Q$59*$M$12,1,0)","v":{"$error":"#VALUE!"}},null,{"$f":"Inputs!F15","v":"00:00:00"},null,null,null,null,null,null,null,{"$f":"M18","v":"00:30:00"},{"$f":"AB17-(AA18-S18)*24*$M$13","v":{"$error":"#VALUE!"}},null,null,"discharge",{"$f":"AA20","v":"01:00:00"},{"$f":"AB20","v":{"$error":"#VALUE!"}},{"$f":"AG18/$M$12","v":{"$error":"#VALUE!"}},null,null,null,null,0.69618055555555503]
[null,null,"Charge rate (kWh/hour)",null,"n/a for this tool",null,{"$f":"G21/G18","v":{"$error":"#VALUE!"}},null,null,null,"charge 1",{"$f":"IF(Inputs!D18=0,\"No Break\",Inputs!D18)","v":"00:30:00"},{"$f":"IF(L19=\"No Break\",\"No Break\",L19+N19)","v":"00:30:00"},{"$f":"Inputs!D19/60/24","v":"00:00:00"},{"$f":"IF(M19=\"No Break\",IF(O17=1,1,0),IF(Calc1!M19>Calc1!M20,1,\"\"))","v":""},null,null,{"$f":"IF(S19=\"No break\",\"\",IF((AA19-S19)*24*$M$14+AB18<$S$13,1,\"\"))","v":{"$error":"#VALUE!"}},{"$f":"L19","v":"00:30:00"},{"$f":"IF(AND(AB18<$S$13,R19=1),AA19,IF(AB18<$S$13,S19+($S$13-AB18)/$M$14/24,S19))","v":{"$error":"#VALUE!"}},{"$f":"IF(AND(AB18<$S$13,R19=1),AB18+(T19-S19)*24*$M$14,IF(AB18<=$S$13,$S$13,AB18))","v":{"$error":"#VALUE!"}},{"$f":"IF(L19=\"No Break\",\"\",IF((AA19-W19)*24*$S$14+U19>$M$12,1,\"\"))","v":{"$error":"#VALUE!"}},{"$f":"T19","v":{"$error":"#VALUE!"}},{"$f":"IF(R19=1,W19,IF(V19=1,W19+($M$12-U19)/$S$14/24,AA19))","v":{"$error":"#VALUE!"}},{"$f":"IF(R19=1,U19,U19+(X19-W19)*24*$S$14)","v":{"$error":"#VALUE!"}},{"$f":"X19","v":{"$error":"#VALUE!"}},{"$f":"IF(L19=\"No Break\",Z19,L19+N19)","v":"00:30:00"},{"$f":"Y19","v":{"$error":"#VALUE!"}},null,null,null,{"$f":"T21","v":"01:00:00"},{"$f":"U21","v":{"$error":"#VALUE!"}},{"$error":"#VALUE!"},null,null,null,null,0.8]
[null,null,null,null,null,null,null,null,null,null,"discharge",{"$f":"IF(OR(L19=\"No Break\",L19=0),M20,M19)","v":"00:30:00"},{"$f":"IF(L21=\"No Break\",L22,L21)","v":"01:00:00"},{"$f":"IF(M20-L20<0,0,M20-L20)","v":"00:30:00"},null,{"$f":"N20*24*$M$13","v":0},{"$f":"IF(AB20<$Q$59*$M$12,1,0)","v":{"$error":"#VALUE!"}},null,{"$f":"L20","v":"00:30:00"},null,null,null,null,null,null,null,{"$f":"IF(OR(L21=\"No Break\",L21=0), S22,S21)","v":"01:00:00"},{"$f":"AB19-(AA20-S20)*24*$M$13","v":{"$error":"#VALUE!"}},null,null,null,{"$f":"X21","v":"01:00:00"},{"$f":"Y21","v":{"$error":"#VALUE!"}},{"$error":"#VALUE!"},null,null,null,null,0.93134383530482179]
{"$rows_left_out":107}
{"sheet":"Calc2","index":5,"n_rows":316,"n_cols":101,"rows_kept":316,"cut":false,"hidden":true,"merged":[]}
[]
[]
[null,null,null,"only amend with improved figures"]
[null,null,null,"DO NOT AMEND"]
[]
[]
[null,"DO NOT AMEND - used in calculations"]
[]
[]
[]
[]
[]
[1,2,3,4,5,6,7,8,9,10,11,12,13,14,15,16,17,18,19,20,21,22,23,24,25,26,27,28,29,30,31,32,33,34,35,36,37,38,39,40,41,42,43,44,45,46,47,48,49,50,51,52,53,54,55,56,57,58,59,60,61,62,63,64,65,66,67,68,69,70,71,72,73,74,75,76,77,78,79,80,81,82,83,84,85,86,87,88,89,90,91,92,93,94,95,96,97,98,99,100,101]
[]
[null,"Application"]
[]
[null,"Voltage of truck",{"$f":"VLOOKUP(Inputs!$F$10,Trucks!C12:D49,2,FALSE)","v":"Select"}]
[]
[null,"RecommendedVDI",{"$f":"VLOOKUP(Inputs!F10,Trucks!C12:K50,3,FALSE)","v":0}]
[]
{"$rows_left_out":297}
{"sheet":"Sheet1","index":6,"n_rows":36,"n_cols":20,"rows_kept":36,"cut":false,"hidden":true,"merged":[[1,1,37,1],[1,2,4,2],[1,9,3,9],[1,10,3,10],[36,2,36,19],[37,2,37,19],[1,12,2,16],[1,17,2,18],[1,19,3,19],[3,3,3,5],[4,3,4,5]]}
[]
[null,"IP 54 MODELS","Type","Output",null,null,null,null,null,"Phase Current","Max Input Power","Input Protection","Housing Dimensions",null,null,null,null,"Mandatory Space",null,"Weight"]
[null,null,null,null,null,null,null,null,null,null,null,"Breaker Curve [D]"]
[null,null,null,"U Range",null,null,null,"I max","Pout max",null,null,"Input Fuse gG Type","L","W","H","D","E","M","S"]
[null,null,null,"V",null,null,"V","A","kW","A (±10%)","kVA","Rated AMP (1)","mm","mm","mm","mm","mm","mm","mm","kg"]
[null,null,"HE Li-Ion 0-A M*",6,null,33,24,60,"1,7",8.3000000000000007,2,15,171,111,420,425,70,null,100,5]
[null,null,"HE Li-Ion 1-A M IP54* ",6,"-",33,24,100,"2,9",13.7,3.2,25,410,234,716,582,243,150,150,26]
[null,null,"HE Li-Ion 1-B M IP54* ",18,"-",70,24,70,"3,2",15.1,3.5,40,410,234,716,582,243,150,150,26]
[null,null,"HE Li-Ion 1-B2 M IP54* ",18,"-",70,24,140,"5,8",30,7,25,410,234,716,582,243,150,150,46]
[null,null,"HE Li-Ion 3-A 24 T IP54*",6,"-",33,24,150,"4,3",7.2,5,10,410,234,716,582,243,150,150,42]
[null,null,"HE Li-Ion 12/24-200 T IP54 ",6,"-",33,24,200,"5,8",9.4,6.5,15,487,555,1001,582,243,150,150,165]
[null,null,"HE Li-Ion 12/24-250 T IP54 ",6,"-",33,24,250,"7,2",11.8,8.1999999999999993,20,487,555,1001,"-","-",150,460,185]
[null,null,"HE Li-Ion 12/24-320 T IP54 ",6,"-",33,24,320,"9,2",15.1,10.4,25,811,503,1801,"-","-",150,460,365]
[null,null,"HE Li-Ion 12/24-500 T IP54 ",6,"-",33,24,500,"14,4",23.6,16.3,40,811,503,1801,"-","-",150,460,400]
[null,null,"HE Li-Ion 0-B M*",30,null,70,48,40,"1,7",8.3000000000000007,2,15,171,111,420,425,70,null,100,5]
[null,null,"HE Li-Ion 1-B M IP54* ",18,"-",70,24,70,"3,2",15.1,3.5,40,410,234,716,582,243,150,150,26]
[null,null,"HE Li-Ion 1-B2 M IP54* ",18,"-",70,48,140,"5,8",30,7,25,410,234,716,582,243,150,150,46]
[null,null,"HE Li-Ion 3-S T IP54* ",18,"-",70,48,100,"5,8",9.6,6.7,15,410,234,716,582,243,150,150,44]
[null,null,"HE Li-Ion 3-A T IP54* ",18,"-",70,48,150,"8,6",14.4,10,20,410,234,716,582,243,150,150,44]
[null,null,"HE Li-Ion 12/48-200 T IP54 ",6,"-",70,48,200,"11,5",18.7,12.9,25,811,503,1801,"-","-",150,460,360]
{"$rows_left_out":17}
{"sheet":"Sheet2","index":7,"n_rows":0,"n_cols":0,"rows_kept":0,"cut":false,"hidden":true,"merged":[]}